{"text_format":"3","workbook":"xlsx","n_sheets":23,"sheets":["Liste","Conversions","Conso","LISEZ-MOI","Recueil_consentement","Onglet_Contrôle","Page de garde","Id_CR_SF","Sommaire","CRPP NON SOUMIS EQUIL","CRPP SOUMIS EQUILIBRE","CRP_SF","Synthèse_CRP","EPRD synthétique","CAF_détaillée","TFP","CRP_PGFP","CRP_PGFP_SF","PGFP","Bilan Financier","Ratios_financiers","Tableau_Rcc","Tab_Eng. hors bilan"],"not_rendered":{"images":16,"macros":1,"defined_names":2623,"comments":4},"read":"whole","date_system":"1900"}

{"sheet":"Liste","index":0,"n_rows":43,"n_cols":6,"rows_kept":43,"hidden":true}
["statut","oui_non","categorie","convention collective","Categorie_Id_CR_SF","Convention collective"]
[]
["Etablissement Public","Oui","AJA",null,"Accueil de jour adossé","29 - Convention collective nationale des établissements privés d'hospitalisation, de soins, de cure et de garde à but non lucratif (FEHAP, convention de 1951)"]
["Etat & Col.Territ.","Non","BAPU",null,"Budget commercial ESAT","405 - Convention collective nationale des établissements médico-sociaux de l'union intersyndicale des secteurs sanitaires et sociaux (UNISSS, FFESCPE, convention de 1965, enfants, adolescents)"]
["Org. Privé Commer.",null,"CAFS",null,"DNA","413 - Convention collective nationale de travail des établissements et services pour personnes inadaptées et handicapées (convention de 1966, SNAPEI)"]
["Org.Privé non Lucr.",null,"CAMSP",null,"SIC","783 - Convention collective des centres d'hébergement et de réadaptation sociale et dans les services d'accueil, d'orientation et d'insertion pour adultes (CHRS, SOP)"]
[null,null,"CMPP",null,"Autres","1001 - Convention collective nationale du 1 mars 1979 des médecins spécialistes qualifiés au regard du conseil de l'ordre travaillant dans les établissements et services pour personnes inadaptées et handicapées"]
[null,null,"CPO",null,null,"1031 - Convention collective nationale de la fédération nationale des associations familiales rurales (FNAFR)"]
[null,null,"CR",null,null,"1261 - Convention collective nationale des acteurs du lien social et familial : centres sociaux et socioculturels, associations d'accueil de jeunes enfants, associations de développement social local (SNAECSO)"]
[null,null,"CRP",null,null,"1565 - Convention collective des services de soins infirmiers à domicile pour personnes âgées de la Guadeloupe"]
[null,null,"EAM",null,null,"2046 - Convention collective nationale du personnel non médical des centres de lutte contre le cancer"]
[null,null,"EANM",null,null,"2941 - Convention collective de la branche de l'aide, de l'accompagnement, des soins et des services à domicile"]
[null,null,"EATAH","Autre",null,"5502 - Convention d'entreprise Croix Rouge"]
[null,null,"EATEH",null,null,"5524 - Convention d'entreprise France terre d'asile"]
[null,null,"EEAH",null,null,"Annexe du 10 décembre 2002 à la convention collective du 18 avril 2002"]
[null,null,"EEAP",null,null,"Statut public"]
[null,null,"EEEH",null,null,"Autre"]
[null,null,"EEPA"]
[null,null,"EHPA perc crédit AM"]
[null,null,"EHPA sans crédit AM"]
[null,null,"EHPAD"]
[null,null,"ESAT"]
[null,null,"FAM"]
[null,null,"Foyer de vie A.H."]
[null,null,"Foyer Heb.Enf.Ado.H."]
[null,null,"Foyer Héberg.A.H."]
[null,null,"IDA"]
[null,null,"IDV"]
[null,null,"IEM"]
[null,null,"IESPESA"]
[null,null,"IME"]
[null,null,"ITEP"]
[null,null,"JES"]
[null,null,"MAS"]
[null,null,"Résidence autonomie"]
[null,null,"SAAD"]
[null,null,"SAMSAH"]
[null,null,"SAVS"]
[null,null,"SESSAD"]
[null,null,"SPASAD"]
[null,null,"SSIAD"]
[null,null,"UEROS"]
[null,null,"Autre"]

{"sheet":"Conversions","index":1,"n_rows":2,"n_cols":2,"rows_kept":2,"hidden":true}
["Date d'effet du contrat pluriannuel d'objectifs et de moyens :",{"$f":"'Page de garde'!D22","v":0}]
["Date de génération du fichier ",{"$f":"'Page de garde'!$A$4","v":0}]

{"sheet":"Conso","index":2,"n_rows":1293,"n_cols":3,"rows_kept":1293,"hidden":true,"merged":[[566,0,567,0],[703,0,704,0],[839,0,840,0],[975,0,976,0],[1111,0,1112,0],[1247,0,1248,0]]}
[null,null,"Conso"]
[null,"EPRD synthétique","CHARGES"]
["Groupe I : charges afférentes à l'exploitation courante",{"$f":"SUM(C3:IV3)","v":{"v":0,"d":"0.00 €"}},{"$f":"'CRPP NON SOUMIS EQUIL'!$F$34+'CRPP SOUMIS EQUILIBRE'!$F$34+CRP_SF!$F$34","v":{"v":0,"d":"0.00 €"}}]
["Groupe II : charges afférentes au personnel",{"$f":"SUM(C4:IV4)","v":{"v":0,"d":"0.00 €"}},{"$f":"'CRPP NON SOUMIS EQUIL'!$F$51+'CRPP SOUMIS EQUILIBRE'!$F$51+CRP_SF!$F$51","v":{"v":0,"d":"0.00 €"}}]
["Groupe III : charges afférentes à la structure",{"v":0,"d":"0.00 €"},{"$f":"'CRPP NON SOUMIS EQUIL'!$F$106+'CRPP SOUMIS EQUILIBRE'!$F$108+CRP_SF!$F$106","v":{"v":0,"d":"0.00 €"}}]
["TOTAL DES CHARGES",{"v":0,"d":"0.00 €"},{"$f":"SUM(C3:C5)","v":{"v":0,"d":"0.00 €"}}]
["RESULTAT COMPTABLE PREVISIONNEL EXCEDENTAIRE (1)",{"v":0,"d":"0.00 €"},{"$f":"IF(C50<C6,0,C50-C6)","v":{"v":0,"d":"0.00 €"}}]
["TOTAL EQUILIBRE DU COMPTE DE RESULTAT PREVISIONNEL",{"v":0,"d":"0.00 €"},{"$f":"C7+C6","v":{"v":0,"d":"0.00 €"}}]
[null,0]
["TABLEAU DE PASSAGE DU RESULTAT PREVISIONNEL A LA CAF PREVISIONNELLE",0]
[null,0]
["RESULTAT COMPTABLE PREVISIONNEL (EXCEDENT)",{"v":0,"d":"0.00 €"},{"$f":"C7","v":{"v":0,"d":"0.00 €"}}]
["Valeur comptable des immobilisations incorporelles et corporelles cédées",{"v":0,"d":"0.00 €"},{"$f":"'CRPP NON SOUMIS EQUIL'!$F$70+'CRPP NON SOUMIS EQUIL'!$F$83+'CRPP SOUMIS EQUILIBRE'!$F$72+'CRPP SOUMIS EQUILIBRE'!$F$85+CRP_SF!$F$70+CRP_SF!$F$83","v":{"v":0,"d":"0.00 €"}}]
["Dotations aux amortissements, aux dépréciations et aux provisions",{"v":0,"d":"0.00 €"},{"$f":"'CRPP NON SOUMIS EQUIL'!$F$87+'CRPP NON SOUMIS EQUIL'!$F$88+'CRPP NON SOUMIS EQUIL'!$F$89+'CRPP NON SOUMIS EQUIL'!$F$90+'CRPP NON SOUMIS EQUIL'!$F$91+'CRPP NON SOUMIS EQUIL'!$F$92+'CRPP NON SOUMIS EQUIL'!$F$98+'CRPP NON SOUMIS EQUIL'!$F$93+'CRPP NON SOUMIS EQUIL'!$F$94+'CRPP NON SOUMIS EQUIL'!$F$95+'CRPP NON SOUMIS EQUIL'!$F$96+'CRPP NON SOUMIS EQUIL'!$F$97+'CRPP NON SOUMIS EQUIL'!$F$99+'CRPP NON SOUMIS EQUIL'!$F$100+SUM('CRPP SOUMIS EQUILIBRE'!$F$89:$F$102)+CRP_SF!$F$87+CRP_SF!$F$88+CRP_SF!$F$89+CRP_SF!$F$90+CRP_SF!$F$91+CRP_SF!$F$92+CRP_SF!$F$98+CRP_SF!$F$93+CRP_SF!$F$94+CRP_SF!$F$95+CRP_SF!$F$96+CRP_SF!$F$97+CRP_SF!$F$99+CRP_SF!$F$100","v":{"v":0,"d":"0.00 €"}}]
["Reports en fonds dédiés (ESSMS privés)",{"v":0,"d":"0.00 €"},{"$f":"'CRPP NON SOUMIS EQUIL'!$F$101+'CRPP NON SOUMIS EQUIL'!$F$102+'CRPP NON SOUMIS EQUIL'!$F$103+'CRPP NON SOUMIS EQUIL'!$F$104+'CRPP SOUMIS EQUILIBRE'!$F$103+'CRPP SOUMIS EQUILIBRE'!$F$104+'CRPP SOUMIS EQUILIBRE'!$F$105+'CRPP SOUMIS EQUILIBRE'!$F$106+CRP_SF!$F$101+CRP_SF!$F$102+CRP_SF!$F$103+CRP_SF!$F$104","v":{"v":0,"d":"0.00 €"}}]
[null,{"v":0,"d":"0.00 €"}]
["SOUS-TOTAL 1",{"v":0,"d":"0.00 €"},{"$f":"SUM(C12:C16)","v":{"v":0,"d":"0.00 €"}}]
["CAPACITE D'AUTOFINANCEMENT (si 1-2>0)",{"v":0,"d":"0.00 €"},{"$f":"IF(C17<C61,0,-(C61-C17))","v":{"v":0,"d":"0.00 €"}}]
["Taux de CAF en pourcentage des produits",{"v":0,"d":"0%"},{"$f":"IF(C50=0,0,C18/C50)","v":{"v":0,"d":"0%"}}]
[null,{"v":0,"d":"0 €"}]
["TABLEAU DE FINANCEMENT PREVISIONNEL",{"v":0,"d":"0 €"}]
[null,{"v":0,"d":"0 €"}]
["INSUFFISANCE D'AUTOFINANCEMENT PREVISIONNELLE",{"v":0,"d":"0.00 €"},{"$f":"C62","v":{"v":0,"d":"0.00 €"}}]
["Remboursement des dettes financières",{"v":0,"d":"0.00 €"}]
["Immobilisations",{"v":0,"d":"0.00 €"}]
["Autres emplois",{"v":0,"d":"0.00 €"}]
["TOTAL DES EMPLOIS",{"v":0,"d":"0.00 €"},{"$f":"SUM(C23:C26)","v":{"v":0,"d":"0.00 €"}}]
["APPORT AU FONDS DE ROULEMENT",{"v":0,"d":"0.00 €"},{"$f":"IF(C27>C71,0,C71-C27)","v":{"v":0,"d":"0.00 €"}}]
["TOTAL EQUILIBRE DU TABLEAU DE FINANCEMENT ",{"v":0,"d":"0.00 €"},{"$f":"SUM(C27:C28)","v":{"v":0,"d":"0.00 €"}}]
[null,0]
["FONDS DE ROULEMENT NET GLOBAL PREVISIONNEL (FRNG)",0]
[null,0]
["FRNG estimé au 1er janvier",{"v":0,"d":"0.00 €"}]
["Variation du fonds de roulement : Apport ou (Prélèvement)",{"v":0,"d":"0.00 €"},{"$f":"C28-C72","v":{"v":0,"d":"0.00 €"}}]
["FRNG prévisionnel au 31 décembre",{"v":0,"d":"0.00 €"},{"$f":"C33+C34","v":{"v":0,"d":"0.00 €"}}]
[null,0]
["BESOIN EN FONDS DE ROULEMENT  (BFR) PREVISIONNEL (2)",0]
[null,0]
["BFR estimé au 1er janvier ",{"v":0,"d":"0.00 €"},{"$f":"'Bilan Financier'!$G$53-'Bilan Financier'!$M$53","v":{"v":0,"d":"0.00 €"}}]
["Variation des postes de valeur d'exploitation (+) sur l'exercice N",{"v":0,"d":"0.00 €"}]
["Variation des postes de dettes d'exploitation (-) sur l'exercice ",{"v":0,"d":"0.00 €"}]
["BFR (ou EFE signe \"-\") prévisionnel au 31 décembre",{"v":0,"d":"0.00 €"},{"$f":"SUM(C39:C41)","v":{"v":0,"d":"0.00 €"}}]
[null,0]
["Variation prévisionnelle de trésorerie de la période",{"v":0,"d":"0.00 €"},{"$f":"C34+C40+C41","v":{"v":0,"d":"0.00 €"}}]
[null,0]
[null,{"v":0,"d":"0 €"},"PRODUITS"]
["Groupe I : produits de la tarification",{"v":0,"d":"0.00 €"},{"$f":"'CRPP NON SOUMIS EQUIL'!$F$131+'CRPP SOUMIS EQUILIBRE'!$F$129+CRP_SF!$F$131","v":{"v":0,"d":"0.00 €"}}]
["Groupe II : autres produits relatifs à l'exploitation",{"v":0,"d":"0.00 €"},{"$f":"'CRPP NON SOUMIS EQUIL'!$F$158+'CRPP SOUMIS EQUILIBRE'!$F$155+CRP_SF!$F$158","v":{"v":0,"d":"0.00 €"}}]
["Groupe III : produits financiers, produits exceptionnels et produits non encaissables",{"v":0,"d":"0.00 €"},{"$f":"'CRPP NON SOUMIS EQUIL'!$F$192+'CRPP SOUMIS EQUILIBRE'!$F$188+CRP_SF!$F$192","v":{"v":0,"d":"0.00 €"}}]
["TOTAL DES PRODUITS",{"v":0,"d":"0.00 €"},{"$f":"SUM(C47:C49)","v":{"v":0,"d":"0.00 €"}}]
["RESULTAT COMPTABLE PREVISIONNEL DEFICITAIRE (1)",{"v":0,"d":"0.00 €"},{"$f":"IF(C50>C6,0,C6-C50)","v":{"v":0,"d":"0.00 €"}}]
["TOTAL EQUILIBRE DU COMPTE DE RESULTAT PREVISIONNEL",{"v":0,"d":"0.00 €"},{"$f":"C51+C50","v":{"v":0,"d":"0.00 €"}}]
[null,0]
[null,0]
[null,0]
["RESULTAT COMPTABLE PREVISIONNEL (DEFICIT) (1)",{"v":0,"d":"0.00 €"},{"$f":"C51","v":{"v":0,"d":"0.00 €"}}]
["Produits des cessions d'immobilisations incorporelles et corporelles",{"v":0,"d":"0.00 €"},{"$f":"'CRPP NON SOUMIS EQUIL'!$F$146+'CRPP NON SOUMIS EQUIL'!$F$169+'CRPP SOUMIS EQUILIBRE'!$F$143+'CRPP SOUMIS EQUILIBRE'!$F$165+CRP_SF!$F$146+CRP_SF!$F$169","v":{"v":0,"d":"0.00 €"}}]
["Quote-part des subventions d'investissement virée au résultat",{"v":0,"d":"0.00 €"},{"$f":"'CRPP NON SOUMIS EQUIL'!$F$144+'CRPP NON SOUMIS EQUIL'!$F$170+'CRPP NON SOUMIS EQUIL'!$F$172+'CRPP SOUMIS EQUILIBRE'!$F$141+'CRPP SOUMIS EQUILIBRE'!$F$166+'CRPP SOUMIS EQUILIBRE'!$F$168+CRP_SF!$F$170+CRP_SF!$F$144+CRP_SF!$F$172","v":{"v":0,"d":"0.00 €"}}]
["Reprise sur amortissements, dépréciations et provisions",{"v":0,"d":"0.00 €"},{"$f":"'CRPP NON SOUMIS EQUIL'!$F$175+'CRPP NON SOUMIS EQUIL'!$F$176+'CRPP NON SOUMIS EQUIL'!$F$177+'CRPP NON SOUMIS EQUIL'!$F$178+'CRPP NON SOUMIS EQUIL'!$F$179+'CRPP NON SOUMIS EQUIL'!$F$184+'CRPP NON SOUMIS EQUIL'!$F$180+'CRPP NON SOUMIS EQUIL'!$F$181+'CRPP NON SOUMIS EQUIL'!$F$182+'CRPP NON SOUMIS EQUIL'!$F$183+'CRPP NON SOUMIS EQUIL'!$F$185+SUM('CRPP SOUMIS EQUILIBRE'!$F$171:$F$181)+CRP_SF!$F$175+CRP_SF!$F$176+CRP_SF!$F$177+CRP_SF!$F$178+CRP_SF!$F$179+CRP_SF!$F$184+CRP_SF!$F$180+CRP_SF!$F$181+CRP_SF!$F$182+CRP_SF!$F$183+CRP_SF!$F$185","v":{"v":0,"d":"0.00 €"}}]
["Utilisation de fonds dédiés et de fonds reportés (ESSMS privés)",{"v":0,"d":"0.00 €"},{"$f":"'CRPP NON SOUMIS EQUIL'!$F$186+'CRPP NON SOUMIS EQUIL'!$F$187+'CRPP NON SOUMIS EQUIL'!$F$188+'CRPP NON SOUMIS EQUIL'!$F$189+'CRPP SOUMIS EQUILIBRE'!$F$182+'CRPP SOUMIS EQUILIBRE'!$F$183+'CRPP SOUMIS EQUILIBRE'!$F$184+'CRPP SOUMIS EQUILIBRE'!$F$185+CRP_SF!$F$186+CRP_SF!$F$187+CRP_SF!$F$188+CRP_SF!$F$189","v":{"v":0,"d":"0.00 €"}}]
["SOUS-TOTAL 2",{"v":0,"d":"0.00 €"},{"$f":"SUM(C56:C60)","v":{"v":0,"d":"0.00 €"}}]
["INSUFFISANCE D'AUTOFINANCEMENT (si 1-2<0)",{"v":0,"d":"0.00 €"},{"$f":"IF(C61<C17,0,-(C17-C61))","v":{"v":0,"d":"0.00 €"}}]
[null,{"v":0,"d":"0 €"}]
[null,{"v":0,"d":"0 €"}]
[null,{"v":0,"d":"0 €"}]
[null,{"v":0,"d":"0 €"}]
["CAPACITE D'AUTOFINANCEMENT PREVISIONNELLE",{"v":0,"d":"0.00 €"},{"$f":"C18","v":{"v":0,"d":"0.00 €"}}]
["Emprunts",{"$f":"SUM(C68:IV68)","v":{"v":0,"d":"0.00 €"}}]
["Dotations et subventions",{"v":0,"d":"0.00 €"}]
["Autres ressources (dont produits des cessions d'éléments d'actif)",{"v":0,"d":"0.00 €"}]
["TOTAL DES RESSOURCES",{"v":0,"d":"0.00 €"},{"$f":"SUM(C67:C70)","v":{"v":0,"d":"0.00 €"}}]
["PRELEVEMENT SUR LE FONDS DE ROULEMENT",{"v":0,"d":"0.00 €"},{"$f":"IF(C71>C27,0,C27-C71)","v":{"v":0,"d":"0.00 €"}}]
["TOTAL EQUILIBRE DU TABLEAU DE FINANCEMENT ",{"v":0,"d":"0.00 €"},{"$f":"SUM(C71:C72)","v":{"v":0,"d":"0.00 €"}}]
[]
["CAF"]
[null,{"$f":"SUM(C76:IV76)","v":{"v":0,"d":"0.00 €"}}]
[null,{"v":0,"d":"0.00 €"},{"$f":"SUM(C78:C87)","v":{"v":0,"d":"0.00 €"}}]
["+ Valeur comptable des immobilisations incorporelles et corporelles cédées",{"v":0,"d":"0.00 €"},{"$f":"'CRPP NON SOUMIS EQUIL'!$F$70+'CRPP NON SOUMIS EQUIL'!$F$83+'CRPP SOUMIS EQUILIBRE'!$F$72+'CRPP SOUMIS EQUILIBRE'!$F$85+CRP_SF!$F$70+CRP_SF!$F$83","v":{"v":0,"d":"0.00 €"}}]
["+ Dotations aux amortissements des immobilisations incorporelles et corporelles",{"v":0,"d":"0.00 €"},{"$f":"'CRPP NON SOUMIS EQUIL'!$F$87+'CRPP SOUMIS EQUILIBRE'!$F$89+CRP_SF!$F$87","v":{"v":0,"d":"0.00 €"}}]
["+ Dotations aux provisions pour renouvellement des immobilisations et dotations aux amortissements dérogatoires",{"v":0,"d":"0.00 €"},{"$f":"'CRPP NON SOUMIS EQUIL'!$F$94+'CRPP NON SOUMIS EQUIL'!$F$96+'CRPP SOUMIS EQUILIBRE'!$F$96+'CRPP SOUMIS EQUILIBRE'!$F$98+CRP_SF!$F$94+CRP_SF!$F$96","v":{"v":0,"d":"0.00 €"}}]
["+ Autres dotations aux amortissements, dépréciations et provisions impactant le FRI",{"v":0,"d":"0.00 €"},{"$f":"'CRPP NON SOUMIS EQUIL'!$F$88+'CRPP NON SOUMIS EQUIL'!$F$90+'CRPP NON SOUMIS EQUIL'!$F$93+'CRPP NON SOUMIS EQUIL'!$F$97+'CRPP NON SOUMIS EQUIL'!$F$98+'CRPP SOUMIS EQUILIBRE'!$F$90+'CRPP SOUMIS EQUILIBRE'!$F$92+'CRPP SOUMIS EQUILIBRE'!$F$95+'CRPP SOUMIS EQUILIBRE'!$F$99+'CRPP SOUMIS EQUILIBRE'!$F$100+CRP_SF!$F$88+CRP_SF!$F$90+CRP_SF!$F$93+CRP_SF!$F$97+CRP_SF!$F$98","v":{"v":0,"d":"0.00 €"}}]
["+ Reports en fonds dédiés à l'investissement sur concours publics des entités gestionnaires d'ESSMS (ESSMS privés)",{"v":0,"d":"0.00 €"},{"$f":"'CRPP NON SOUMIS EQUIL'!$F$102+'CRPP SOUMIS EQUILIBRE'!$F$104+CRP_SF!$F$102","v":{"v":0,"d":"0.00 €"}}]
["+ Dotations aux provisions pour risques et charges d'exploitation",{"v":0,"d":"0.00 €"},{"$f":"'CRPP NON SOUMIS EQUIL'!$F$89+'CRPP SOUMIS EQUILIBRE'!$F$91+CRP_SF!$F$89","v":{"v":0,"d":"0.00 €"}}]
["+ dotations aux provisions de couverture du BFR",{"v":0,"d":"0.00 €"},{"$f":"'CRPP NON SOUMIS EQUIL'!$F$95+'CRPP SOUMIS EQUILIBRE'!$F$97+CRP_SF!$F$95","v":{"v":0,"d":"0.00 €"}}]
["+ Dotations aux dépréciations des actifs circulants: créances, stocks et en-cours",{"v":0,"d":"0.00 €"},{"$f":"'CRPP NON SOUMIS EQUIL'!$F$91+'CRPP SOUMIS EQUILIBRE'!$F$93+CRP_SF!$F$91","v":{"v":0,"d":"0.00 €"}}]
["+ Autres dotations aux amortissements, dépréciations et provisions",{"v":0,"d":"0.00 €"},{"$f":"'CRPP NON SOUMIS EQUIL'!$F$92+'CRPP NON SOUMIS EQUIL'!$F$99+'CRPP NON SOUMIS EQUIL'!$F$100+'CRPP SOUMIS EQUILIBRE'!$F$94+'CRPP SOUMIS EQUILIBRE'!$F$101+'CRPP SOUMIS EQUILIBRE'!$F$102+CRP_SF!$F$92+CRP_SF!$F$99+CRP_SF!$F$100","v":{"v":0,"d":"0.00 €"}}]
["+ Reports en fonds dédiés (ESSMS privés), sauf c/68921",{"v":0,"d":"0.00 €"},{"$f":"'CRPP NON SOUMIS EQUIL'!$F$101+'CRPP NON SOUMIS EQUIL'!$F$103+'CRPP NON SOUMIS EQUIL'!$F$104+'CRPP SOUMIS EQUILIBRE'!$F$103+'CRPP SOUMIS EQUILIBRE'!$F$105+'CRPP SOUMIS EQUILIBRE'!$F$106+CRP_SF!$F$101+CRP_SF!$F$103+CRP_SF!$F$104","v":{"v":0,"d":"0.00 €"}}]
[null,{"v":0,"d":"0.00 €"},{"$f":"SUM(C89:C99)","v":{"v":0,"d":"0.00 €"}}]
["- Produits des cessions d'immobilisations incorporelles et corporelles cédées",{"v":0,"d":"0.00 €"},{"$f":"'CRPP NON SOUMIS EQUIL'!$F$146+'CRPP NON SOUMIS EQUIL'!$F$169+'CRPP SOUMIS EQUILIBRE'!$F$143+'CRPP SOUMIS EQUILIBRE'!$F$165+CRP_SF!$F$146+CRP_SF!$F$169","v":{"v":0,"d":"0.00 €"}}]
["- Quote-part des subventions d'investissement virée au résultat de l'exercice",{"v":0,"d":"0.00 €"},{"$f":"'CRPP NON SOUMIS EQUIL'!$F$144+'CRPP NON SOUMIS EQUIL'!$F$170+'CRPP SOUMIS EQUILIBRE'!$F$141+'CRPP SOUMIS EQUILIBRE'!$F$166+CRP_SF!$F$144+CRP_SF!$F$170","v":{"v":0,"d":"0.00 €"}}]
["- Reprises sur provisions pour renouvellement des immobilisations et reprises sur amortissements dérogatoires",{"v":0,"d":"0.00 €"},{"$f":"'CRPP NON SOUMIS EQUIL'!$F$182+'CRPP NON SOUMIS EQUIL'!$F$180+'CRPP SOUMIS EQUILIBRE'!$F$176+'CRPP SOUMIS EQUILIBRE'!$F$178+CRP_SF!$F$182+CRP_SF!$F$180","v":{"v":0,"d":"0.00 €"}}]
["- Autres reprises sur amortissements, dépréciations et provisions impactant le FRI",{"v":0,"d":"0.00 €"},{"$f":"'CRPP NON SOUMIS EQUIL'!$F$175+'CRPP NON SOUMIS EQUIL'!$F$177+'CRPP NON SOUMIS EQUIL'!$F$183+'CRPP NON SOUMIS EQUIL'!$F$184+'CRPP SOUMIS EQUILIBRE'!$F$171+'CRPP SOUMIS EQUILIBRE'!$F$173+'CRPP SOUMIS EQUILIBRE'!$F$179+'CRPP SOUMIS EQUILIBRE'!$F$180+CRP_SF!$F$175+CRP_SF!$F$177+CRP_SF!$F$183+CRP_SF!$F$184","v":{"v":0,"d":"0.00 €"}}]
["- Quote-part d'éléments du fonds associatif virée au compte de résultat (ESSMS privés uniquement)",{"$f":"SUM(C93:IV93)","v":{"v":0,"d":"0.00 €"}},{"$f":"'CRPP NON SOUMIS EQUIL'!$F$172+'CRPP SOUMIS EQUILIBRE'!$F$168+CRP_SF!$F$172","v":{"v":0,"d":"0.00 €"}}]
["- Utilisation des fonds dédiés à l'investissement sur concours publics des entités gestionnaires d'ESSMS (ESSMS privés)",{"v":0,"d":"0.00 €"},{"$f":"'CRPP NON SOUMIS EQUIL'!$F$187+'CRPP SOUMIS EQUILIBRE'!$F$183+CRP_SF!$F$187","v":{"v":0,"d":"0.00 €"}}]
["- Reprises sur provisions pour risques et charges d'exploitation",{"$f":"SUM(C95:IV95)","v":{"v":0,"d":"0.00 €"}},{"$f":"'CRPP NON SOUMIS EQUIL'!$F$176+'CRPP SOUMIS EQUILIBRE'!$F$172+CRP_SF!$F$176","v":{"v":0,"d":"0.00 €"}}]
["- Reprises sur provisions de couverture du BFR",{"v":0,"d":"0.00 €"},{"$f":"'CRPP NON SOUMIS EQUIL'!$F$181+'CRPP SOUMIS EQUILIBRE'!$F$177+CRP_SF!$F$181","v":{"v":0,"d":"0.00 €"}}]
["- Reprises sur dépréciations des actifs circulants: créances, stocks et en-cours",{"v":0,"d":"0.00 €"},{"$f":"'CRPP NON SOUMIS EQUIL'!$F$178+'CRPP SOUMIS EQUILIBRE'!$F$174+CRP_SF!$F$178","v":{"v":0,"d":"0.00 €"}}]
["- Autres reprises sur dépréciations et provisions",{"v":0,"d":"0.00 €"},{"$f":"'CRPP NON SOUMIS EQUIL'!$F$179+'CRPP NON SOUMIS EQUIL'!$F$185+'CRPP SOUMIS EQUILIBRE'!$F$175+'CRPP SOUMIS EQUILIBRE'!$F$181+CRP_SF!$F$179+CRP_SF!$F$185","v":{"v":0,"d":"0.00 €"}}]
["- Utilisations de fonds reportés et de fonds dédiés (ESSMS privés), sauf c/78921",{"v":0,"d":"0.00 €"},{"$f":"'CRPP NON SOUMIS EQUIL'!$F$186+'CRPP NON SOUMIS EQUIL'!$F$188+'CRPP NON SOUMIS EQUIL'!$F$189+'CRPP SOUMIS EQUILIBRE'!$F$182+'CRPP SOUMIS EQUILIBRE'!$F$184+'CRPP SOUMIS EQUILIBRE'!$F$185+CRP_SF!$F$186+CRP_SF!$F$188+CRP_SF!$F$189","v":{"v":0,"d":"0.00 €"}}]
[null,{"v":0,"d":"0.00 €"},{"$f":"C76+C77-C88","v":{"v":0,"d":"0.00 €"}}]
["Dont montant affectant le FRI",{"v":0,"d":"0.00 €"},{"$f":"C78+C79+C80+C81+C82-C89-C90-C91-C92-C93-C94","v":{"v":0,"d":"0.00 €"}}]
["Dont montant affectant le FRE",{"v":0,"d":"0.00 €"},{"$f":"C76+C83+C84+C85+C86+C87-C95-C96-C97-C98-C99","v":{"v":0,"d":"0.00 €"}}]
[]
[]
["N-2"]
[null,"EPRD synthétique","CHARGES"]
["Groupe I : charges afférentes à l'exploitation courante",{"$f":"SUM(C107:IV107)","v":{"v":0,"d":"0.00 €"}},{"$f":"'CRPP NON SOUMIS EQUIL'!$D$34+'CRPP SOUMIS EQUILIBRE'!$D$34+CRP_SF!$D$34","v":{"v":0,"d":"0.00 €"}}]
["Groupe II : charges afférentes au personnel",{"$f":"SUM(C108:IV108)","v":{"v":0,"d":"0.00 €"}},{"$f":"'CRPP NON SOUMIS EQUIL'!$D$51+'CRPP SOUMIS EQUILIBRE'!$D$51+CRP_SF!$D$51","v":{"v":0,"d":"0.00 €"}}]
["Groupe III : charges afférentes à la structure",{"$f":"SUM(C109:IV109)","v":{"v":0,"d":"0.00 €"}},{"$f":"'CRPP NON SOUMIS EQUIL'!$D$106+'CRPP SOUMIS EQUILIBRE'!$D$108+CRP_SF!$D$106","v":{"v":0,"d":"0.00 €"}}]
["TOTAL DES CHARGES",{"$f":"SUM(C110:IV110)","v":{"v":0,"d":"0.00 €"}},{"$f":"SUM(C107:C109)","v":{"v":0,"d":"0.00 €"}}]
["RESULTAT COMPTABLE PREVISIONNEL EXCEDENTAIRE (1)",{"$f":"SUM(C111:IV111)","v":{"v":0,"d":"0.00 €"}},{"$f":"IF(C129<C110,0,C129-C110)","v":{"v":0,"d":"0.00 €"}}]
["TOTAL EQUILIBRE DU COMPTE DE RESULTAT PREVISIONNEL",{"v":0,"d":"0.00 €"},{"$f":"C111+C110","v":{"v":0,"d":"0.00 €"}}]
[]
["TABLEAU DE PASSAGE DU RESULTAT PREVISIONNEL A LA CAF PREVISIONNELLE"]
[]
["RESULTAT COMPTABLE PREVISIONNEL (EXCEDENT)",{"v":0,"d":"0.00 €"},{"$f":"C111","v":{"v":0,"d":"0.00 €"}}]
["Valeur comptable des immobilisations incorporelles et corporelles cédées",{"v":0,"d":"0.00 €"},{"$f":"'CRPP NON SOUMIS EQUIL'!$D$70+'CRPP NON SOUMIS EQUIL'!$D$83+'CRPP SOUMIS EQUILIBRE'!$D$72+'CRPP SOUMIS EQUILIBRE'!$D$85+CRP_SF!$D$70+CRP_SF!$D$83","v":{"v":0,"d":"0.00 €"}}]
["Dotations aux amortissements, aux dépréciations et aux provisions",{"v":0,"d":"0.00 €"},{"$f":"'CRPP NON SOUMIS EQUIL'!$D$87+'CRPP NON SOUMIS EQUIL'!$D$88+'CRPP NON SOUMIS EQUIL'!$D$89+'CRPP NON SOUMIS EQUIL'!$D$90+'CRPP NON SOUMIS EQUIL'!$D$91+'CRPP NON SOUMIS EQUIL'!$D$92+'CRPP NON SOUMIS EQUIL'!$D$98+'CRPP NON SOUMIS EQUIL'!$D$93+'CRPP NON SOUMIS EQUIL'!$D$94+'CRPP NON SOUMIS EQUIL'!$D$95+'CRPP NON SOUMIS EQUIL'!$D$96+'CRPP NON SOUMIS EQUIL'!$D$97+'CRPP NON SOUMIS EQUIL'!$D$99+'CRPP NON SOUMIS EQUIL'!$D$100+SUM('CRPP SOUMIS EQUILIBRE'!$D$89:$D$102)+CRP_SF!$D$87+CRP_SF!$D$88+CRP_SF!$D$89+CRP_SF!$D$90+CRP_SF!$D$91+CRP_SF!$D$92+CRP_SF!$D$98+CRP_SF!$D$93+CRP_SF!$D$94+CRP_SF!$D$95+CRP_SF!$D$96+CRP_SF!$D$97+CRP_SF!$D$99+CRP_SF!$D$100","v":{"v":0,"d":"0.00 €"}}]
["Reports en fonds dédiés (ESSMS privés)",{"v":0,"d":"0.00 €"},{"$f":"'CRPP NON SOUMIS EQUIL'!$D$101+'CRPP NON SOUMIS EQUIL'!$D$102+'CRPP NON SOUMIS EQUIL'!$D$103+'CRPP NON SOUMIS EQUIL'!$D$104+'CRPP SOUMIS EQUILIBRE'!$D$103+'CRPP SOUMIS EQUILIBRE'!$D$104+'CRPP SOUMIS EQUILIBRE'!$D$105+'CRPP SOUMIS EQUILIBRE'!$D$106+CRP_SF!$D$101+CRP_SF!$D$102+CRP_SF!$D$103+CRP_SF!$D$104","v":{"v":0,"d":"0.00 €"}}]
[]
["SOUS-TOTAL 1",{"v":0,"d":"0.00 €"},{"$f":"SUM(C116:C120)","v":{"v":0,"d":"0.00 €"}}]
["CAPACITE D'AUTOFINANCEMENT (si 1-2>0)",{"v":0,"d":"0.00 €"},{"$f":"IF(C121<C140,0,-(C140-C121))","v":{"v":0,"d":"0.00 €"}}]
["Taux de CAF en pourcentage des produits",{"v":0,"d":"0%"},{"$f":"IF(C129=0,0,C122/C129)","v":{"v":0,"d":"0%"}}]
[]
[null,null,"PRODUITS"]
["Groupe I : produits de la tarification",{"$f":"SUM(C126:IV126)","v":{"v":0,"d":"0.00 €"}},{"$f":"'CRPP NON SOUMIS EQUIL'!$D$131+'CRPP SOUMIS EQUILIBRE'!$D$129+CRP_SF!$D$131","v":{"v":0,"d":"0.00 €"}}]
["Groupe II : autres produits relatifs à l'exploitation",{"v":0,"d":"0.00 €"},{"$f":"'CRPP NON SOUMIS EQUIL'!$D$158+'CRPP SOUMIS EQUILIBRE'!$D$155+CRP_SF!$D$158","v":{"v":0,"d":"0.00 €"}}]
["Groupe III : produits financiers, produits exceptionnels et produits non encaissables",{"v":0,"d":"0.00 €"},{"$f":"'CRPP NON SOUMIS EQUIL'!$D$192+'CRPP SOUMIS EQUILIBRE'!$D$188+CRP_SF!$D$192","v":{"v":0,"d":"0.00 €"}}]
["TOTAL DES PRODUITS",{"v":0,"d":"0.00 €"},{"$f":"SUM(C126:C128)","v":{"v":0,"d":"0.00 €"}}]
["RESULTAT COMPTABLE PREVISIONNEL DEFICITAIRE (1)",{"v":0,"d":"0.00 €"},{"$f":"IF(C129>C110,0,C110-C129)","v":{"v":0,"d":"0.00 €"}}]
["TOTAL EQUILIBRE DU COMPTE DE RESULTAT PREVISIONNEL",{"v":0,"d":"0.00 €"},{"$f":"C130+C129","v":{"v":0,"d":"0.00 €"}}]
[]
[]
[]
["RESULTAT COMPTABLE PREVISIONNEL (DEFICIT) (1)",{"v":0,"d":"0.00 €"},{"$f":"C130","v":{"v":0,"d":"0.00 €"}}]
["Produits des cessions d'immobilisations incorporelles et corporelles",{"v":0,"d":"0.00 €"},{"$f":"'CRPP NON SOUMIS EQUIL'!$D$146+'CRPP NON SOUMIS EQUIL'!$D$169+'CRPP SOUMIS EQUILIBRE'!$D$143+'CRPP SOUMIS EQUILIBRE'!$D$165+CRP_SF!$D$146+CRP_SF!$D$169","v":{"v":0,"d":"0.00 €"}}]
["Quote-part des subventions d'investissement virée au résultat",{"v":0,"d":"0.00 €"},{"$f":"'CRPP NON SOUMIS EQUIL'!$D$144+'CRPP NON SOUMIS EQUIL'!$D$170+'CRPP NON SOUMIS EQUIL'!$D$172+'CRPP SOUMIS EQUILIBRE'!$D$141+'CRPP SOUMIS EQUILIBRE'!$D$166+'CRPP SOUMIS EQUILIBRE'!$D$168+CRP_SF!$D$144+CRP_SF!$D$170+CRP_SF!$D$172","v":{"v":0,"d":"0.00 €"}}]
["Reprise sur amortissements, dépréciations et provisions",{"v":0,"d":"0.00 €"},{"$f":"'CRPP NON SOUMIS EQUIL'!$D$175+'CRPP NON SOUMIS EQUIL'!$D$176+'CRPP NON SOUMIS EQUIL'!$D$177+'CRPP NON SOUMIS EQUIL'!$D$178+'CRPP NON SOUMIS EQUIL'!$D$179+'CRPP NON SOUMIS EQUIL'!$D$184+'CRPP NON SOUMIS EQUIL'!$D$180+'CRPP NON SOUMIS EQUIL'!$D$181+'CRPP NON SOUMIS EQUIL'!$D$182+'CRPP NON SOUMIS EQUIL'!$D$183+'CRPP NON SOUMIS EQUIL'!$D$185+SUM('CRPP SOUMIS EQUILIBRE'!$D$171:$D$181)+CRP_SF!$D$175+CRP_SF!$D$176+CRP_SF!$D$177+CRP_SF!$D$178+CRP_SF!$D$179+CRP_SF!$D$184+CRP_SF!$D$180+CRP_SF!$D$181+CRP_SF!$D$182+CRP_SF!$D$183+CRP_SF!$D$185","v":{"v":0,"d":"0.00 €"}}]
["Utilisation de fonds dédiés et de fonds reportés (ESSMS privés)",{"v":0,"d":"0.00 €"},{"$f":"'CRPP NON SOUMIS EQUIL'!$D$186+'CRPP NON SOUMIS EQUIL'!$D$187+'CRPP NON SOUMIS EQUIL'!$D$188+'CRPP NON SOUMIS EQUIL'!$D$189+'CRPP SOUMIS EQUILIBRE'!$D$182+'CRPP SOUMIS EQUILIBRE'!$D$183+'CRPP SOUMIS EQUILIBRE'!$D$184+'CRPP SOUMIS EQUILIBRE'!$D$185+CRP_SF!$D$186+CRP_SF!$D$187+CRP_SF!$D$188+CRP_SF!$D$189","v":{"v":0,"d":"0.00 €"}}]
["SOUS-TOTAL 2",{"v":0,"d":"0.00 €"},{"$f":"SUM(C135:C139)","v":{"v":0,"d":"0.00 €"}}]
["INSUFFISANCE D'AUTOFINANCEMENT (si 1-2<0)",{"v":0,"d":"0.00 €"},{"$f":"IF(C140<C121,0,-(C121-C140))","v":{"v":0,"d":"0.00 €"}}]
[]
[]
["Total des charges (total classe 6)",{"$f":"SUM(C144:IV144)","v":{"v":0,"d":"0.00 €"}},{"$f":"'CRPP NON SOUMIS EQUIL'!$D$108+'CRPP SOUMIS EQUILIBRE'!$D$110+CRP_SF!$D$108","v":{"v":0,"d":"0.00 €"}}]
["dont charges non décaissables",{"v":0,"d":"0.00 €"},{"$f":"'CRPP NON SOUMIS EQUIL'!$D$70+'CRPP NON SOUMIS EQUIL'!$D$82+'CRPP NON SOUMIS EQUIL'!$D$83+SUM('CRPP NON SOUMIS EQUIL'!$D$87:'CRPP NON SOUMIS EQUIL'!$D$104)+'CRPP SOUMIS EQUILIBRE'!$D$72+'CRPP SOUMIS EQUILIBRE'!$D$84+'CRPP SOUMIS EQUILIBRE'!$D$85+SUM('CRPP SOUMIS EQUILIBRE'!$D$89:'CRPP SOUMIS EQUILIBRE'!$D$106)+CRP_SF!$D$70+CRP_SF!$D$82+CRP_SF!$D$83+SUM(CRP_SF!$D$87:'CRP_SF'!$D$104)","v":{"v":0,"d":"0.00 €"}}]
["Achats stockés et variations de stocks",{"v":0,"d":"0.00 €"},{"$f":"'CRPP NON SOUMIS EQUIL'!$D$12-'CRPP NON SOUMIS EQUIL'!$D$147+'CRPP SOUMIS EQUILIBRE'!$D$12-'CRPP SOUMIS EQUILIBRE'!$D$144+CRP_SF!$D$12-CRP_SF!$D$147","v":{"v":0,"d":"0.00 €"}}]
["Produits de la tarification (groupe 1)",{"v":0,"d":"0.00 €"},{"$f":"'CRPP NON SOUMIS EQUIL'!$D$131+'CRPP SOUMIS EQUILIBRE'!$D$129+CRP_SF!$D$131","v":{"v":0,"d":"0.00 €"}}]
["Total des produits 70",{"v":0,"d":"0.00 €"},{"$f":"'CRPP NON SOUMIS EQUIL'!$D$137+'CRPP NON SOUMIS EQUIL'!$D$138+'CRPP NON SOUMIS EQUIL'!$D$139+'CRPP NON SOUMIS EQUIL'!$D$140+'CRPP SOUMIS EQUILIBRE'!$D$134+'CRPP SOUMIS EQUILIBRE'!$D$135+'CRPP SOUMIS EQUILIBRE'!$D$136+'CRPP SOUMIS EQUILIBRE'!$D$137+CRP_SF!$D$137+CRP_SF!$D$138+CRP_SF!$D$139+CRP_SF!$D$140","v":{"v":0,"d":"0.00 €"}}]
["Total des charges (comptes 63 et 645 à 647)",{"v":0,"d":"0.00 €"},{"$f":"'CRPP NON SOUMIS EQUIL'!$D$41+'CRPP NON SOUMIS EQUIL'!$D$42+'CRPP NON SOUMIS EQUIL'!$D$65+'CRPP NON SOUMIS EQUIL'!$D$66+'CRPP NON SOUMIS EQUIL'!$D$46+'CRPP NON SOUMIS EQUIL'!$D$47+'CRPP NON SOUMIS EQUIL'!$D$48+'CRPP SOUMIS EQUILIBRE'!$D$41+'CRPP SOUMIS EQUILIBRE'!$D$42+'CRPP SOUMIS EQUILIBRE'!$D$67+'CRPP SOUMIS EQUILIBRE'!$D$68+'CRPP SOUMIS EQUILIBRE'!$D$46+'CRPP SOUMIS EQUILIBRE'!$D$47+'CRPP SOUMIS EQUILIBRE'!$D$48+CRP_SF!$D$41+CRP_SF!$D$42+CRP_SF!$D$65+CRP_SF!$D$66+CRP_SF!$D$46+CRP_SF!$D$47+CRP_SF!$D$48","v":{"v":0,"d":"0.00 €"}}]
["Total des produits (sauf c/747, 757, 775, 777 et 78)",{"v":0,"d":"0.00 €"},{"$f":"'CRPP NON SOUMIS EQUIL'!$D$194-'CRPP NON SOUMIS EQUIL'!$D$144-'CRPP NON SOUMIS EQUIL'!$D$146-'CRPP NON SOUMIS EQUIL'!$D$169-'CRPP NON SOUMIS EQUIL'!$D$170-'CRPP NON SOUMIS EQUIL'!$D$172-SUM('CRPP NON SOUMIS EQUIL'!$D$175:'CRPP NON SOUMIS EQUIL'!$D$189)-SUM('CRPP NON SOUMIS EQUIL'!$D$147:'CRPP NON SOUMIS EQUIL'!$D$156)+'CRPP SOUMIS EQUILIBRE'!$D$190-'CRPP SOUMIS EQUILIBRE'!$D$141-'CRPP SOUMIS EQUILIBRE'!$D$143-'CRPP SOUMIS EQUILIBRE'!$D$165-'CRPP SOUMIS EQUILIBRE'!$D$166-'CRPP SOUMIS EQUILIBRE'!$D$168-SUM('CRPP SOUMIS EQUILIBRE'!$D$171:'CRPP SOUMIS EQUILIBRE'!$D$185)-SUM('CRPP SOUMIS EQUILIBRE'!$D$144:'CRPP SOUMIS EQUILIBRE'!$D$153)+CRP_SF!$D$194-CRP_SF!$D$144-CRP_SF!$D$146-CRP_SF!$D$169-CRP_SF!$D$170-CRP_SF!$D$172-SUM(CRP_SF!$D$175:'CRP_SF'!$D$189)-SUM(CRP_SF!$D$147:'CRP_SF'!$D$156)","v":{"v":0,"d":"0.00 €"}}]
["Comptes 709 et 713",{"v":0,"d":"0.00 €"},{"$f":"'CRPP NON SOUMIS EQUIL'!$D$15+'CRPP NON SOUMIS EQUIL'!$D$16+'CRPP SOUMIS EQUILIBRE'!$D$15+'CRPP SOUMIS EQUILIBRE'!$D$16+CRP_SF!$D$15+CRP_SF!$D$16","v":{"v":0,"d":"0.00 €"}}]
["Total classe 7 (sauf c/76, c/77, c/786 et c/ 787)",{"v":0,"d":"0.00 €"},{"$f":"'CRPP NON SOUMIS EQUIL'!$D$194-'CRPP NON SOUMIS EQUIL'!$D$164-SUM('CRPP NON SOUMIS EQUIL'!$D$167:'CRPP NON SOUMIS EQUIL'!$D$172)-SUM('CRPP NON SOUMIS EQUIL'!$D$179:'CRPP NON SOUMIS EQUIL'!$D$185)-SUM('CRPP NON SOUMIS EQUIL'!$D$147:'CRPP NON SOUMIS EQUIL'!$D$156)+'CRPP SOUMIS EQUILIBRE'!$D$190-'CRPP SOUMIS EQUILIBRE'!$D$160-SUM('CRPP SOUMIS EQUILIBRE'!$D$163:'CRPP SOUMIS EQUILIBRE'!$D$168)-SUM('CRPP SOUMIS EQUILIBRE'!$D$175:'CRPP SOUMIS EQUILIBRE'!$D$181)-SUM('CRPP SOUMIS EQUILIBRE'!$D$144:'CRPP SOUMIS EQUILIBRE'!$D$153)+CRP_SF!$D$194-CRP_SF!$D$164-SUM(CRP_SF!$D$167:'CRP_SF'!$D$172)-SUM(CRP_SF!$D$179:'CRP_SF'!$D$185)-SUM(CRP_SF!$D$147:'CRP_SF'!$D$156)","v":{"v":0,"d":"0.00 €"}}]
["Comptes 70 à 75",{"$f":"SUM(C153:IV153)","v":{"v":0,"d":"0.00 €"}},{"$f":"'CRPP NON SOUMIS EQUIL'!$D$206+'CRPP SOUMIS EQUILIBRE'!$D$200+CRP_SF!$D$206","v":{"v":0,"d":"0.00 €"}}]
["Comptes 60 à 65",{"$f":"SUM(C154:IV154)","v":{"v":0,"d":"0.00 €"}},{"$f":"'CRPP NON SOUMIS EQUIL'!$D$34+'CRPP NON SOUMIS EQUIL'!$D$51+SUM('CRPP NON SOUMIS EQUIL'!$D$56:'CRPP NON SOUMIS EQUIL'!$D$66)+SUM('CRPP NON SOUMIS EQUIL'!$D$69:'CRPP NON SOUMIS EQUIL'!$D$75)+'CRPP SOUMIS EQUILIBRE'!$D$34+'CRPP SOUMIS EQUILIBRE'!$D$51+SUM('CRPP SOUMIS EQUILIBRE'!$D$58:'CRPP SOUMIS EQUILIBRE'!$D$68)+SUM('CRPP SOUMIS EQUILIBRE'!$D$71:'CRPP SOUMIS EQUILIBRE'!$D$77)+CRP_SF!$D$34+CRP_SF!$D$51+SUM(CRP_SF!$D$56:'CRP_SF'!$D$66)+SUM(CRP_SF!$D$69:'CRP_SF'!$D$75)","v":{"v":0,"d":"0.00 €"}}]
["Comptes 60 à 62",{"$f":"SUM(C155:IV155)","v":{"v":0,"d":"0.00 €"}},{"$f":"'CRPP NON SOUMIS EQUIL'!$D$34+SUM('CRPP NON SOUMIS EQUIL'!$D$56:$D$64)+'CRPP NON SOUMIS EQUIL'!$D$39+'CRPP NON SOUMIS EQUIL'!$D$40-'CRPP NON SOUMIS EQUIL'!$D$148-'CRPP NON SOUMIS EQUIL'!$D$149-'CRPP NON SOUMIS EQUIL'!$D$150+'CRPP SOUMIS EQUILIBRE'!$D$34+SUM('CRPP SOUMIS EQUILIBRE'!$D$58:$D$66)+'CRPP SOUMIS EQUILIBRE'!$D$39+'CRPP SOUMIS EQUILIBRE'!$D$40-'CRPP SOUMIS EQUILIBRE'!$D$145-'CRPP SOUMIS EQUILIBRE'!$D$146-'CRPP SOUMIS EQUILIBRE'!$D$147+CRP_SF!$D$34+SUM(CRP_SF!$D$56:'CRP_SF'!$D$64)+CRP_SF!$D$39+CRP_SF!$D$40-CRP_SF!$D$148-CRP_SF!$D$149-CRP_SF!$D$150","v":{"v":0,"d":"0.00 €"}}]
["Compte 6611",{"$f":"SUM(C156:IV156)","v":{"v":0,"d":"0.00 €"}},{"$f":"'CRPP NON SOUMIS EQUIL'!$D$156+'CRPP SOUMIS EQUILIBRE'!$D$153+CRP_SF!$D$156","v":{"v":0,"d":"0.00 €"}}]
["Marge brute",{"$f":"SUM(C157:IV157)","v":{"v":0,"d":"0.00 €"}},{"$f":"'CRPP NON SOUMIS EQUIL'!$D$205+'CRPP SOUMIS EQUILIBRE'!$D$199+CRP_SF!$D$205","v":{"v":0,"d":"0.00 €"}}]
[]
[]
["PGFP N-1"]
["Produits",{"$f":"SUM(C161:IV161)","v":0}]
["Groupe I : Produits de la tarification",{"v":0,"d":"0.00 €"},{"$f":"CRP_PGFP!$D$47+CRP_PGFP_SF!$D$47","v":{"v":0,"d":"0.00 €"}}]
["(*) Dont aides ponctuelles par dotations non  reconductibles ",{"v":0,"d":"0.00 €"},{"$f":"CRP_PGFP!$D$53+CRP_PGFP!$D$54+CRP_PGFP!$D$55+CRP_PGFP_SF!$D$53+CRP_PGFP_SF!$D$54+CRP_PGFP_SF!$D$55","v":{"v":0,"d":"0.00 €"}}]
["Groupe II : Autres produits d'exploitation",{"v":0,"d":"0.00 €"},{"$f":"CRP_PGFP!$D$56+CRP_PGFP_SF!$D$56","v":{"v":0,"d":"0.00 €"}}]
["(*) Dont produits du compte 70",{"v":0,"d":"0.00 €"},{"$f":"'CRPP NON SOUMIS EQUIL'!$E$137+'CRPP NON SOUMIS EQUIL'!$E$138+'CRPP NON SOUMIS EQUIL'!$E$139+'CRPP NON SOUMIS EQUIL'!$E$140+'CRPP SOUMIS EQUILIBRE'!$E$134+'CRPP SOUMIS EQUILIBRE'!$E$135+'CRPP SOUMIS EQUILIBRE'!$E$136+'CRPP SOUMIS EQUILIBRE'!$E$137+CRP_SF!$E$137+CRP_SF!$E$138+CRP_SF!$E$139+CRP_SF!$E$140","v":{"v":0,"d":"0.00 €"}}]
["Groupe III : Produits financiers, exceptionnels et non encaissables",{"v":0,"d":"0.00 €"},{"$f":"CRP_PGFP!$D$60+CRP_PGFP_SF!$D$60","v":{"v":0,"d":"0.00 €"}}]
["Total des produits (1)",{"v":0,"d":"0.00 €"},{"$f":"C162+C164+C166","v":{"v":0,"d":"0.00 €"}}]
["Dont produits (hors c/747, 757, 775, 777 et 78)",{"v":0,"d":"0.00 €"},{"$f":"CRP_PGFP!$D$77-CRP_PGFP!$D$63-CRP_PGFP!$D$64-CRP_PGFP!$D$65-CRP_PGFP!$D$66-CRP_PGFP!$D$67-CRP_PGFP!$D$68-CRP_PGFP!$D$69-CRP_PGFP!$D$70-CRP_PGFP!$D$71-CRP_PGFP!$D$72-CRP_PGFP!$D$73-CRP_PGFP!$D$74-CRP_PGFP!$D$75+CRP_PGFP_SF!$D$77-CRP_PGFP_SF!$D$63-CRP_PGFP_SF!$D$64-CRP_PGFP_SF!$D$65-CRP_PGFP_SF!$D$66-CRP_PGFP_SF!$D$67-CRP_PGFP_SF!$D$68-CRP_PGFP_SF!$D$69-CRP_PGFP_SF!$D$70-CRP_PGFP_SF!$D$71-CRP_PGFP_SF!$D$72-CRP_PGFP_SF!$D$73-CRP_PGFP_SF!$D$74-CRP_PGFP_SF!$D$75","v":{"v":0,"d":"0.00 €"}}]
["Charges",{"v":0,"d":"0.00 €"}]
["Groupe I : Charges afférentes à l'exploitation courante",{"v":0,"d":"0.00 €"},{"$f":"CRP_PGFP!$D$9+CRP_PGFP_SF!$D$9","v":{"v":0,"d":"0.00 €"}}]
["(*) Dont achats stockés et variation des stocks",{"v":0,"d":"0.00 €"},{"$f":"'CRPP NON SOUMIS EQUIL'!$E$12-'CRPP NON SOUMIS EQUIL'!$E$147+'CRPP SOUMIS EQUILIBRE'!$E$12-'CRPP SOUMIS EQUILIBRE'!$E$144+CRP_SF!$E$12-CRP_SF!$E$147","v":{"v":0,"d":"0.00 €"}}]
["Groupe II : Charges afférentes au personnel",{"v":0,"d":"0.00 €"},{"$f":"CRP_PGFP!$D$13+CRP_PGFP_SF!$D$13","v":{"v":0,"d":"0.00 €"}}]
["Groupe III : Charges afférentes à la structure",{"v":0,"d":"0.00 €"},{"$f":"CRP_PGFP!$D$18+CRP_PGFP_SF!$D$18","v":{"v":0,"d":"0.00 €"}}]
["(*) Dont charges non décaissables",{"v":0,"d":"0.00 €"},{"$f":"CRP_PGFP!$D$25+CRP_PGFP!$D$26+CRP_PGFP!$D$28+CRP_PGFP!$D$29+CRP_PGFP!$D$32+CRP_PGFP!$D$30+CRP_PGFP!$D$31+CRP_PGFP!$D$33+CRP_PGFP!$D$34+CRP_PGFP!$D$35+CRP_PGFP!$D$36+CRP_PGFP!$D$37+CRP_PGFP_SF!$D$25+CRP_PGFP_SF!$D$26+CRP_PGFP_SF!$D$28+CRP_PGFP_SF!$D$29+CRP_PGFP_SF!$D$32+CRP_PGFP_SF!$D$30+CRP_PGFP_SF!$D$31+CRP_PGFP_SF!$D$33+CRP_PGFP_SF!$D$34+CRP_PGFP_SF!$D$35+CRP_PGFP_SF!$D$36+CRP_PGFP_SF!$D$37","v":{"v":0,"d":"0.00 €"}}]
["(*) Dont charges des comptes 61 et 62 du groupe 3",{"v":0,"d":"0.00 €"},{"$f":"CRP_PGFP!$D$19+CRP_PGFP!$D$23+CRP_PGFP_SF!$D$19+CRP_PGFP_SF!$D$23","v":{"v":0,"d":"0.00 €"}}]
["(*) Dont charges des comptes 63 à 65 du Groupe 3 des dépenses",{"v":0,"d":"0.00 €"},{"$f":"CRP_PGFP!$D$21+CRP_PGFP!$D$22+CRP_PGFP_SF!$D$21+CRP_PGFP_SF!$D$22","v":{"v":0,"d":"0.00 €"}}]
["Total des charges (2)",{"v":0,"d":"0.00 €"},{"$f":"C170+C172+C173","v":{"v":0,"d":"0.00 €"}}]
["(*) Dont charges des comptes 60 à 62",{"v":0,"d":"0.00 €"},{"$f":"CRP_PGFP!$D$9+CRP_PGFP!$D$19+CRP_PGFP!$D$23+CRP_PGFP_SF!$D$9+CRP_PGFP_SF!$D$19+CRP_PGFP_SF!$D$23+'CRPP NON SOUMIS EQUIL'!$E$39+'CRPP NON SOUMIS EQUIL'!$E$40-'CRPP NON SOUMIS EQUIL'!$E$148-'CRPP NON SOUMIS EQUIL'!$E$149-'CRPP NON SOUMIS EQUIL'!$E$150+'CRPP SOUMIS EQUILIBRE'!$E$39+'CRPP SOUMIS EQUILIBRE'!$E$40-'CRPP SOUMIS EQUILIBRE'!$E$145-'CRPP SOUMIS EQUILIBRE'!$E$146-'CRPP SOUMIS EQUILIBRE'!$E$147+CRP_SF!$E$39+CRP_SF!$E$40-CRP_SF!$E$148-CRP_SF!$E$149-CRP_SF!$E$150","v":{"v":0,"d":"0.00 €"}}]
["(*) Dont charges des comptes 63 et 645 à 647",{"v":0,"d":"0.00 €"},{"$f":"CRP_PGFP!$D$21+CRP_PGFP_SF!$D$21+'CRPP NON SOUMIS EQUIL'!$E$41+'CRPP NON SOUMIS EQUIL'!$E$42+'CRPP NON SOUMIS EQUIL'!$E$46+'CRPP NON SOUMIS EQUIL'!$E$47+'CRPP NON SOUMIS EQUIL'!$E$48+'CRPP SOUMIS EQUILIBRE'!$E$41+'CRPP SOUMIS EQUILIBRE'!$E$42+'CRPP SOUMIS EQUILIBRE'!$E$46+'CRPP SOUMIS EQUILIBRE'!$E$47+'CRPP SOUMIS EQUILIBRE'!$E$48+CRP_SF!$E$41+CRP_SF!$E$42+CRP_SF!$E$46+CRP_SF!$E$47+CRP_SF!$E$48","v":{"v":0,"d":"0.00 €"}}]
["Résultat prévisionnel (1) - (2) ",{"v":0,"d":"0.00 €"},{"$f":"C167-C177","v":{"v":0,"d":"0.00 €"}}]
[]
["Comptes 709 et 713",{"$f":"SUM(C182:IV182)","v":{"v":0,"d":"0.00 €"}},{"$f":"'CRPP NON SOUMIS EQUIL'!$E$15+'CRPP NON SOUMIS EQUIL'!$E$16+'CRPP SOUMIS EQUILIBRE'!$E$15+'CRPP SOUMIS EQUILIBRE'!$E$16+CRP_SF!$E$15+CRP_SF!$E$16","v":{"v":0,"d":"0.00 €"}}]
["Total classe 7 (sauf c/76, c/77, c/786 et c/ 787)",{"$f":"SUM(C183:IV183)","v":{"v":0,"d":"0.00 €"}},{"$f":"'CRPP NON SOUMIS EQUIL'!$E$194-'CRPP NON SOUMIS EQUIL'!$E$164-SUM('CRPP NON SOUMIS EQUIL'!$E$167:'CRPP NON SOUMIS EQUIL'!$E$172)-SUM('CRPP NON SOUMIS EQUIL'!$E$179:'CRPP NON SOUMIS EQUIL'!$E$185)-SUM('CRPP NON SOUMIS EQUIL'!$E$147:'CRPP NON SOUMIS EQUIL'!$E$156)+'CRPP SOUMIS EQUILIBRE'!$E$190-'CRPP SOUMIS EQUILIBRE'!$E$160-SUM('CRPP SOUMIS EQUILIBRE'!$E$163:'CRPP SOUMIS EQUILIBRE'!$E$168)-SUM('CRPP SOUMIS EQUILIBRE'!$E$175:'CRPP SOUMIS EQUILIBRE'!$E$181)-SUM('CRPP SOUMIS EQUILIBRE'!$E$144:'CRPP SOUMIS EQUILIBRE'!$E$153)+CRP_SF!$E$194-CRP_SF!$E$164-SUM(CRP_SF!$E$167:'CRP_SF'!$E$172)-SUM(CRP_SF!$E$179:'CRP_SF'!$E$185)-SUM(CRP_SF!$E$147:'CRP_SF'!$E$156)","v":{"v":0,"d":"0.00 €"}}]
["Compte 6611",{"$f":"SUM(C184:IV184)","v":{"v":0,"d":"0.00 €"}},{"$f":"'CRPP NON SOUMIS EQUIL'!$E$156+'CRPP SOUMIS EQUILIBRE'!$E$153+CRP_SF!$E$156","v":{"v":0,"d":"0.00 €"}}]
[]
["(FRE) Résultat prévisionnel",{"v":0,"d":"0.00 €"},{"$f":"C180","v":{"v":0,"d":"0.00 €"}}]
["Flux internes (charges) (+)",{"v":0,"d":"0.00 €"},{"$f":"SUM(C188:C194)","v":{"v":0,"d":"0.00 €"}}]
["(FRI) Valeur comptable des immobilisations incorporelles et corporelles cédées",{"v":0,"d":"0.00 €"},{"$f":"CRP_PGFP!$D$25+CRP_PGFP_SF!$D$25","v":{"v":0,"d":"0.00 €"}}]
["(FRI) Dotations aux amortissements des immobilisations incorporelles et corporelles",{"v":0,"d":"0.00 €"},{"$f":"CRP_PGFP!$D$27+CRP_PGFP!$D$26+CRP_PGFP_SF!$D$27+CRP_PGFP_SF!$D$26","v":{"v":0,"d":"0.00 €"}}]
["(FRI) Dotations aux provisions réglementées impactant le FRI",{"v":0,"d":"0.00 €"},{"$f":"CRP_PGFP!$D$30+CRP_PGFP!$D$31+CRP_PGFP_SF!$D$30+CRP_PGFP_SF!$D$31","v":{"v":0,"d":"0.00 €"}}]
["(FRI) Autres dotations aux amortissements,  provisions et dépréciations impactant le FRI (dont c/68748)",{"v":0,"d":"0.00 €"},{"$f":"CRP_PGFP!$D$28+CRP_PGFP!$D$29+CRP_PGFP!$D$32+CRP_PGFP_SF!$D$28+CRP_PGFP_SF!$D$29+CRP_PGFP_SF!$D$32","v":{"v":0,"d":"0.00 €"}}]
["(FRI) Reports en fonds dédiés à l'investissement sur concours publics des entités gestionnaires d'ESSMS (c/68921) - ESSMS privés",{"$f":"SUM(C192:IV192)","v":{"v":0,"d":"0.00 €"}},{"$f":"CRP_PGFP!$D$33+CRP_PGFP_SF!$D$33","v":{"v":0,"d":"0.00 €"}}]
["(FRE) Autres dotations aux amortissements, provisions et dépréciations",{"v":0,"d":"0.00 €"},{"$f":"CRP_PGFP!$D$34+CRP_PGFP!$D$35+CRP_PGFP!$D$36+CRP_PGFP_SF!$D$34+CRP_PGFP_SF!$D$35+CRP_PGFP_SF!$D$36","v":{"v":0,"d":"0.00 €"}}]
["(FRE) Reports en fonds dédiés (sauf c/68921) - ESSMS privés",{"$f":"SUM(C194:IV194)","v":{"v":0,"d":"0.00 €"}},{"$f":"CRP_PGFP!$D$37+CRP_PGFP_SF!$D$37","v":{"v":0,"d":"0.00 €"}}]
["Flux internes (produits) (-)",{"v":0,"d":"0.00 €"},{"$f":"SUM(C196:C203)","v":{"v":0,"d":"0.00 €"}}]
["(FRI) Reprises sur provisions réglementées  impactant le FRI",{"v":0,"d":"0.00 €"},{"$f":"CRP_PGFP!$D$66+CRP_PGFP!$D$68+CRP_PGFP_SF!$D$66+CRP_PGFP_SF!$D$68","v":{"v":0,"d":"0.00 €"}}]
["(FRI) Reprises sur amortissements, autres provisions et dépréciations impactant le FRI (dont c/78748)",{"v":0,"d":"0.00 €"},{"$f":"CRP_PGFP!$D$69+CRP_PGFP_SF!$D$69+CRP_PGFP!$D$67+CRP_PGFP_SF!$D$67+CRP_PGFP!$D$70+CRP_PGFP_SF!$D$70","v":{"v":0,"d":"0.00 €"}}]
["(FRE) Reprises sur autres provisions et dépréciations",{"v":0,"d":"0.00 €"},{"$f":"CRP_PGFP!$D$72+CRP_PGFP!$D$73+CRP_PGFP!$D$74+CRP_PGFP_SF!$D$72+CRP_PGFP_SF!$D$73+CRP_PGFP_SF!$D$74","v":{"v":0,"d":"0.00 €"}}]
["(FRI) Quote-part des subventions virées au résultat de l'exercice",{"v":0,"d":"0.00 €"},{"$f":"CRP_PGFP!$D$64+CRP_PGFP_SF!$D$64","v":{"v":0,"d":"0.00 €"}}]
["(FRI) Quote-part d'éléments du fonds associatif virée au compte de résultat",{"v":0,"d":"0.00 €"},{"$f":"CRP_PGFP!$D$65+CRP_PGFP_SF!$D$65","v":{"v":0,"d":"0.00 €"}}]
["(FRI) Produits des cessions d'immobilisations incorporelles et corporelles",{"v":0,"d":"0.00 €"},{"$f":"CRP_PGFP!$D$63+CRP_PGFP_SF!$D$63","v":{"v":0,"d":"0.00 €"}}]
["(FRI) Utilisation des fonds dédiés à l'investissement sur concours publics des entités gestionnaires d'ESSMS (c/78921) - ESSMS privés",{"v":0,"d":"0.00 €"},{"$f":"CRP_PGFP!$D$71+CRP_PGFP_SF!$D$71","v":{"v":0,"d":"0.00 €"}}]
["(FRE) Utilisation de fonds dédiés et de fonds reportés (sauf c/78921) - ESSMS privés",{"v":0,"d":"0.00 €"},{"$f":"CRP_PGFP!$D$75+CRP_PGFP_SF!$D$75","v":{"v":0,"d":"0.00 €"}}]
["Capacité (+) / Insuffisance (-) d'autofinancement prévisionnelle",{"v":0,"d":"0.00 €"},{"$f":"C180+C187-C195","v":{"v":0,"d":"0.00 €"}}]
["Dont part affectant le fonds de roulement d'investissement FRI = (3)",{"v":0,"d":"0.00 €"},{"$f":"C188+C189+C190+C191+C192-C196-C197-C199-C200-C201-C202","v":{"v":0,"d":"0.00 €"}}]
["Dont part affectant le fonds de roulement d'exploitation FRE = (4)",{"v":0,"d":"0.00 €"},{"$f":"C186+C193+C194-C198-C203","v":{"v":0,"d":"0.00 €"}}]
["(*) : Les lignes précédées d'un astérisque, qui servent à collecter des données intermédiaires nécessaires au calcul d'indicateurs, peuvent être masquées. ",{"$f":"SUM(C207:IV207)","v":0}]
[null,0,"N-1"]
["Augmentation des financements stables d'investissement de la période = (5)",{"v":0,"d":"0.00 €"},{"$f":"SUM(C210:C217)","v":{"v":0,"d":"0.00 €"}}]
["CAF ou IAF (signe -) prévisionnelle affectée au FRI =(3)",{"v":0,"d":"0.00 €"},{"$f":"C205","v":{"v":0,"d":"0.00 €"}}]
["Affectation des résultats à l'investissement",{"v":0,"d":"0.00 €"}]
["Apports",{"v":0,"d":"0.00 €"}]
["Subventions ",{"v":0,"d":"0.00 €"}]
["Emprunts",{"v":0,"d":"0.00 €"}]
["Produits de cessions d'immobilisations",{"v":0,"d":"0.00 €"}]
["Comptes de liaison investissement (ESSMS privés uniquement)",{"v":0,"d":"0.00 €"}]
["Autres",{"v":0,"d":"0.00 €"}]
["Diminution des financements stables d'investissement de la période =(6)",{"v":0,"d":"0.00 €"},{"$f":"C219+C220+C230+C231+C232","v":{"v":0,"d":"0.00 €"}}]
["Fonds associatifs, apports, dotations et réserves (réduction) (ESSMS privés uniquement)",{"v":0,"d":"0.00 €"}]
["Remboursements des emprunts",{"v":0,"d":"0.00 €"}]
["Acquisition d'immobilisations :",{"v":0,"d":"0.00 €"},{"$f":"SUM(C222:C229)","v":{"v":0,"d":"0.00 €"}}]
["Immobilisations incorporelles",{"v":0,"d":"0.00 €"}]
["Terrains",{"v":0,"d":"0.00 €"}]
["Agencements de terrains",{"v":0,"d":"0.00 €"}]
["Constructions",{"v":0,"d":"0.00 €"}]
["Installations techniques matériel et outillage",{"v":0,"d":"0.00 €"}]
["Autres immobilisations corporelles",{"v":0,"d":"0.00 €"}]
["Immobilisations en cours",{"v":0,"d":"0.00 €"}]
["Immobilisations financières",{"$f":"SUM(C229:IV229)","v":{"v":0,"d":"0.00 €"}}]
["Reprise sur les réserves de compensation des charges d'amortissement",{"v":0,"d":"0.00 €"},{"$f":"C238","v":{"v":0,"d":"0.00 €"}}]
["Autres dépenses",{"v":0,"d":"0.00 €"}]
["Comptes de liaison investissement (ESSMS privés uniquement)",{"v":0,"d":"0.00 €"}]
["Variations du FRI (5) - (6) = (7)",{"v":0,"d":"0.00 €"},{"$f":"C209-C218","v":{"v":0,"d":"0.00 €"}}]
["FRI initial (8)",{"v":0,"d":"0.00 €"}]
["FRI cumulé de fin de période = (7) + (8) = (9)",{"v":0,"d":"0.00 €"},{"$f":"C233+C234","v":{"v":0,"d":"0.00 €"}}]
["Augmentation des financements stables d'exploitation de la période = (10)",{"v":0,"d":"0.00 €"},{"$f":"C237+C238+C239","v":{"v":0,"d":"0.00 €"}}]
["CAF  ou IAF (signe -) prévisionnelle affectée au FRE",{"v":0,"d":"0.00 €"},{"$f":"C206","v":{"v":0,"d":"0.00 €"}}]
["Reprises sur les réserves de compensation des charges d'amortissement",{"v":0,"d":"0.00 €"},{"$f":"CRP_PGFP!$D$80+CRP_PGFP_SF!$D$80","v":{"v":0,"d":"0.00 €"}}]
["Comptes de liaison stable exploitation (établissements privés)",{"v":0,"d":"0.00 €"}]
["Diminution des financements stables d'exploitation de la période = (11)",{"v":0,"d":"0.00 €"},{"$f":"SUM(C241:C243)","v":{"v":0,"d":"0.00 €"}}]
["Reprise à l'investissement des réserves de couverture du BFR",{"v":0,"d":"0.00 €"}]
["Affectation des résultats à l'investissement",{"v":0,"d":"0.00 €"}]
["Comptes de liaison stable exploitation (ESSMS privés uniquement)",{"v":0,"d":"0.00 €"}]
["Variations du FRE (10) - (11) = (12)",{"v":0,"d":"0.00 €"},{"$f":"C236-C240","v":{"v":0,"d":"0.00 €"}}]
["FRE initial (13)",{"v":0,"d":"0.00 €"}]
["FRE cumulé de fin de période = (12) + (13) = (14)",{"v":0,"d":"0.00 €"},{"$f":"C244+C245","v":{"v":0,"d":"0.00 €"}}]
[null,0]
["Apport ou prélèvement sur le fonds de roulement net global = (7) + (12) = (15)",{"v":0,"d":"0.00 €"},{"$f":"C233+C244","v":{"v":0,"d":"0.00 €"}}]
["FRNG initial = (16)",{"v":0,"d":"0.00 €"}]
["Fonds de Roulement Net Global (FRNG) de fin de période = (15) + (16) = (17)",{"v":0,"d":"0.00 €"},{"$f":"C248+C249","v":{"v":0,"d":"0.00 €"}}]
[null,0]
[null,0,"N-1"]
["Augmentation du besoin en fonds de roulement de la période = (18)",{"v":0,"d":"0.00 €"},{"$f":"SUM(C254:C257)","v":{"v":0,"d":"0.00 €"}}]
["Augmentation des stocks",{"v":0,"d":"0.00 €"}]
["Augmentation des créances (effet volume ou prix)",{"v":0,"d":"0.00 €"}]
["Diminution des dettes fournisseurs (effet volume ou prix)",{"v":0,"d":"0.00 €"}]
["Diminution des autres dettes d'exploitation",{"v":0,"d":"0.00 €"}]
["Diminution du besoin en fonds de roulement de la période = (19)",{"v":0,"d":"0.00 €"},{"$f":"SUM(C259:C262)","v":{"v":0,"d":"0.00 €"}}]
["Diminution des stocks",{"v":0,"d":"0.00 €"}]
["Diminution des créances (effet volume ou prix)",{"v":0,"d":"0.00 €"}]
["Augmentation des dettes fournisseurs",{"v":0,"d":"0.00 €"}]
["Augmentation des autres dettes",{"v":0,"d":"0.00 €"}]
["Variations du BFR = (18) - (19) = (20)",{"v":0,"d":"0.00 €"},{"$f":"C253-C258","v":{"v":0,"d":"0.00 €"}}]
["BFR initial (21)",{"v":0,"d":"0.00 €"}]
["BFR cumulé fin de période = (20) + (21) = (22)",{"v":0,"d":"0.00 €"},{"$f":"C263+C264","v":{"v":0,"d":"0.00 €"}}]
["Variations de la trésorerie sur la période = (7) + (12) - (20) = (23)",{"v":0,"d":"0.00 €"},{"$f":"C248-C263","v":{"v":0,"d":"0.00 €"}}]
["Trésorerie Initiale = (24)",{"v":0,"d":"0.00 €"}]
["Trésorerie de fin de période = (23) + (24) = (25)",{"v":0,"d":"0.00 €"},{"$f":"C266+C267","v":{"v":0,"d":"0.00 €"}}]
["Variations des financements à court terme = (26)",{"v":0,"d":"0.00 €"}]
["Liquidités de fin de période = (25) + (26)",{"v":0,"d":"0.00 €"},{"$f":"C268+C269","v":{"v":0,"d":"0.00 €"}}]
[null,0]
[null,0]
[null,0]
["Données complémentaires nécessaires au calcul des ratios",0]
["Montant cumulé des emprunts en fin d'année (1)",{"v":0,"d":"0.00 €"}]
["Montant cumulé des financements stables du FRI en fin d'année(hors amortissements)",{"v":0,"d":"0.00 €"}]
["Montant cumulé de l'actif immobilisé brut en fin d'année (2)",{"v":0,"d":"0.00 €"}]
["Mesures correctives le cas échéant (sorties d'immobilisations, etc.)",{"$f":"SUM(C278:IV278)","v":{"v":0,"d":"0.00 €"}}]
["Montant cumulé de l'actif immobilisé brut en fin d'année pris en compte pour le calcul du taux de vétusté",{"v":0,"d":"0.00 €"},{"$f":"C277","v":{"v":0,"d":"0.00 €"}}]
["Montant cumulé des amortissements en fin d'année (2)",{"v":0,"d":"0.00 €"}]
["Mesures correctives le cas échéant",{"v":0,"d":"0.00 €"}]
["Montant cumulé des amortissements en fin d'année pris en compte pour le calcul du taux de vétusté",{"v":0,"d":"0.00 €"},{"$f":"C280","v":{"v":0,"d":"0.00 €"}}]
[null,0]
[null,0]
["Taux d'endettement (< 50%)",{"v":0,"d":"0.00%"},{"$f":"IF(C276=0,0,C275/C276)","v":{"v":0,"d":"0.00%"}}]
["Durée apparente de la dette (< 10 ans)",{"v":0,"d":"0.00"},{"$f":"IF(C204=0,0,C275/C204)","v":{"v":0,"d":"0.00"}}]
["CAF / Remboursement annuel du capital des emprunts (>1)",{"v":0,"d":"0.00%"},{"$f":"IF(C220=0,0,C204/C220)","v":{"v":0,"d":"0.00%"}}]
["Taux de CAF en % des produits courants",{"v":0,"d":"0.00%"},{"$f":"IF(C168=0,0,C204/C168)","v":{"v":0,"d":"0.00%"}}]
["Taux de vétusté global des immobilisations (2)",{"v":0,"d":"0.00"}]
["Marge brute",{"v":0,"d":"0.00 €"},{"$f":"C162+C164-C170-C172-C175-C176","v":{"v":0,"d":"0.00 €"}}]
["Taux de marge brute en % des produits courants",{"v":0,"d":"0.00%"},{"$f":"IF((C162+C164)=0,0,C290/(C162+C164))","v":{"v":0,"d":"0.00%"}}]
[null,0]
["Comptes 70 à 75 (N-1) hors c/747 et 757",0,{"$f":"'CRPP NON SOUMIS EQUIL'!$E$206+'CRPP SOUMIS EQUILIBRE'!$E$200+CRP_SF!$E$206-'CRPP NON SOUMIS EQUIL'!$E$144-'CRPP NON SOUMIS EQUIL'!$E$146-'CRPP SOUMIS EQUILIBRE'!$E$141-'CRPP SOUMIS EQUILIBRE'!$E$143-CRP_SF!$E$144-CRP_SF!$E$146","v":{"v":0,"d":"0.00 €"}}]
["Total des produits (sauf c/747, 757, 775, 777 et 78) (N-1)",0,{"$f":"'CRPP NON SOUMIS EQUIL'!$E$194-'CRPP NON SOUMIS EQUIL'!$E$144-'CRPP NON SOUMIS EQUIL'!$E$146-'CRPP NON SOUMIS EQUIL'!$E$169-'CRPP NON SOUMIS EQUIL'!$E$170-'CRPP NON SOUMIS EQUIL'!$E$172-SUM('CRPP NON SOUMIS EQUIL'!$E$175:'CRPP NON SOUMIS EQUIL'!$E$189)-SUM('CRPP NON SOUMIS EQUIL'!$E$147:'CRPP NON SOUMIS EQUIL'!$E$156)+'CRPP SOUMIS EQUILIBRE'!$E$190-'CRPP SOUMIS EQUILIBRE'!$E$141-'CRPP SOUMIS EQUILIBRE'!$E$143-'CRPP SOUMIS EQUILIBRE'!$E$165-'CRPP SOUMIS EQUILIBRE'!$E$166-'CRPP SOUMIS EQUILIBRE'!$E$168-SUM('CRPP SOUMIS EQUILIBRE'!$E$171:'CRPP SOUMIS EQUILIBRE'!$E$185)-SUM('CRPP SOUMIS EQUILIBRE'!$E$144:'CRPP SOUMIS EQUILIBRE'!$E$153)+CRP_SF!$E$194-CRP_SF!$E$144-CRP_SF!$E$146-CRP_SF!$E$169-CRP_SF!$E$170-CRP_SF!$E$172-SUM(CRP_SF!$E$175:'CRP_SF'!$E$189)-SUM(CRP_SF!$E$147:'CRP_SF'!$E$156)","v":{"v":0,"d":"0.00 €"}}]
["Comptes 673 (N-1)",0,{"$f":"'CRPP NON SOUMIS EQUIL'!$E$82+'CRPP SOUMIS EQUILIBRE'!$E$84+CRP_SF!$E$82","v":{"v":0,"d":"0.00 €"}}]
["Compte 652 (N-1)",0,{"$f":"'CRPP NON SOUMIS EQUIL'!$E$70+'CRPP SOUMIS EQUILIBRE'!$E$72+CRP_SF!$E$70","v":{"v":0,"d":"0.00 €"}}]
[]
["PGFP N"]
["Produits",{"$f":"SUM(C299:IV299)","v":0}]
["Groupe I : Produits de la tarification",{"v":0,"d":"0.00 €"},{"$f":"CRP_PGFP!$E$47+CRP_PGFP_SF!$E$47","v":{"v":0,"d":"0.00 €"}}]
["(*) Dont aides ponctuelles par dotations non  reconductibles ",{"v":0,"d":"0.00 €"},{"$f":"CRP_PGFP!$E$53+CRP_PGFP!$E$54+CRP_PGFP!$E$55+CRP_PGFP_SF!$E$53+CRP_PGFP_SF!$E$54+CRP_PGFP_SF!$E$55","v":{"v":0,"d":"0.00 €"}}]
["Groupe II : Autres produits d'exploitation",{"v":0,"d":"0.00 €"},{"$f":"CRP_PGFP!$E$56+CRP_PGFP_SF!$E$56","v":{"v":0,"d":"0.00 €"}}]
["(*) Dont produits du compte 70",{"v":0,"d":"0.00 €"}]
["(*) Dont produits du compte 72",{"v":0,"d":"0.00 €"}]
["Groupe III : Produits financiers, exceptionnels et non encaissables",{"v":0,"d":"0.00 €"},{"$f":"CRP_PGFP!$E$60+CRP_PGFP_SF!$E$60","v":{"v":0,"d":"0.00 €"}}]
["Total des produits (1)",{"v":0,"d":"0.00 €"},{"$f":"C300+C302+C305","v":{"v":0,"d":"0.00 €"}}]
["Dont produits (hors c/747, 757, 775, 777 et 78)",{"v":0,"d":"0.00 €"},{"$f":"CRP_PGFP!$E$77-CRP_PGFP!$E$63-CRP_PGFP!$E$64-CRP_PGFP!$E$65-CRP_PGFP!$E$66-CRP_PGFP!$E$67-CRP_PGFP!$E$68-CRP_PGFP!$E$69-CRP_PGFP!$E$70-CRP_PGFP!$E$71-CRP_PGFP!$E$72-CRP_PGFP!$E$73-CRP_PGFP!$E$74-CRP_PGFP!$E$75+CRP_PGFP_SF!$E$77-CRP_PGFP_SF!$E$63-CRP_PGFP_SF!$E$64-CRP_PGFP_SF!$E$65-CRP_PGFP_SF!$E$66-CRP_PGFP_SF!$E$67-CRP_PGFP_SF!$E$68-CRP_PGFP_SF!$E$69-CRP_PGFP_SF!$E$70-CRP_PGFP_SF!$E$71-CRP_PGFP_SF!$E$72-CRP_PGFP_SF!$E$73-CRP_PGFP_SF!$E$74-CRP_PGFP_SF!$E$75","v":{"v":0,"d":"0.00 €"}}]
["Charges",{"v":0,"d":"0.00 €"}]
["Groupe I : Charges afférentes à l'exploitation courante",{"v":0,"d":"0.00 €"},{"$f":"CRP_PGFP!$E$9+CRP_PGFP_SF!$E$9","v":{"v":0,"d":"0.00 €"}}]
["(*) Dont achats stockés et variation des stocks",{"v":0,"d":"0.00 €"}]
["(*) Dont comptes 709 et 713 en charges",{"v":0,"d":"0.00 €"}]
["Groupe II : Charges afférentes au personnel",{"v":0,"d":"0.00 €"},{"$f":"CRP_PGFP!$E$13+CRP_PGFP_SF!$E$13","v":{"v":0,"d":"0.00 €"}}]
["Groupe III : Charges afférentes à la structure",{"v":0,"d":"0.00 €"},{"$f":"CRP_PGFP!$E$18+CRP_PGFP_SF!$E$18","v":{"v":0,"d":"0.00 €"}}]
["(*) Dont charges non décaissables",{"v":0,"d":"0.00 €"}]
["(*) Dont charges des comptes 61 et 62 du groupe 3",{"v":0,"d":"0.00 €"},{"$f":"CRP_PGFP!$E$19+CRP_PGFP!$E$23+CRP_PGFP_SF!$E$19+CRP_PGFP_SF!$E$23","v":{"v":0,"d":"0.00 €"}}]
["(*) Dont charges des comptes 63 à 65 du Groupe 3 des dépenses",{"v":0,"d":"0.00 €"},{"$f":"CRP_PGFP!$E$21+CRP_PGFP!$E$22+CRP_PGFP_SF!$E$21+CRP_PGFP_SF!$E$22","v":{"v":0,"d":"0.00 €"}}]
["Total des charges (2)",{"v":0,"d":"0.00 €"},{"$f":"C309+C312+C313","v":{"v":0,"d":"0.00 €"}}]
["(*) Dont charges des comptes 60 à 62",{"v":0,"d":"0.00 €"},{"$f":"CRP_PGFP!$E$9+CRP_PGFP!$E$19+CRP_PGFP!$E$23+CRP_PGFP_SF!$E$9+CRP_PGFP_SF!$E$19+CRP_PGFP_SF!$E$23+'CRPP NON SOUMIS EQUIL'!$F$39+'CRPP NON SOUMIS EQUIL'!$F$40-'CRPP NON SOUMIS EQUIL'!$F$148-'CRPP NON SOUMIS EQUIL'!$F$149-'CRPP NON SOUMIS EQUIL'!$F$150+'CRPP SOUMIS EQUILIBRE'!$F$39+'CRPP SOUMIS EQUILIBRE'!$F$40-'CRPP SOUMIS EQUILIBRE'!$F$145-'CRPP SOUMIS EQUILIBRE'!$F$146-'CRPP SOUMIS EQUILIBRE'!$F$147+CRP_SF!$F$39+CRP_SF!$F$40-CRP_SF!$F$148-CRP_SF!$F$149-CRP_SF!$F$150","v":{"v":0,"d":"0.00 €"}}]
["(*) Dont charges des comptes 63 et 645 à 647",{"v":0,"d":"0.00 €"},{"$f":"CRP_PGFP!$E$21+CRP_PGFP_SF!$E$21+'CRPP NON SOUMIS EQUIL'!$F$41+'CRPP NON SOUMIS EQUIL'!$F$42+'CRPP NON SOUMIS EQUIL'!$F$46+'CRPP NON SOUMIS EQUIL'!$F$47+'CRPP NON SOUMIS EQUIL'!$F$48+'CRPP SOUMIS EQUILIBRE'!$F$41+'CRPP SOUMIS EQUILIBRE'!$F$42+'CRPP SOUMIS EQUILIBRE'!$F$46+'CRPP SOUMIS EQUILIBRE'!$F$47+'CRPP SOUMIS EQUILIBRE'!$F$48+CRP_SF!$F$41+CRP_SF!$F$42+CRP_SF!$F$46+CRP_SF!$F$47+CRP_SF!$F$48","v":{"v":0,"d":"0.00 €"}}]
["Résultat prévisionnel (1) - (2) ",{"v":0,"d":"0.00 €"}]
[null,0]
["(FRE) Résultat prévisionnel",{"v":0,"d":"0.00 €"},{"$f":"C320","v":{"v":0,"d":"0.00 €"}}]
["Flux internes (charges) (+)",{"v":0,"d":"0.00 €"},{"$f":"SUM(C324:C330)","v":{"v":0,"d":"0.00 €"}}]
["(FRI) Valeur comptable des immobilisations incorporelles et corporelles cédées",{"v":0,"d":"0.00 €"},{"$f":"CRP_PGFP!$E$25+CRP_PGFP_SF!$E$25","v":{"v":0,"d":"0.00 €"}}]
["(FRI) Dotations aux amortissements des immobilisations incorporelles et corporelles",{"v":0,"d":"0.00 €"},{"$f":"CRP_PGFP!$E$27+CRP_PGFP!$E$26+CRP_PGFP_SF!$E$27+CRP_PGFP_SF!$E$26","v":{"v":0,"d":"0.00 €"}}]
["(FRI) Dotations aux provisions réglementées impactant le FRI",{"v":0,"d":"0.00 €"},{"$f":"CRP_PGFP!$E$30+CRP_PGFP!$E$31+CRP_PGFP_SF!$E$30+CRP_PGFP_SF!$E$31","v":{"v":0,"d":"0.00 €"}}]
["(FRI) Autres dotations aux amortissements,  provisions et dépréciations impactant le FRI (dont c/68748)",{"v":0,"d":"0.00 €"},{"$f":"CRP_PGFP!$E$28+CRP_PGFP!$E$29+CRP_PGFP!$E$32+CRP_PGFP_SF!$E$28+CRP_PGFP_SF!$E$29+CRP_PGFP_SF!$E$32","v":{"v":0,"d":"0.00 €"}}]
["(FRI) Reports en fonds dédiés à l'investissement sur concours publics des entités gestionnaires d'ESSMS (c/68921) - ESSMS privés",{"v":0,"d":"0.00 €"},{"$f":"CRP_PGFP!$E$33+CRP_PGFP_SF!$E$33","v":{"v":0,"d":"0.00 €"}}]
["(FRE) Autres dotations aux amortissements, provisions et dépréciations",{"v":0,"d":"0.00 €"},{"$f":"CRP_PGFP!$E$34+CRP_PGFP!$E$35+CRP_PGFP!$E$36+CRP_PGFP_SF!$E$34+CRP_PGFP_SF!$E$35+CRP_PGFP_SF!$E$36","v":{"v":0,"d":"0.00 €"}}]
["(FRE) Reports en fonds dédiés (sauf c/68921) - ESSMS privés",{"$f":"SUM(C330:IV330)","v":{"v":0,"d":"0.00 €"}},{"$f":"CRP_PGFP!$E$37+CRP_PGFP_SF!$E$37","v":{"v":0,"d":"0.00 €"}}]
["Flux internes (produits) (-)",{"v":0,"d":"0.00 €"},{"$f":"SUM(C332:C339)","v":{"v":0,"d":"0.00 €"}}]
["(FRI) Reprises sur provisions réglementées  impactant le FRI",{"v":0,"d":"0.00 €"},{"$f":"CRP_PGFP!$E$66+CRP_PGFP!$E$68+CRP_PGFP_SF!$E$66+CRP_PGFP_SF!$E$68","v":{"v":0,"d":"0.00 €"}}]
["(FRI) Reprises sur amortissements, autres provisions et dépréciations impactant le FRI (dont c/78748)",{"v":0,"d":"0.00 €"},{"$f":"CRP_PGFP!$E$69+CRP_PGFP_SF!$E$69+CRP_PGFP!$E$67+CRP_PGFP_SF!$E$67+CRP_PGFP!$E$70+CRP_PGFP_SF!$E$70","v":{"v":0,"d":"0.00 €"}}]
["(FRE) Reprises sur autres provisions et dépréciations",{"v":0,"d":"0.00 €"},{"$f":"CRP_PGFP!$E$72+CRP_PGFP!$E$73+CRP_PGFP!$E$74+CRP_PGFP_SF!$E$72+CRP_PGFP_SF!$E$73+CRP_PGFP_SF!$E$74","v":{"v":0,"d":"0.00 €"}}]
["(FRI) Quote-part des subventions virées au résultat de l'exercice",{"v":0,"d":"0.00 €"},{"$f":"CRP_PGFP!$E$64+CRP_PGFP_SF!$E$64","v":{"v":0,"d":"0.00 €"}}]
["(FRI) Quote-part d'éléments du fonds associatif virée au compte de résultat",{"v":0,"d":"0.00 €"},{"$f":"CRP_PGFP!$E$65+CRP_PGFP_SF!$E$65","v":{"v":0,"d":"0.00 €"}}]
["(FRI) Produits des cessions d'immobilisations incorporelles et corporelles",{"v":0,"d":"0.00 €"},{"$f":"CRP_PGFP!$E$63+CRP_PGFP_SF!$E$63","v":{"v":0,"d":"0.00 €"}}]
["(FRI) Utilisation des fonds dédiés à l'investissement sur concours publics des entités gestionnaires d'ESSMS (c/78921) - ESSMS privés",{"v":0,"d":"0.00 €"},{"$f":"CRP_PGFP!$E$71+CRP_PGFP_SF!$E$71","v":{"v":0,"d":"0.00 €"}}]
["(FRE) Utilisation de fonds dédiés et de fonds reportés (sauf c/78921) - ESSMS privés",{"v":0,"d":"0.00 €"},{"$f":"CRP_PGFP!$E$75+CRP_PGFP_SF!$E$75","v":{"v":0,"d":"0.00 €"}}]
["Capacité (+) / Insuffisance (-) d'autofinancement prévisionnelle",{"v":0,"d":"0.00 €"},{"$f":"C320+C323-C331","v":{"v":0,"d":"0.00 €"}}]
["Dont part affectant le fonds de roulement d'investissement FRI = (3)",{"v":0,"d":"0.00 €"},{"$f":"C324+C325+C326+C327+C328-C332-C333-C335-C336-C337-C338","v":{"v":0,"d":"0.00 €"}}]
["Dont part affectant le fonds de roulement d'exploitation FRE = (4)",{"v":0,"d":"0.00 €"},{"$f":"C322+C329+C330-C334-C339","v":{"v":0,"d":"0.00 €"}}]
["(*) : Les lignes précédées d'un astérisque, qui servent à collecter des données intermédiaires nécessaires au calcul d'indicateurs, peuvent être masquées. ",0]
[null,0,"N"]
["Augmentation des financements stables d'investissement de la période = (5)",{"v":0,"d":"0.00 €"},{"$f":"SUM(C346:C353)","v":{"v":0,"d":"0.00 €"}}]
["CAF ou IAF (signe -) prévisionnelle affectée au FRI =(3)",{"v":0,"d":"0.00 €"},{"$f":"C341","v":{"v":0,"d":"0.00 €"}}]
["Affectation des résultats à l'investissement",{"v":0,"d":"0.00 €"}]
["Apports",{"v":0,"d":"0.00 €"}]
["Subventions ",{"v":0,"d":"0.00 €"}]
["Emprunts",{"v":0,"d":"0.00 €"}]
["Produits de cessions d'immobilisations",{"v":0,"d":"0.00 €"}]
["Comptes de liaison investissement (ESSMS privés uniquement)",{"v":0,"d":"0.00 €"}]
["Autres",{"v":0,"d":"0.00 €"}]
["Diminution des financements stables d'investissement de la période =(6)",{"v":0,"d":"0.00 €"},{"$f":"C355+C356+C366+C367+C368","v":{"v":0,"d":"0.00 €"}}]
["Fonds associatifs, apports, dotations et réserves (réduction) (ESSMS privés uniquement)",{"v":0,"d":"0.00 €"}]
["Remboursements des emprunts",{"v":0,"d":"0.00 €"}]
["Acquisition d'immobilisations :",{"v":0,"d":"0.00 €"},{"$f":"SUM(C358:C365)","v":{"v":0,"d":"0.00 €"}}]
["Immobilisations incorporelles",{"v":0,"d":"0.00 €"}]
["Terrains",{"v":0,"d":"0.00 €"}]
["Agencements de terrains",{"v":0,"d":"0.00 €"}]
["Constructions",{"v":0,"d":"0.00 €"}]
["Installations techniques matériel et outillage",{"v":0,"d":"0.00 €"}]
["Autres immobilisations corporelles",{"v":0,"d":"0.00 €"}]
["Immobilisations en cours",{"v":0,"d":"0.00 €"}]
["Immobilisations financières",{"$f":"SUM(C365:IV365)","v":{"v":0,"d":"0.00 €"}}]
["Reprise sur les réserves de compensation des charges d'amortissement",{"v":0,"d":"0.00 €"},{"$f":"C374","v":{"v":0,"d":"0.00 €"}}]
["Autres dépenses",{"v":0,"d":"0.00 €"}]
["Comptes de liaison investissement (ESSMS privés uniquement)",{"v":0,"d":"0.00 €"}]
["Variations du FRI (5) - (6) = (7)",{"v":0,"d":"0.00 €"},{"$f":"C345-C354","v":{"v":0,"d":"0.00 €"}}]
["FRI initial (8)",{"v":0,"d":"0.00 €"}]
["FRI cumulé de fin de période = (7) + (8) = (9)",{"v":0,"d":"0.00 €"},{"$f":"C369+C370","v":{"v":0,"d":"0.00 €"}}]
["Augmentation des financements stables d'exploitation de la période = (10)",{"v":0,"d":"0.00 €"},{"$f":"C373+C374+C375","v":{"v":0,"d":"0.00 €"}}]
["CAF  ou IAF (signe -) prévisionnelle affectée au FRE",{"v":0,"d":"0.00 €"},{"$f":"C342","v":{"v":0,"d":"0.00 €"}}]
["Reprises sur les réserves de compensation des charges d'amortissement",{"v":0,"d":"0.00 €"},{"$f":"CRP_PGFP!$E$80+CRP_PGFP_SF!$E$80","v":{"v":0,"d":"0.00 €"}}]
["Comptes de liaison stable exploitation (établissements privés)",{"v":0,"d":"0.00 €"}]
["Diminution des financements stables d'exploitation de la période = (11)",{"v":0,"d":"0.00 €"},{"$f":"SUM(C377:C379)","v":{"v":0,"d":"0.00 €"}}]
["Reprise à l'investissement des réserves de couverture du BFR",{"v":0,"d":"0.00 €"}]
["Affectation des résultats à l'investissement",{"v":0,"d":"0.00 €"}]
["Comptes de liaison stable exploitation (ESSMS privés uniquement)",{"v":0,"d":"0.00 €"}]
["Variations du FRE (10) - (11) = (12)",{"v":0,"d":"0.00 €"},{"$f":"C372-C376","v":{"v":0,"d":"0.00 €"}}]
["FRE initial (13)",{"v":0,"d":"0.00 €"}]
["FRE cumulé de fin de période = (12) + (13) = (14)",{"v":0,"d":"0.00 €"},{"$f":"C380+C381","v":{"v":0,"d":"0.00 €"}}]
[null,0]
["Apport ou prélèvement sur le fonds de roulement net global = (7) + (12) = (15)",{"v":0,"d":"0.00 €"},{"$f":"C369+C380","v":{"v":0,"d":"0.00 €"}}]
["FRNG initial = (16)",{"v":0,"d":"0.00 €"}]
["Fonds de Roulement Net Global (FRNG) de fin de période = (15) + (16) = (17)",{"v":0,"d":"0.00 €"},{"$f":"C384+C385","v":{"v":0,"d":"0.00 €"}}]
[null,0]
[null,0,"N"]
["Augmentation du besoin en fonds de roulement de la période = (18)",{"v":0,"d":"0.00 €"},{"$f":"SUM(C390:C393)","v":{"v":0,"d":"0.00 €"}}]
["Augmentation des stocks",{"v":0,"d":"0.00 €"}]
["Augmentation des créances (effet volume ou prix)",{"v":0,"d":"0.00 €"}]
["Diminution des dettes fournisseurs (effet volume ou prix)",{"v":0,"d":"0.00 €"}]
["Diminution des autres dettes d'exploitation",{"v":0,"d":"0.00 €"}]
["Diminution du besoin en fonds de roulement de la période = (19)",{"v":0,"d":"0.00 €"},{"$f":"SUM(C395:C398)","v":{"v":0,"d":"0.00 €"}}]
["Diminution des stocks",{"v":0,"d":"0.00 €"}]
["Diminution des créances (effet volume ou prix)",{"v":0,"d":"0.00 €"}]
["Augmentation des dettes fournisseurs",{"v":0,"d":"0.00 €"}]
["Augmentation des autres dettes",{"v":0,"d":"0.00 €"}]
["Variations du BFR = (18) - (19) = (20)",{"v":0,"d":"0.00 €"},{"$f":"C389-C394","v":{"v":0,"d":"0.00 €"}}]
["BFR initial (21)",{"v":0,"d":"0.00 €"}]
["BFR cumulé fin de période = (20) + (21) = (22)",{"v":0,"d":"0.00 €"},{"$f":"C399+C400","v":{"v":0,"d":"0.00 €"}}]
["Variations de la trésorerie sur la période = (7) + (12) - (20) = (23)",{"v":0,"d":"0.00 €"},{"$f":"C384-C399","v":{"v":0,"d":"0.00 €"}}]
["Trésorerie Initiale = (24)",{"v":0,"d":"0.00 €"}]
["Trésorerie de fin de période = (23) + (24) = (25)",{"v":0,"d":"0.00 €"},{"$f":"C402+C403","v":{"v":0,"d":"0.00 €"}}]
["Variations des financements à court terme = (26)",{"v":0,"d":"0.00 €"}]
["Liquidités de fin de période = (25) + (26)",{"v":0,"d":"0.00 €"},{"$f":"C404+C405","v":{"v":0,"d":"0.00 €"}}]
[null,0]
[null,0]
[null,0]
["Données complémentaires nécessaires au calcul des ratios",0]
["Montant cumulé des emprunts en fin d'année (1)",{"v":0,"d":"0.00 €"}]
["Montant cumulé des financements stables du FRI en fin d'année(hors amortissements)",{"v":0,"d":"0.00 €"}]
["Montant cumulé de l'actif immobilisé brut en fin d'année (2)",{"v":0,"d":"0.00 €"}]
["Mesures correctives le cas échéant (sorties d'immobilisations, etc.)",{"v":0,"d":"0.00 €"}]
["Montant cumulé de l'actif immobilisé brut en fin d'année pris en compte pour le calcul du taux de vétusté",{"v":0,"d":"0.00 €"}]
["Montant cumulé des amortissements en fin d'année (2)",{"v":0,"d":"0.00 €"}]
["Mesures correctives le cas échéant",{"v":0,"d":"0.00 €"}]
["Montant cumulé des amortissements en fin d'année pris en compte pour le calcul du taux de vétusté",{"v":0,"d":"0.00 €"}]
[null,0]
[null,0]
["Taux d'endettement (< 50%)",{"v":0,"d":"0.00%"},{"$f":"IF(C412=0,0,C411/C412)","v":{"v":0,"d":"0.00%"}}]
["Durée apparente de la dette (< 10 ans)",{"v":0,"d":"0.00"},{"$f":"IF(C340=0,0,C411/C340)","v":{"v":0,"d":"0.00"}}]
["CAF / Remboursement annuel du capital des emprunts (>1)",{"v":0,"d":"0.00%"},{"$f":"IF(C356=0,0,C340/C356)","v":{"v":0,"d":"0.00%"}}]
["Taux de CAF en % des produits courants",{"v":0,"d":"0.00%"},{"$f":"IF(C307=0,0,C340/C307)","v":{"v":0,"d":"0.00%"}}]
["Taux de vétusté global des immobilisations (2)",{"v":0,"d":"0.00"},{"$f":"IF(C415=0,0,C418/C415)","v":{"v":0,"d":"0.00"}}]
["Marge brute",{"v":0,"d":"0.00 €"},{"$f":"C300+C302-C309-C312-C315-C316","v":{"v":0,"d":"0.00 €"}}]
["Taux de marge brute en % des produits courants",{"v":0,"d":"0.00%"},{"$f":"IF((C300+C302)=0,0,C426/(C300+C302))","v":{"v":0,"d":"0.00%"}}]
[null,0]
["Comptes 70 à 75 (N) hors c/747 et 757",{"$f":"SUM(C429:IV429)","v":0},{"$f":"'CRPP NON SOUMIS EQUIL'!$F$206+'CRPP SOUMIS EQUILIBRE'!$F$200+CRP_SF!$F$206-'CRPP NON SOUMIS EQUIL'!$F$144-'CRPP NON SOUMIS EQUIL'!$F$146-'CRPP SOUMIS EQUILIBRE'!$F$141-'CRPP SOUMIS EQUILIBRE'!$F$143-CRP_SF!$F$144-CRP_SF!$F$146","v":{"v":0,"d":"0.00 €"}}]
["Comptes 709 et 713 (N)",{"$f":"SUM(C430:IV430)","v":0},{"$f":"'CRPP NON SOUMIS EQUIL'!$F$15+'CRPP NON SOUMIS EQUIL'!$F$16+'CRPP SOUMIS EQUILIBRE'!$F$15+'CRPP SOUMIS EQUILIBRE'!$F$16+CRP_SF!$F$15+CRP_SF!$F$16","v":{"v":0,"d":"0.00 €"}}]
["Comptes 6611 (N)",{"$f":"SUM(C431:IV431)","v":0},{"$f":"'CRPP NON SOUMIS EQUIL'!$F$156+'CRPP SOUMIS EQUILIBRE'!$F$153+CRP_SF!$F$156","v":{"v":0,"d":"0.00 €"}}]
["Compte 652 (N)",{"$f":"SUM(C432:IV432)","v":0},{"$f":"'CRPP NON SOUMIS EQUIL'!$F$70+'CRPP SOUMIS EQUILIBRE'!$F$72+CRP_SF!$F$70","v":{"v":0,"d":"0.00 €"}}]
[]
[]
["PGFP N+1"]
["Produits",{"$f":"SUM(C436:IV436)","v":0}]
["Groupe I : Produits de la tarification",{"v":0,"d":"0.00 €"},{"$f":"CRP_PGFP!$F$47+CRP_PGFP_SF!$F$47","v":{"v":0,"d":"0.00 €"}}]
["(*) Dont aides ponctuelles par dotations non  reconductibles ",{"v":0,"d":"0.00 €"},{"$f":"CRP_PGFP!$F$53+CRP_PGFP!$F$54+CRP_PGFP!$F$55+CRP_PGFP_SF!$F$53+CRP_PGFP_SF!$F$54+CRP_PGFP_SF!$F$55","v":{"v":0,"d":"0.00 €"}}]
["Groupe II : Autres produits d'exploitation",{"v":0,"d":"0.00 €"},{"$f":"CRP_PGFP!$F$56+CRP_PGFP_SF!$F$56","v":{"v":0,"d":"0.00 €"}}]
["(*) Dont produits du compte 70",{"v":0,"d":"0.00 €"}]
["(*) Dont produits du compte 72",{"v":0,"d":"0.00 €"}]
["Groupe III : Produits financiers, exceptionnels et non encaissables",{"v":0,"d":"0.00 €"},{"$f":"CRP_PGFP!$F$60+CRP_PGFP_SF!$F$60","v":{"v":0,"d":"0.00 €"}}]
["Total des produits (1)",{"v":0,"d":"0.00 €"},{"$f":"C437+C439+C442","v":{"v":0,"d":"0.00 €"}}]
["Dont produits (hors c/747, 757, 775, 777 et 78)",{"v":0,"d":"0.00 €"},{"$f":"CRP_PGFP!$F$77-CRP_PGFP!$F$63-CRP_PGFP!$F$64-CRP_PGFP!$F$65-CRP_PGFP!$F$66-CRP_PGFP!$F$67-CRP_PGFP!$F$68-CRP_PGFP!$F$69-CRP_PGFP!$F$70-CRP_PGFP!$F$71-CRP_PGFP!$F$72-CRP_PGFP!$F$73-CRP_PGFP!$F$74-CRP_PGFP!$F$75+CRP_PGFP_SF!$F$77-CRP_PGFP_SF!$F$63-CRP_PGFP_SF!$F$64-CRP_PGFP_SF!$F$65-CRP_PGFP_SF!$F$66-CRP_PGFP_SF!$F$67-CRP_PGFP_SF!$F$68-CRP_PGFP_SF!$F$69-CRP_PGFP_SF!$F$70-CRP_PGFP_SF!$F$71-CRP_PGFP_SF!$F$72-CRP_PGFP_SF!$F$73-CRP_PGFP_SF!$F$74-CRP_PGFP_SF!$F$75","v":{"v":0,"d":"0.00 €"}}]
["Charges",{"v":0,"d":"0.00 €"}]
["Groupe I : Charges afférentes à l'exploitation courante",{"v":0,"d":"0.00 €"},{"$f":"CRP_PGFP!$F$9+CRP_PGFP_SF!$F$9","v":{"v":0,"d":"0.00 €"}}]
["(*) Dont achats stockés et variation des stocks",{"v":0,"d":"0.00 €"}]
["(*) Dont comptes 709 et 713 en charges",{"v":0,"d":"0.00 €"}]
["Groupe II : Charges afférentes au personnel",{"v":0,"d":"0.00 €"},{"$f":"CRP_PGFP!$F$13+CRP_PGFP_SF!$F$13","v":{"v":0,"d":"0.00 €"}}]
["Groupe III : Charges afférentes à la structure",{"v":0,"d":"0.00 €"},{"$f":"CRP_PGFP!$F$18+CRP_PGFP_SF!$F$18","v":{"v":0,"d":"0.00 €"}}]
["(*) Dont charges non décaissables",{"v":0,"d":"0.00 €"}]
["(*) Dont charges des comptes 61 et 62 du groupe 3",{"v":0,"d":"0.00 €"},{"$f":"CRP_PGFP!$F$19+CRP_PGFP!$F$23+CRP_PGFP_SF!$F$19+CRP_PGFP_SF!$F$23","v":{"v":0,"d":"0.00 €"}}]
["(*) Dont charges des comptes 63 à 65 du Groupe 3 des dépenses",{"v":0,"d":"0.00 €"},{"$f":"CRP_PGFP!$F$21+CRP_PGFP!$F$22+CRP_PGFP_SF!$F$21+CRP_PGFP_SF!$F$22","v":{"v":0,"d":"0.00 €"}}]
["Total des charges (2)",{"v":0,"d":"0.00 €"},{"$f":"C446+C449+C450","v":{"v":0,"d":"0.00 €"}}]
["(*) Dont charges des comptes 60 à 62",{"v":0,"d":"0.00 €"},{"$f":"CRP_PGFP!$F$9+CRP_PGFP!$F$19+CRP_PGFP!$F$23+CRP_PGFP_SF!$F$9+CRP_PGFP_SF!$F$19+CRP_PGFP_SF!$F$23+'CRPP NON SOUMIS EQUIL'!$F$39+'CRPP NON SOUMIS EQUIL'!$F$40+'CRPP SOUMIS EQUILIBRE'!$F$39+'CRPP SOUMIS EQUILIBRE'!$F$40+CRP_SF!$F$39+CRP_SF!$F$40+CRP_PGFP!$F$14+CRP_PGFP_SF!$F$14","v":{"v":0,"d":"0.00 €"}}]
["(*) Dont charges des comptes 63 et 645 à 647",{"v":0,"d":"0.00 €"}]
["Résultat prévisionnel (1) - (2) ",{"v":0,"d":"0.00 €"},{"$f":"C443-C454","v":{"v":0,"d":"0.00 €"}}]
[null,0]
["(FRE) Résultat prévisionnel",{"v":0,"d":"0.00 €"},{"$f":"C457","v":{"v":0,"d":"0.00 €"}}]
["Flux internes (charges) (+)",{"v":0,"d":"0.00 €"},{"$f":"SUM(C461:C467)","v":{"v":0,"d":"0.00 €"}}]
["(FRI) Valeur comptable des immobilisations incorporelles et corporelles cédées",{"v":0,"d":"0.00 €"},{"$f":"CRP_PGFP!$F$25+CRP_PGFP_SF!$F$25","v":{"v":0,"d":"0.00 €"}}]
["(FRI) Dotations aux amortissements des immobilisations incorporelles et corporelles",{"v":0,"d":"0.00 €"},{"$f":"CRP_PGFP!$F$27+CRP_PGFP!$F$26+CRP_PGFP_SF!$F$27+CRP_PGFP_SF!$F$26","v":{"v":0,"d":"0.00 €"}}]
["(FRI) Dotations aux provisions réglementées impactant le FRI",{"v":0,"d":"0.00 €"},{"$f":"CRP_PGFP!$F$30+CRP_PGFP!$F$31+CRP_PGFP_SF!$F$30+CRP_PGFP_SF!$F$31","v":{"v":0,"d":"0.00 €"}}]
["(FRI) Autres dotations aux amortissements,  provisions et dépréciations impactant le FRI (dont c/68748)",{"v":0,"d":"0.00 €"},{"$f":"CRP_PGFP!$F$28+CRP_PGFP!$F$29+CRP_PGFP!$F$32+CRP_PGFP_SF!$F$28+CRP_PGFP_SF!$F$29+CRP_PGFP_SF!$F$32","v":{"v":0,"d":"0.00 €"}}]
["(FRI) Reports en fonds dédiés à l'investissement sur concours publics des entités gestionnaires d'ESSMS (c/68921) - ESSMS privés",{"$f":"SUM(C465:IV465)","v":{"v":0,"d":"0.00 €"}},{"$f":"CRP_PGFP!$F$33+CRP_PGFP_SF!$F$33","v":{"v":0,"d":"0.00 €"}}]
["(FRE) Autres dotations aux amortissements, provisions et dépréciations",{"v":0,"d":"0.00 €"},{"$f":"CRP_PGFP!$F$34+CRP_PGFP!$F$35+CRP_PGFP!$F$36+CRP_PGFP_SF!$F$34+CRP_PGFP_SF!$F$35+CRP_PGFP_SF!$F$36","v":{"v":0,"d":"0.00 €"}}]
["(FRE) Reports en fonds dédiés (sauf c/68921) - ESSMS privés",{"v":0,"d":"0.00 €"},{"$f":"CRP_PGFP!$F$37+CRP_PGFP_SF!$F$37","v":{"v":0,"d":"0.00 €"}}]
["Flux internes (produits) (-)",{"v":0,"d":"0.00 €"},{"$f":"SUM(C469:C476)","v":{"v":0,"d":"0.00 €"}}]
["(FRI) Reprises sur provisions réglementées  impactant le FRI",{"v":0,"d":"0.00 €"},{"$f":"CRP_PGFP!$F$66+CRP_PGFP!$F$68+CRP_PGFP_SF!$F$66+CRP_PGFP_SF!$F$68","v":{"v":0,"d":"0.00 €"}}]
["(FRI) Reprises sur amortissements, autres provisions et dépréciations impactant le FRI (dont c/78748)",{"v":0,"d":"0.00 €"},{"$f":"CRP_PGFP!$F$69+CRP_PGFP_SF!$F$69+CRP_PGFP!$F$67+CRP_PGFP_SF!$F$67+CRP_PGFP!$F$70+CRP_PGFP_SF!$F$70","v":{"v":0,"d":"0.00 €"}}]
["(FRE) Reprises sur autres provisions et dépréciations",{"v":0,"d":"0.00 €"},{"$f":"CRP_PGFP!$F$72+CRP_PGFP!$F$73+CRP_PGFP!$F$74+CRP_PGFP_SF!$F$72+CRP_PGFP_SF!$F$73+CRP_PGFP_SF!$F$74","v":{"v":0,"d":"0.00 €"}}]
["(FRI) Quote-part des subventions virées au résultat de l'exercice",{"v":0,"d":"0.00 €"},{"$f":"CRP_PGFP!$F$64+CRP_PGFP_SF!$F$64","v":{"v":0,"d":"0.00 €"}}]
["(FRI) Quote-part d'éléments du fonds associatif virée au compte de résultat",{"v":0,"d":"0.00 €"},{"$f":"CRP_PGFP!$F$65+CRP_PGFP_SF!$F$65","v":{"v":0,"d":"0.00 €"}}]
["(FRI) Produits des cessions d'immobilisations incorporelles et corporelles",{"v":0,"d":"0.00 €"},{"$f":"CRP_PGFP!$F$63+CRP_PGFP_SF!$F$63","v":{"v":0,"d":"0.00 €"}}]
["(FRI) Utilisation des fonds dédiés à l'investissement sur concours publics des entités gestionnaires d'ESSMS (c/78921) - ESSMS privés",{"v":0,"d":"0.00 €"},{"$f":"CRP_PGFP!$F$71+CRP_PGFP_SF!$F$71","v":{"v":0,"d":"0.00 €"}}]
["(FRE) Utilisation de fonds dédiés et de fonds reportés (sauf c/78921) - ESSMS privés",{"v":0,"d":"0.00 €"},{"$f":"CRP_PGFP!$F$75+CRP_PGFP_SF!$F$75","v":{"v":0,"d":"0.00 €"}}]
["Capacité (+) / Insuffisance (-) d'autofinancement prévisionnelle",{"v":0,"d":"0.00 €"},{"$f":"C457+C460-C468","v":{"v":0,"d":"0.00 €"}}]
["Dont part affectant le fonds de roulement d'investissement FRI = (3)",{"v":0,"d":"0.00 €"},{"$f":"C461+C462+C463+C464-C469-C470-C472-C473-C474","v":{"v":0,"d":"0.00 €"}}]
["Dont part affectant le fonds de roulement d'exploitation FRE = (4)",{"$f":"SUM(C479:IV479)","v":{"v":0,"d":"0.00 €"}},{"$f":"C459+C466+C467-C471-C476","v":{"v":0,"d":"0.00 €"}}]
["(*) : Les lignes précédées d'un astérisque, qui servent à collecter des données intermédiaires nécessaires au calcul d'indicateurs, peuvent être masquées. ",0]
[null,0,"N+1"]
["Augmentation des financements stables d'investissement de la période = (5)",{"v":0,"d":"0.00 €"},{"$f":"SUM(C483:C490)","v":{"v":0,"d":"0.00 €"}}]
["CAF ou IAF (signe -) prévisionnelle affectée au FRI =(3)",{"v":0,"d":"0.00 €"},{"$f":"C478","v":{"v":0,"d":"0.00 €"}}]
["Affectation des résultats à l'investissement",{"v":0,"d":"0.00 €"}]
["Apports",{"v":0,"d":"0.00 €"}]
["Subventions ",{"v":0,"d":"0.00 €"}]
["Emprunts",{"v":0,"d":"0.00 €"}]
["Produits de cessions d'immobilisations",{"v":0,"d":"0.00 €"}]
["Comptes de liaison investissement (ESSMS privés uniquement)",{"v":0,"d":"0.00 €"}]
["Autres",{"v":0,"d":"0.00 €"}]
["Diminution des financements stables d'investissement de la période =(6)",{"v":0,"d":"0.00 €"},{"$f":"C492+C493+C503+C504+C505","v":{"v":0,"d":"0.00 €"}}]
["Fonds associatifs, apports, dotations et réserves (réduction) (ESSMS privés uniquement)",{"v":0,"d":"0.00 €"}]
["Remboursements des emprunts",{"v":0,"d":"0.00 €"}]
["Acquisition d'immobilisations :",{"v":0,"d":"0.00 €"},{"$f":"SUM(C495:C502)","v":{"v":0,"d":"0.00 €"}}]
["Immobilisations incorporelles",{"v":0,"d":"0.00 €"}]
["Terrains",{"v":0,"d":"0.00 €"}]
["Agencements de terrains",{"v":0,"d":"0.00 €"}]
["Constructions",{"v":0,"d":"0.00 €"}]
["Installations techniques matériel et outillage",{"v":0,"d":"0.00 €"}]
["Autres immobilisations corporelles",{"v":0,"d":"0.00 €"}]
["Immobilisations en cours",{"v":0,"d":"0.00 €"}]
["Immobilisations financières",{"$f":"SUM(C502:IV502)","v":{"v":0,"d":"0.00 €"}}]
["Reprise sur les réserves de compensation des charges d'amortissement",{"v":0,"d":"0.00 €"},{"$f":"C511","v":{"v":0,"d":"0.00 €"}}]
["Autres dépenses",{"v":0,"d":"0.00 €"}]
["Comptes de liaison investissement (ESSMS privés uniquement)",{"v":0,"d":"0.00 €"}]
["Variations du FRI (5) - (6) = (7)",{"v":0,"d":"0.00 €"},{"$f":"C482-C491","v":{"v":0,"d":"0.00 €"}}]
["FRI initial (8)",{"v":0,"d":"0.00 €"}]
["FRI cumulé de fin de période = (7) + (8) = (9)",{"v":0,"d":"0.00 €"},{"$f":"C506+C507","v":{"v":0,"d":"0.00 €"}}]
["Augmentation des financements stables d'exploitation de la période = (10)",{"v":0,"d":"0.00 €"},{"$f":"C510+C511+C512","v":{"v":0,"d":"0.00 €"}}]
["CAF  ou IAF (signe -) prévisionnelle affectée au FRE",{"v":0,"d":"0.00 €"},{"$f":"C479","v":{"v":0,"d":"0.00 €"}}]
["Reprises sur les réserves de compensation des charges d'amortissement",{"v":0,"d":"0.00 €"},{"$f":"CRP_PGFP!$F$80+CRP_PGFP_SF!$F$80","v":{"v":0,"d":"0.00 €"}}]
["Comptes de liaison stable exploitation (établissements privés)",{"v":0,"d":"0.00 €"}]
["Diminution des financements stables d'exploitation de la période = (11)",{"v":0,"d":"0.00 €"},{"$f":"SUM(C514:C516)","v":{"v":0,"d":"0.00 €"}}]
["Reprise à l'investissement des réserves de couverture du BFR",{"v":0,"d":"0.00 €"}]
["Affectation des résultats à l'investissement",{"v":0,"d":"0.00 €"}]
["Comptes de liaison stable exploitation (ESSMS privés uniquement)",{"v":0,"d":"0.00 €"}]
["Variations du FRE (10) - (11) = (12)",{"v":0,"d":"0.00 €"},{"$f":"C509-C513","v":{"v":0,"d":"0.00 €"}}]
["FRE initial (13)",{"v":0,"d":"0.00 €"}]
["FRE cumulé de fin de période = (12) + (13) = (14)",{"v":0,"d":"0.00 €"},{"$f":"C517+C518","v":{"v":0,"d":"0.00 €"}}]
[null,0]
["Apport ou prélèvement sur le fonds de roulement net global = (7) + (12) = (15)",{"v":0,"d":"0.00 €"},{"$f":"C506+C517","v":{"v":0,"d":"0.00 €"}}]
["FRNG initial = (16)",{"v":0,"d":"0.00 €"}]
["Fonds de Roulement Net Global (FRNG) de fin de période = (15) + (16) = (17)",{"v":0,"d":"0.00 €"},{"$f":"C521+C522","v":{"v":0,"d":"0.00 €"}}]
[null,0]
[null,0,"N+1"]
["Augmentation du besoin en fonds de roulement de la période = (18)",{"v":0,"d":"0.00 €"},{"$f":"SUM(C527:C530)","v":{"v":0,"d":"0.00 €"}}]
["Augmentation des stocks",{"v":0,"d":"0.00 €"}]
["Augmentation des créances (effet volume ou prix)",{"v":0,"d":"0.00 €"}]
["Diminution des dettes fournisseurs (effet volume ou prix)",{"v":0,"d":"0.00 €"}]
["Diminution des autres dettes d'exploitation",{"v":0,"d":"0.00 €"}]
["Diminution du besoin en fonds de roulement de la période = (19)",{"v":0,"d":"0.00 €"},{"$f":"SUM(C532:C535)","v":{"v":0,"d":"0.00 €"}}]
["Diminution des stocks",{"v":0,"d":"0.00 €"}]
["Diminution des créances (effet volume ou prix)",{"v":0,"d":"0.00 €"}]
["Augmentation des dettes fournisseurs",{"v":0,"d":"0.00 €"}]
["Augmentation des autres dettes",{"v":0,"d":"0.00 €"}]
["Variations du BFR = (18) - (19) = (20)",{"v":0,"d":"0.00 €"},{"$f":"C526-C531","v":{"v":0,"d":"0.00 €"}}]
["BFR initial (21)",{"v":0,"d":"0.00 €"}]
["BFR cumulé fin de période = (20) + (21) = (22)",{"v":0,"d":"0.00 €"},{"$f":"C536+C537","v":{"v":0,"d":"0.00 €"}}]
["Variations de la trésorerie sur la période = (7) + (12) - (20) = (23)",{"v":0,"d":"0.00 €"},{"$f":"C521-C536","v":{"v":0,"d":"0.00 €"}}]
["Trésorerie Initiale = (24)",{"v":0,"d":"0.00 €"}]
["Trésorerie de fin de période = (23) + (24) = (25)",{"v":0,"d":"0.00 €"},{"$f":"C539+C540","v":{"v":0,"d":"0.00 €"}}]
["Variations des financements à court terme = (26)",{"v":0,"d":"0.00 €"}]
["Liquidités de fin de période = (25) + (26)",{"v":0,"d":"0.00 €"},{"$f":"C541+C542","v":{"v":0,"d":"0.00 €"}}]
[null,0]
[null,0]
[null,0]
["Données complémentaires nécessaires au calcul des ratios",0]
["Montant cumulé des emprunts en fin d'année (1)",{"v":0,"d":"0.00 €"}]
["Montant cumulé des financements stables du FRI en fin d'année(hors amortissements)",{"v":0,"d":"0.00 €"}]
["Montant cumulé de l'actif immobilisé brut en fin d'année (2)",{"v":0,"d":"0.00 €"}]
["Mesures correctives le cas échéant (sorties d'immobilisations, etc.)",{"v":0,"d":"0.00 €"}]
["Montant cumulé de l'actif immobilisé brut en fin d'année pris en compte pour le calcul du taux de vétusté",{"v":0,"d":"0.00 €"},{"$f":"C550-C551","v":{"v":0,"d":"0.00 €"}}]
["Montant cumulé des amortissements en fin d'année (2)",{"v":0,"d":"0.00 €"},{"$f":"B555+C462","v":{"v":0,"d":"0.00 €"}}]
["Mesures correctives le cas échéant",{"v":0,"d":"0.00 €"}]
["Montant cumulé des amortissements en fin d'année pris en compte pour le calcul du taux de vétusté",{"v":0,"d":"0.00 €"}]
[null,0]
[null,0]
["Taux d'endettement (< 50%)",{"v":0,"d":"0.00%"},{"$f":"IF(C549=0,0,C548/C549)","v":{"v":0,"d":"0.00%"}}]
["Durée apparente de la dette (< 10 ans)",{"v":0,"d":"0.00"},{"$f":"IF(C477=0,0,C548/C477)","v":{"v":0,"d":"0.00"}}]
["CAF / Remboursement annuel du capital des emprunts (>1)",{"v":0,"d":"0.00%"},{"$f":"IF(C493=0,0,C477/C493)","v":{"v":0,"d":"0.00%"}}]
["Taux de CAF en % des produits courants",{"v":0,"d":"0.00%"},{"$f":"IF(C444=0,0,C477/C444)","v":{"v":0,"d":"0.00%"}}]
["Taux de vétusté global des immobilisations (2)",{"v":0,"d":"0.00"},{"$f":"IF(C552=0,0,C555/C552)","v":{"v":0,"d":"0.00"}}]
["Marge brute",{"v":0,"d":"0.00 €"},{"$f":"C437+C439-C446-C449-C452-C453","v":{"v":0,"d":"0.00 €"}}]
["Taux de marge brute en % des produits courants",{"v":0,"d":"0.00%"},{"$f":"IF((C437+C439)=0,0,C563/(C437+C439))","v":{"v":0,"d":"0.00%"}}]
[null,0]
["(1): Pour N-1, comptes 16 hors c/165, c/168 et c/169",{"$f":"SUM(C566:IV566)","v":0}]
["(2) : Le taux de vétusté pour l'année N-1 est calculé à partir des données du tableau \"FDR\". Pour les années qui suivent, les acquisitions nouvelles et les dotations aux amortissements sont intégrées automatiquement à partif des données \"CAF\" et \"FRI\" ci-dessus. Si nécessaire, ces données doivent être corrigées (notamment en cas de sorties d'immobilisation).",{"$f":"SUM(C567:IV567)","v":0}]
[null,{"$f":"SUM(C568:IV568)","v":0}]
[null,{"$f":"SUM(C569:IV569)","v":0}]
[]
[]
["PGFP N+2"]
["Produits",{"$f":"SUM(C573:IV573)","v":0}]
["Groupe I : Produits de la tarification",{"v":0,"d":"0.00 €"},{"$f":"CRP_PGFP!$G$47+CRP_PGFP_SF!$G$47","v":{"v":0,"d":"0.00 €"}}]
["(*) Dont aides ponctuelles par dotations non  reconductibles ",{"v":0,"d":"0.00 €"},{"$f":"CRP_PGFP!$G$53+CRP_PGFP!$G$54+CRP_PGFP!$G$55+CRP_PGFP_SF!$G$53+CRP_PGFP_SF!$G$54+CRP_PGFP_SF!$G$55","v":{"v":0,"d":"0.00 €"}}]
["Groupe II : Autres produits d'exploitation",{"v":0,"d":"0.00 €"},{"$f":"CRP_PGFP!$G$56+CRP_PGFP_SF!$G$56","v":{"v":0,"d":"0.00 €"}}]
["(*) Dont produits du compte 70",{"v":0,"d":"0.00 €"}]
["(*) Dont produits du compte 72",{"v":0,"d":"0.00 €"}]
["Groupe III : Produits financiers, exceptionnels et non encaissables",{"v":0,"d":"0.00 €"},{"$f":"CRP_PGFP!$G$60+CRP_PGFP_SF!$G$60","v":{"v":0,"d":"0.00 €"}}]
["Total des produits (1)",{"v":0,"d":"0.00 €"},{"$f":"C574+C576+C579","v":{"v":0,"d":"0.00 €"}}]
["Dont produits (hors c/747, 757, 775, 777 et 78)",{"v":0,"d":"0.00 €"},{"$f":"CRP_PGFP!$G$77-CRP_PGFP!$G$63-CRP_PGFP!$G$64-CRP_PGFP!$G$65-CRP_PGFP!$G$66-CRP_PGFP!$G$67-CRP_PGFP!$G$68-CRP_PGFP!$G$69-CRP_PGFP!$G$70-CRP_PGFP!$G$71-CRP_PGFP!$G$72-CRP_PGFP!$G$73-CRP_PGFP!$G$74-CRP_PGFP!$G$75+CRP_PGFP_SF!$G$77-CRP_PGFP_SF!$G$63-CRP_PGFP_SF!$G$64-CRP_PGFP_SF!$G$65-CRP_PGFP_SF!$G$66-CRP_PGFP_SF!$G$67-CRP_PGFP_SF!$G$68-CRP_PGFP_SF!$G$69-CRP_PGFP_SF!$G$70-CRP_PGFP_SF!$G$71-CRP_PGFP_SF!$G$72-CRP_PGFP_SF!$G$73-CRP_PGFP_SF!$G$74-CRP_PGFP_SF!$G$75","v":{"v":0,"d":"0.00 €"}}]
["Charges",{"v":0,"d":"0.00 €"}]
["Groupe I : Charges afférentes à l'exploitation courante",{"v":0,"d":"0.00 €"},{"$f":"CRP_PGFP!$G$9+CRP_PGFP_SF!$G$9","v":{"v":0,"d":"0.00 €"}}]
["(*) Dont achats stockés et variation des stocks",{"v":0,"d":"0.00 €"}]
["(*) Dont comptes 709 et 713 en charges",{"v":0,"d":"0.00 €"}]
["Groupe II : Charges afférentes au personnel",{"v":0,"d":"0.00 €"},{"$f":"CRP_PGFP!$G$13+CRP_PGFP_SF!$G$13","v":{"v":0,"d":"0.00 €"}}]
["Groupe III : Charges afférentes à la structure",{"v":0,"d":"0.00 €"},{"$f":"CRP_PGFP!$G$18+CRP_PGFP_SF!$G$18","v":{"v":0,"d":"0.00 €"}}]
["(*) Dont charges non décaissables",{"v":0,"d":"0.00 €"}]
["(*) Dont charges des comptes 61 et 62 du groupe 3",{"v":0,"d":"0.00 €"},{"$f":"CRP_PGFP!$G$19+CRP_PGFP!$G$23+CRP_PGFP_SF!$G$19+CRP_PGFP_SF!$G$23","v":{"v":0,"d":"0.00 €"}}]
["(*) Dont charges des comptes 63 à 65 du Groupe 3 des dépenses",{"v":0,"d":"0.00 €"},{"$f":"CRP_PGFP!$G$21+CRP_PGFP!$G$22+CRP_PGFP_SF!$G$21+CRP_PGFP_SF!$G$22","v":{"v":0,"d":"0.00 €"}}]
["Total des charges (2)",{"v":0,"d":"0.00 €"},{"$f":"C583+C586+C587","v":{"v":0,"d":"0.00 €"}}]
["(*) Dont charges des comptes 60 à 62",{"v":0,"d":"0.00 €"},{"$f":"CRP_PGFP!$G$9+CRP_PGFP!$G$19+CRP_PGFP!$G$23+CRP_PGFP_SF!$G$9+CRP_PGFP_SF!$G$19+CRP_PGFP_SF!$G$23+'CRPP NON SOUMIS EQUIL'!$F$39+'CRPP NON SOUMIS EQUIL'!$F$40+'CRPP SOUMIS EQUILIBRE'!$F$39+'CRPP SOUMIS EQUILIBRE'!$F$40+CRP_SF!$F$39+CRP_SF!$F$40+CRP_PGFP!$F$14+CRP_PGFP!$G$14+CRP_PGFP_SF!$F$14+CRP_PGFP_SF!$G$14","v":{"v":0,"d":"0.00 €"}}]
["(*) Dont charges des comptes 63 et 645 à 647",{"v":0,"d":"0.00 €"}]
["Résultat prévisionnel (1) - (2) ",{"v":0,"d":"0.00 €"},{"$f":"C580-C591","v":{"v":0,"d":"0.00 €"}}]
[null,0]
["(FRE) Résultat prévisionnel",{"v":0,"d":"0.00 €"},{"$f":"C594","v":{"v":0,"d":"0.00 €"}}]
["Flux internes (charges) (+)",{"v":0,"d":"0.00 €"},{"$f":"SUM(C598:C604)","v":{"v":0,"d":"0.00 €"}}]
["(FRI) Valeur comptable des immobilisations incorporelles et corporelles cédées",{"v":0,"d":"0.00 €"},{"$f":"CRP_PGFP!$G$25+CRP_PGFP_SF!$G$25","v":{"v":0,"d":"0.00 €"}}]
["(FRI) Dotations aux amortissements des immobilisations incorporelles et corporelles",{"v":0,"d":"0.00 €"},{"$f":"CRP_PGFP!$G$27+CRP_PGFP!$G$26+CRP_PGFP_SF!$G$27+CRP_PGFP_SF!$G$26","v":{"v":0,"d":"0.00 €"}}]
["(FRI) Dotations aux provisions réglementées impactant le FRI",{"v":0,"d":"0.00 €"},{"$f":"CRP_PGFP!$G$30+CRP_PGFP!$G$31+CRP_PGFP_SF!$G$30+CRP_PGFP_SF!$G$31","v":{"v":0,"d":"0.00 €"}}]
["(FRI) Autres dotations aux amortissements,  provisions et dépréciations impactant le FRI (dont c/68748)",{"v":0,"d":"0.00 €"},{"$f":"CRP_PGFP!$G$28+CRP_PGFP!$G$29+CRP_PGFP!$G$32+CRP_PGFP_SF!$G$28+CRP_PGFP_SF!$G$29+CRP_PGFP_SF!$G$32","v":{"v":0,"d":"0.00 €"}}]
["(FRI) Reports en fonds dédiés à l'investissement sur concours publics des entités gestionnaires d'ESSMS (c/68921) - ESSMS privés",{"v":0,"d":"0.00 €"},{"$f":"CRP_PGFP!$G$33+CRP_PGFP_SF!$G$33","v":{"v":0,"d":"0.00 €"}}]
["(FRE) Autres dotations aux amortissements, provisions et dépréciations",{"v":0,"d":"0.00 €"},{"$f":"CRP_PGFP!$G$34+CRP_PGFP!$G$35+CRP_PGFP!$G$36+CRP_PGFP_SF!$G$34+CRP_PGFP_SF!$G$35+CRP_PGFP_SF!$G$36","v":{"v":0,"d":"0.00 €"}}]
["(FRE) Reports en fonds dédiés (sauf c/68921) - ESSMS privés",{"v":0,"d":"0.00 €"},{"$f":"CRP_PGFP!$G$37+CRP_PGFP_SF!$G$37","v":{"v":0,"d":"0.00 €"}}]
["Flux internes (produits) (-)",{"v":0,"d":"0.00 €"},{"$f":"SUM(C606:C613)","v":{"v":0,"d":"0.00 €"}}]
["(FRI) Reprises sur provisions réglementées  impactant le FRI",{"v":0,"d":"0.00 €"},{"$f":"CRP_PGFP!$G$66+CRP_PGFP!$G$68+CRP_PGFP_SF!$G$66+CRP_PGFP_SF!$G$68","v":{"v":0,"d":"0.00 €"}}]
["(FRI) Reprises sur amortissements, autres provisions et dépréciations impactant le FRI (dont c/78748)",{"v":0,"d":"0.00 €"},{"$f":"CRP_PGFP!$G$69+CRP_PGFP_SF!$G$69+CRP_PGFP!$G$67+CRP_PGFP_SF!$G$67+CRP_PGFP!$G$70+CRP_PGFP_SF!$G$70","v":{"v":0,"d":"0.00 €"}}]
["(FRE) Reprises sur autres provisions et dépréciations",{"v":0,"d":"0.00 €"},{"$f":"CRP_PGFP!$G$72+CRP_PGFP!$G$73+CRP_PGFP!$G$74+CRP_PGFP_SF!$G$72+CRP_PGFP_SF!$G$73+CRP_PGFP_SF!$G$74","v":{"v":0,"d":"0.00 €"}}]
["(FRI) Quote-part des subventions virées au résultat de l'exercice",{"v":0,"d":"0.00 €"},{"$f":"CRP_PGFP!$G$64+CRP_PGFP_SF!$G$64","v":{"v":0,"d":"0.00 €"}}]
["(FRI) Quote-part d'éléments du fonds associatif virée au compte de résultat",{"v":0,"d":"0.00 €"},{"$f":"CRP_PGFP!$G$65+CRP_PGFP_SF!$G$65","v":{"v":0,"d":"0.00 €"}}]
["(FRI) Produits des cessions d'immobilisations incorporelles et corporelles",{"v":0,"d":"0.00 €"},{"$f":"CRP_PGFP!$G$63+CRP_PGFP_SF!$G$63","v":{"v":0,"d":"0.00 €"}}]
["(FRI) Utilisation des fonds dédiés à l'investissement sur concours publics des entités gestionnaires d'ESSMS (c/78921) - ESSMS privés",{"v":0,"d":"0.00 €"},{"$f":"CRP_PGFP!$G$71+CRP_PGFP_SF!$G$71","v":{"v":0,"d":"0.00 €"}}]
["(FRE) Utilisation de fonds dédiés et de fonds reportés (sauf c/78921) - ESSMS privés",{"v":0,"d":"0.00 €"},{"$f":"CRP_PGFP!$G$75+CRP_PGFP_SF!$G$75","v":{"v":0,"d":"0.00 €"}}]
["Capacité (+) / Insuffisance (-) d'autofinancement prévisionnelle",{"v":0,"d":"0.00 €"},{"$f":"C594+C597-C605","v":{"v":0,"d":"0.00 €"}}]
["Dont part affectant le fonds de roulement d'investissement FRI = (3)",{"v":0,"d":"0.00 €"},{"$f":"C598+C599+C600+C601-C606-C607-C609-C610-C611","v":{"v":0,"d":"0.00 €"}}]
["Dont part affectant le fonds de roulement d'exploitation FRE = (4)",{"v":0,"d":"0.00 €"},{"$f":"C596+C603+C604-C608-C613","v":{"v":0,"d":"0.00 €"}}]
["(*) : Les lignes précédées d'un astérisque, qui servent à collecter des données intermédiaires nécessaires au calcul d'indicateurs, peuvent être masquées. ",0]
[null,0,"N+2"]
["Augmentation des financements stables d'investissement de la période = (5)",{"v":0,"d":"0.00 €"},{"$f":"SUM(C620:C627)","v":{"v":0,"d":"0.00 €"}}]
["CAF ou IAF (signe -) prévisionnelle affectée au FRI =(3)",{"v":0,"d":"0.00 €"},{"$f":"C615","v":{"v":0,"d":"0.00 €"}}]
["Affectation des résultats à l'investissement",{"v":0,"d":"0.00 €"}]
["Apports",{"v":0,"d":"0.00 €"}]
["Subventions ",{"v":0,"d":"0.00 €"}]
["Emprunts",{"v":0,"d":"0.00 €"}]
["Produits de cessions d'immobilisations",{"v":0,"d":"0.00 €"}]
["Comptes de liaison investissement (ESSMS privés uniquement)",{"v":0,"d":"0.00 €"}]
["Autres",{"v":0,"d":"0.00 €"}]
["Diminution des financements stables d'investissement de la période =(6)",{"v":0,"d":"0.00 €"},{"$f":"C629+C630+C640+C641+C642","v":{"v":0,"d":"0.00 €"}}]
["Fonds associatifs, apports, dotations et réserves (réduction) (ESSMS privés uniquement)",{"v":0,"d":"0.00 €"}]
["Remboursements des emprunts",{"v":0,"d":"0.00 €"}]
["Acquisition d'immobilisations :",{"v":0,"d":"0.00 €"},{"$f":"SUM(C632:C639)","v":{"v":0,"d":"0.00 €"}}]
["Immobilisations incorporelles",{"v":0,"d":"0.00 €"}]
["Terrains",{"v":0,"d":"0.00 €"}]
["Agencements de terrains",{"v":0,"d":"0.00 €"}]
["Constructions",{"v":0,"d":"0.00 €"}]
["Installations techniques matériel et outillage",{"v":0,"d":"0.00 €"}]
["Autres immobilisations corporelles",{"v":0,"d":"0.00 €"}]
["Immobilisations en cours",{"v":0,"d":"0.00 €"}]
["Immobilisations financières",{"$f":"SUM(C639:IV639)","v":{"v":0,"d":"0.00 €"}}]
["Reprise sur les réserves de compensation des charges d'amortissement",{"v":0,"d":"0.00 €"},{"$f":"C648","v":{"v":0,"d":"0.00 €"}}]
["Autres dépenses",{"v":0,"d":"0.00 €"}]
["Comptes de liaison investissement (ESSMS privés uniquement)",{"v":0,"d":"0.00 €"}]
["Variations du FRI (5) - (6) = (7)",{"v":0,"d":"0.00 €"},{"$f":"C619-C628","v":{"v":0,"d":"0.00 €"}}]
["FRI initial (8)",{"v":0,"d":"0.00 €"}]
["FRI cumulé de fin de période = (7) + (8) = (9)",{"v":0,"d":"0.00 €"},{"$f":"C643+C644","v":{"v":0,"d":"0.00 €"}}]
["Augmentation des financements stables d'exploitation de la période = (10)",{"v":0,"d":"0.00 €"},{"$f":"C647+C648+C649","v":{"v":0,"d":"0.00 €"}}]
["CAF  ou IAF (signe -) prévisionnelle affectée au FRE",{"v":0,"d":"0.00 €"},{"$f":"C616","v":{"v":0,"d":"0.00 €"}}]
["Reprises sur les réserves de compensation des charges d'amortissement",{"v":0,"d":"0.00 €"},{"$f":"CRP_PGFP!$G$80+CRP_PGFP_SF!$G$80","v":{"v":0,"d":"0.00 €"}}]
["Comptes de liaison stable exploitation (établissements privés)",{"v":0,"d":"0.00 €"}]
["Diminution des financements stables d'exploitation de la période = (11)",{"v":0,"d":"0.00 €"},{"$f":"SUM(C651:C653)","v":{"v":0,"d":"0.00 €"}}]
["Reprise à l'investissement des réserves de couverture du BFR",{"v":0,"d":"0.00 €"}]
["Affectation des résultats à l'investissement",{"v":0,"d":"0.00 €"}]
["Comptes de liaison stable exploitation (ESSMS privés uniquement)",{"v":0,"d":"0.00 €"}]
["Variations du FRE (10) - (11) = (12)",{"v":0,"d":"0.00 €"},{"$f":"C646-C650","v":{"v":0,"d":"0.00 €"}}]
["FRE initial (13)",{"v":0,"d":"0.00 €"}]
["FRE cumulé de fin de période = (12) + (13) = (14)",{"v":0,"d":"0.00 €"},{"$f":"C654+C655","v":{"v":0,"d":"0.00 €"}}]
[null,0]
["Apport ou prélèvement sur le fonds de roulement net global = (7) + (12) = (15)",{"v":0,"d":"0.00 €"},{"$f":"C643+C654","v":{"v":0,"d":"0.00 €"}}]
["FRNG initial = (16)",{"v":0,"d":"0.00 €"}]
["Fonds de Roulement Net Global (FRNG) de fin de période = (15) + (16) = (17)",{"v":0,"d":"0.00 €"},{"$f":"C658+C659","v":{"v":0,"d":"0.00 €"}}]
[null,0]
[null,0,"N+2"]
["Augmentation du besoin en fonds de roulement de la période = (18)",{"v":0,"d":"0.00 €"},{"$f":"SUM(C664:C667)","v":{"v":0,"d":"0.00 €"}}]
["Augmentation des stocks",{"v":0,"d":"0.00 €"}]
["Augmentation des créances (effet volume ou prix)",{"v":0,"d":"0.00 €"}]
["Diminution des dettes fournisseurs (effet volume ou prix)",{"v":0,"d":"0.00 €"}]
["Diminution des autres dettes d'exploitation",{"v":0,"d":"0.00 €"}]
["Diminution du besoin en fonds de roulement de la période = (19)",{"v":0,"d":"0.00 €"},{"$f":"SUM(C669:C672)","v":{"v":0,"d":"0.00 €"}}]
["Diminution des stocks",{"v":0,"d":"0.00 €"}]
["Diminution des créances (effet volume ou prix)",{"v":0,"d":"0.00 €"}]
["Augmentation des dettes fournisseurs",{"v":0,"d":"0.00 €"}]
["Augmentation des autres dettes",{"v":0,"d":"0.00 €"}]
["Variations du BFR = (18) - (19) = (20)",{"v":0,"d":"0.00 €"},{"$f":"C663-C668","v":{"v":0,"d":"0.00 €"}}]
["BFR initial (21)",{"v":0,"d":"0.00 €"}]
["BFR cumulé fin de période = (20) + (21) = (22)",{"v":0,"d":"0.00 €"},{"$f":"C673+C674","v":{"v":0,"d":"0.00 €"}}]
["Variations de la trésorerie sur la période = (7) + (12) - (20) = (23)",{"v":0,"d":"0.00 €"},{"$f":"C658-C673","v":{"v":0,"d":"0.00 €"}}]
["Trésorerie Initiale = (24)",{"v":0,"d":"0.00 €"}]
["Trésorerie de fin de période = (23) + (24) = (25)",{"v":0,"d":"0.00 €"},{"$f":"C676+C677","v":{"v":0,"d":"0.00 €"}}]
["Variations des financements à court terme = (26)",{"v":0,"d":"0.00 €"}]
["Liquidités de fin de période = (25) + (26)",{"v":0,"d":"0.00 €"},{"$f":"C678+C679","v":{"v":0,"d":"0.00 €"}}]
[null,0]
[null,0]
[null,0]
["Données complémentaires nécessaires au calcul des ratios",0]
["Montant cumulé des emprunts en fin d'année (1)",{"v":0,"d":"0.00 €"}]
["Montant cumulé des financements stables du FRI en fin d'année(hors amortissements)",{"v":0,"d":"0.00 €"}]
["Montant cumulé de l'actif immobilisé brut en fin d'année (2)",{"v":0,"d":"0.00 €"}]
["Mesures correctives le cas échéant (sorties d'immobilisations, etc.)",{"v":0,"d":"0.00 €"}]
["Montant cumulé de l'actif immobilisé brut en fin d'année pris en compte pour le calcul du taux de vétusté",{"v":0,"d":"0.00 €"},{"$f":"C687-C688","v":{"v":0,"d":"0.00 €"}}]
["Montant cumulé des amortissements en fin d'année (2)",{"v":0,"d":"0.00 €"}]
["Mesures correctives le cas échéant",{"v":0,"d":"0.00 €"}]
["Montant cumulé des amortissements en fin d'année pris en compte pour le calcul du taux de vétusté",{"v":0,"d":"0.00 €"},{"$f":"C690-C691","v":{"v":0,"d":"0.00 €"}}]
[null,0]
[null,0]
["Taux d'endettement (< 50%)",{"v":0,"d":"0.00%"},{"$f":"IF(C686=0,0,C685/C686)","v":{"v":0,"d":"0.00%"}}]
["Durée apparente de la dette (< 10 ans)",{"v":0,"d":"0.00"},{"$f":"IF(C614=0,0,C685/C614)","v":{"v":0,"d":"0.00"}}]
["CAF / Remboursement annuel du capital des emprunts (>1)",{"v":0,"d":"0.00%"},{"$f":"IF(C630=0,0,C614/C630)","v":{"v":0,"d":"0.00%"}}]
["Taux de CAF en % des produits courants",{"v":0,"d":"0.00%"},{"$f":"IF(C581=0,0,C614/C581)","v":{"v":0,"d":"0.00%"}}]
["Taux de vétusté global des immobilisations (2)",{"v":0,"d":"0.00"},{"$f":"IF(C689=0,0,C692/C689)","v":{"v":0,"d":"0.00"}}]
["Marge brute",{"v":0,"d":"0.00 €"},{"$f":"C574+C576-C583-C586-C589-C590","v":{"v":0,"d":"0.00 €"}}]
["Taux de marge brute en % des produits courants",{"v":0,"d":"0.00%"},{"$f":"IF((C574+C576)=0,0,C700/(C574+C576))","v":{"v":0,"d":"0.00%"}}]
[null,0]
["(1): Pour N-1, comptes 16 hors c/165, c/168 et c/169",{"$f":"SUM(C703:IV703)","v":0}]
["(2) : Le taux de vétusté pour l'année N-1 est calculé à partir des données du tableau \"FDR\". Pour les années qui suivent, les acquisitions nouvelles et les dotations aux amortissements sont intégrées automatiquement à partif des données \"CAF\" et \"FRI\" ci-dessus. Si nécessaire, ces données doivent être corrigées (notamment en cas de sorties d'immobilisation).",{"$f":"SUM(C704:IV704)","v":0}]
[null,{"$f":"SUM(C705:IV705)","v":0}]
[]
[]
["PGFP N+3"]
["Produits",{"$f":"SUM(C709:IV709)","v":0}]
["Groupe I : Produits de la tarification",{"v":0,"d":"0.00 €"},{"$f":"CRP_PGFP!$H$47+CRP_PGFP_SF!$H$47","v":{"v":0,"d":"0.00 €"}}]
["(*) Dont aides ponctuelles par dotations non  reconductibles ",{"v":0,"d":"0.00 €"},{"$f":"CRP_PGFP!$H$53+CRP_PGFP!$H$54+CRP_PGFP!$H$55+CRP_PGFP_SF!$H$53+CRP_PGFP_SF!$H$54+CRP_PGFP_SF!$H$55","v":{"v":0,"d":"0.00 €"}}]
["Groupe II : Autres produits d'exploitation",{"v":0,"d":"0.00 €"},{"$f":"CRP_PGFP!$H$56+CRP_PGFP_SF!$H$56","v":{"v":0,"d":"0.00 €"}}]
["(*) Dont produits du compte 70",{"v":0,"d":"0.00 €"}]
["(*) Dont produits du compte 72",{"v":0,"d":"0.00 €"}]
["Groupe III : Produits financiers, exceptionnels et non encaissables",{"v":0,"d":"0.00 €"},{"$f":"CRP_PGFP!$H$60+CRP_PGFP_SF!$H$60","v":{"v":0,"d":"0.00 €"}}]
["Total des produits (1)",{"v":0,"d":"0.00 €"},{"$f":"C710+C712+C715","v":{"v":0,"d":"0.00 €"}}]
["Dont produits (hors c/747, 757, 775, 777 et 78)",{"v":0,"d":"0.00 €"},{"$f":"CRP_PGFP!$H$77-CRP_PGFP!$H$63-CRP_PGFP!$H$64-CRP_PGFP!$H$65-CRP_PGFP!$H$66-CRP_PGFP!$H$67-CRP_PGFP!$H$68-CRP_PGFP!$H$69-CRP_PGFP!$H$70-CRP_PGFP!$H$71-CRP_PGFP!$H$72-CRP_PGFP!$H$73-CRP_PGFP!$H$74-CRP_PGFP!$H$75+CRP_PGFP_SF!$H$77-CRP_PGFP_SF!$H$63-CRP_PGFP_SF!$H$64-CRP_PGFP_SF!$H$65-CRP_PGFP_SF!$H$66-CRP_PGFP_SF!$H$67-CRP_PGFP_SF!$H$68-CRP_PGFP_SF!$H$69-CRP_PGFP_SF!$H$70-CRP_PGFP_SF!$H$71-CRP_PGFP_SF!$H$72-CRP_PGFP_SF!$H$73-CRP_PGFP_SF!$H$74-CRP_PGFP_SF!$H$75","v":{"v":0,"d":"0.00 €"}}]
["Charges",{"v":0,"d":"0.00 €"}]
["Groupe I : Charges afférentes à l'exploitation courante",{"v":0,"d":"0.00 €"},{"$f":"CRP_PGFP!$H$9+CRP_PGFP_SF!$H$9","v":{"v":0,"d":"0.00 €"}}]
["(*) Dont achats stockés et variation des stocks",{"v":0,"d":"0.00 €"}]
["(*) Dont comptes 709 et 713 en charges",{"v":0,"d":"0.00 €"}]
["Groupe II : Charges afférentes au personnel",{"v":0,"d":"0.00 €"},{"$f":"CRP_PGFP!$H$13+CRP_PGFP_SF!$H$13","v":{"v":0,"d":"0.00 €"}}]
["Groupe III : Charges afférentes à la structure",{"v":0,"d":"0.00 €"},{"$f":"CRP_PGFP!$H$18+CRP_PGFP_SF!$H$18","v":{"v":0,"d":"0.00 €"}}]
["(*) Dont charges non décaissables",{"v":0,"d":"0.00 €"}]
["(*) Dont charges des comptes 61 et 62 du groupe 3",{"v":0,"d":"0.00 €"},{"$f":"CRP_PGFP!$H$19+CRP_PGFP!$H$23+CRP_PGFP_SF!$H$19+CRP_PGFP_SF!$H$23","v":{"v":0,"d":"0.00 €"}}]
["(*) Dont charges des comptes 63 à 65 du Groupe 3 des dépenses",{"v":0,"d":"0.00 €"},{"$f":"CRP_PGFP!$H$21+CRP_PGFP!$H$22+CRP_PGFP_SF!$H$21+CRP_PGFP_SF!$H$22","v":{"v":0,"d":"0.00 €"}}]
["Total des charges (2)",{"v":0,"d":"0.00 €"},{"$f":"C719+C722+C723","v":{"v":0,"d":"0.00 €"}}]
["(*) Dont charges des comptes 60 à 62",{"v":0,"d":"0.00 €"},{"$f":"CRP_PGFP!$H$9+CRP_PGFP!$H$19+CRP_PGFP!$H$23+CRP_PGFP_SF!$H$9+CRP_PGFP_SF!$H$19+CRP_PGFP_SF!$H$23+'CRPP NON SOUMIS EQUIL'!$F$39+'CRPP NON SOUMIS EQUIL'!$F$40+'CRPP SOUMIS EQUILIBRE'!$F$39+'CRPP SOUMIS EQUILIBRE'!$F$40+CRP_SF!$F$39+CRP_SF!$F$40+CRP_PGFP!$F$14+CRP_PGFP!$G$14+CRP_PGFP!$H$14+CRP_PGFP_SF!$F$14+CRP_PGFP_SF!$G$14+CRP_PGFP_SF!$H$14","v":{"v":0,"d":"0.00 €"}}]
["(*) Dont charges des comptes 63 et 645 à 647",{"v":0,"d":"0.00 €"}]
["Résultat prévisionnel (1) - (2) ",{"v":0,"d":"0.00 €"},{"$f":"C716-C727","v":{"v":0,"d":"0.00 €"}}]
[null,0]
["(FRE) Résultat prévisionnel",{"v":0,"d":"0.00 €"},{"$f":"C730","v":{"v":0,"d":"0.00 €"}}]
["Flux internes (charges) (+)",{"v":0,"d":"0.00 €"},{"$f":"SUM(C734:C740)","v":{"v":0,"d":"0.00 €"}}]
["(FRI) Valeur comptable des immobilisations incorporelles et corporelles cédées",{"v":0,"d":"0.00 €"},{"$f":"CRP_PGFP!$H$25+CRP_PGFP_SF!$H$25","v":{"v":0,"d":"0.00 €"}}]
["(FRI) Dotations aux amortissements des immobilisations incorporelles et corporelles",{"v":0,"d":"0.00 €"},{"$f":"CRP_PGFP!$H$27+CRP_PGFP!$H$26+CRP_PGFP_SF!$H$27+CRP_PGFP_SF!$H$26","v":{"v":0,"d":"0.00 €"}}]
["(FRI) Dotations aux provisions réglementées impactant le FRI",{"v":0,"d":"0.00 €"},{"$f":"CRP_PGFP!$H$30+CRP_PGFP!$H$31+CRP_PGFP_SF!$H$30+CRP_PGFP_SF!$H$31","v":{"v":0,"d":"0.00 €"}}]
["(FRI) Autres dotations aux amortissements,  provisions et dépréciations impactant le FRI (dont c/68748)",{"v":0,"d":"0.00 €"},{"$f":"CRP_PGFP!$H$28+CRP_PGFP!$H$29+CRP_PGFP!$H$32+CRP_PGFP_SF!$H$28+CRP_PGFP_SF!$H$29+CRP_PGFP_SF!$H$32","v":{"v":0,"d":"0.00 €"}}]
["(FRI) Reports en fonds dédiés à l'investissement sur concours publics des entités gestionnaires d'ESSMS (c/68921) - ESSMS privés",{"v":0,"d":"0.00 €"},{"$f":"CRP_PGFP!$H$33+CRP_PGFP_SF!$H$33","v":{"v":0,"d":"0.00 €"}}]
["(FRE) Autres dotations aux amortissements, provisions et dépréciations",{"v":0,"d":"0.00 €"},{"$f":"CRP_PGFP!$H$34+CRP_PGFP!$H$35+CRP_PGFP!$H$36+CRP_PGFP_SF!$H$34+CRP_PGFP_SF!$H$35+CRP_PGFP_SF!$H$36","v":{"v":0,"d":"0.00 €"}}]
["(FRE) Reports en fonds dédiés (sauf c/68921) - ESSMS privés",{"v":0,"d":"0.00 €"},{"$f":"CRP_PGFP!$H$37+CRP_PGFP_SF!$H$37","v":{"v":0,"d":"0.00 €"}}]
["Flux internes (produits) (-)",{"v":0,"d":"0.00 €"},{"$f":"SUM(C742:C749)","v":{"v":0,"d":"0.00 €"}}]
["(FRI) Reprises sur provisions réglementées  impactant le FRI",{"v":0,"d":"0.00 €"},{"$f":"CRP_PGFP!$H$66+CRP_PGFP!$H$68+CRP_PGFP_SF!$H$66+CRP_PGFP_SF!$H$68","v":{"v":0,"d":"0.00 €"}}]
["(FRI) Reprises sur amortissements, autres provisions et dépréciations impactant le FRI (dont c/78748)",{"v":0,"d":"0.00 €"},{"$f":"CRP_PGFP!$H$69+CRP_PGFP_SF!$H$69+CRP_PGFP!$H$67+CRP_PGFP_SF!$H$67+CRP_PGFP!$H$70+CRP_PGFP_SF!$H$70","v":{"v":0,"d":"0.00 €"}}]
["(FRE) Reprises sur autres provisions et dépréciations",{"v":0,"d":"0.00 €"},{"$f":"CRP_PGFP!$H$72+CRP_PGFP!$H$73+CRP_PGFP!$H$74+CRP_PGFP_SF!$H$72+CRP_PGFP_SF!$H$73+CRP_PGFP_SF!$H$74","v":{"v":0,"d":"0.00 €"}}]
["(FRI) Quote-part des subventions virées au résultat de l'exercice",{"v":0,"d":"0.00 €"},{"$f":"CRP_PGFP!$H$64+CRP_PGFP_SF!$H$64","v":{"v":0,"d":"0.00 €"}}]
["(FRI) Quote-part d'éléments du fonds associatif virée au compte de résultat",{"v":0,"d":"0.00 €"},{"$f":"CRP_PGFP!$H$65+CRP_PGFP_SF!$H$65","v":{"v":0,"d":"0.00 €"}}]
["(FRI) Produits des cessions d'immobilisations incorporelles et corporelles",{"v":0,"d":"0.00 €"},{"$f":"CRP_PGFP!$H$63+CRP_PGFP_SF!$H$63","v":{"v":0,"d":"0.00 €"}}]
["(FRI) Utilisation des fonds dédiés à l'investissement sur concours publics des entités gestionnaires d'ESSMS (c/78921) - ESSMS privés",{"v":0,"d":"0.00 €"},{"$f":"CRP_PGFP!$H$71+CRP_PGFP_SF!$H$71","v":{"v":0,"d":"0.00 €"}}]
["(FRE) Utilisation de fonds dédiés et de fonds reportés (sauf c/78921) - ESSMS privés",{"v":0,"d":"0.00 €"},{"$f":"CRP_PGFP!$H$75+CRP_PGFP_SF!$H$75","v":{"v":0,"d":"0.00 €"}}]
["Capacité (+) / Insuffisance (-) d'autofinancement prévisionnelle",{"v":0,"d":"0.00 €"},{"$f":"C730+C733-C741","v":{"v":0,"d":"0.00 €"}}]
["Dont part affectant le fonds de roulement d'investissement FRI = (3)",{"v":0,"d":"0.00 €"},{"$f":"C734+C735+C736+C737-C742-C743-C745-C746-C747","v":{"v":0,"d":"0.00 €"}}]
["Dont part affectant le fonds de roulement d'exploitation FRE = (4)",{"v":0,"d":"0.00 €"},{"$f":"C732+C739+C740-C744-C749","v":{"v":0,"d":"0.00 €"}}]
["(*) : Les lignes précédées d'un astérisque, qui servent à collecter des données intermédiaires nécessaires au calcul d'indicateurs, peuvent être masquées. ",0]
[null,0,"N+3"]
["Augmentation des financements stables d'investissement de la période = (5)",{"v":0,"d":"0.00 €"},{"$f":"SUM(C756:C763)","v":{"v":0,"d":"0.00 €"}}]
["CAF ou IAF (signe -) prévisionnelle affectée au FRI =(3)",{"v":0,"d":"0.00 €"},{"$f":"C751","v":{"v":0,"d":"0.00 €"}}]
["Affectation des résultats à l'investissement",{"v":0,"d":"0.00 €"}]
["Apports",{"v":0,"d":"0.00 €"}]
["Subventions ",{"v":0,"d":"0.00 €"}]
["Emprunts",{"v":0,"d":"0.00 €"}]
["Produits de cessions d'immobilisations",{"v":0,"d":"0.00 €"}]
["Comptes de liaison investissement (ESSMS privés uniquement)",{"v":0,"d":"0.00 €"}]
["Autres",{"v":0,"d":"0.00 €"}]
["Diminution des financements stables d'investissement de la période =(6)",{"v":0,"d":"0.00 €"},{"$f":"C765+C766+C776+C777+C778","v":{"v":0,"d":"0.00 €"}}]
["Fonds associatifs, apports, dotations et réserves (réduction) (ESSMS privés uniquement)",{"v":0,"d":"0.00 €"}]
["Remboursements des emprunts",{"v":0,"d":"0.00 €"}]
["Acquisition d'immobilisations :",{"v":0,"d":"0.00 €"},{"$f":"SUM(C768:C775)","v":{"v":0,"d":"0.00 €"}}]
["Immobilisations incorporelles",{"v":0,"d":"0.00 €"}]
["Terrains",{"v":0,"d":"0.00 €"}]
["Agencements de terrains",{"v":0,"d":"0.00 €"}]
["Constructions",{"v":0,"d":"0.00 €"}]
["Installations techniques matériel et outillage",{"v":0,"d":"0.00 €"}]
["Autres immobilisations corporelles",{"v":0,"d":"0.00 €"}]
["Immobilisations en cours",{"v":0,"d":"0.00 €"}]
["Immobilisations financières",{"$f":"SUM(C775:IV775)","v":{"v":0,"d":"0.00 €"}}]
["Reprise sur les réserves de compensation des charges d'amortissement",{"v":0,"d":"0.00 €"},{"$f":"C784","v":{"v":0,"d":"0.00 €"}}]
["Autres dépenses",{"v":0,"d":"0.00 €"}]
["Comptes de liaison investissement (ESSMS privés uniquement)",{"v":0,"d":"0.00 €"}]
["Variations du FRI (5) - (6) = (7)",{"v":0,"d":"0.00 €"},{"$f":"C755-C764","v":{"v":0,"d":"0.00 €"}}]
["FRI initial (8)",{"v":0,"d":"0.00 €"}]
["FRI cumulé de fin de période = (7) + (8) = (9)",{"v":0,"d":"0.00 €"},{"$f":"C779+C780","v":{"v":0,"d":"0.00 €"}}]
["Augmentation des financements stables d'exploitation de la période = (10)",{"v":0,"d":"0.00 €"},{"$f":"C783+C784+C785","v":{"v":0,"d":"0.00 €"}}]
["CAF  ou IAF (signe -) prévisionnelle affectée au FRE",{"v":0,"d":"0.00 €"},{"$f":"C752","v":{"v":0,"d":"0.00 €"}}]
["Reprises sur les réserves de compensation des charges d'amortissement",{"v":0,"d":"0.00 €"},{"$f":"CRP_PGFP!$H$80+CRP_PGFP_SF!$H$80","v":{"v":0,"d":"0.00 €"}}]
["Comptes de liaison stable exploitation (établissements privés)",{"v":0,"d":"0.00 €"}]
["Diminution des financements stables d'exploitation de la période = (11)",{"v":0,"d":"0.00 €"},{"$f":"SUM(C787:C789)","v":{"v":0,"d":"0.00 €"}}]
["Reprise à l'investissement des réserves de couverture du BFR",{"v":0,"d":"0.00 €"}]
["Affectation des résultats à l'investissement",{"v":0,"d":"0.00 €"}]
["Comptes de liaison stable exploitation (ESSMS privés uniquement)",{"v":0,"d":"0.00 €"}]
["Variations du FRE (10) - (11) = (12)",{"v":0,"d":"0.00 €"},{"$f":"C782-C786","v":{"v":0,"d":"0.00 €"}}]
["FRE initial (13)",{"v":0,"d":"0.00 €"}]
["FRE cumulé de fin de période = (12) + (13) = (14)",{"v":0,"d":"0.00 €"},{"$f":"C790+C791","v":{"v":0,"d":"0.00 €"}}]
[null,0]
["Apport ou prélèvement sur le fonds de roulement net global = (7) + (12) = (15)",{"v":0,"d":"0.00 €"},{"$f":"C779+C790","v":{"v":0,"d":"0.00 €"}}]
["FRNG initial = (16)",{"v":0,"d":"0.00 €"}]
["Fonds de Roulement Net Global (FRNG) de fin de période = (15) + (16) = (17)",{"v":0,"d":"0.00 €"},{"$f":"C794+C795","v":{"v":0,"d":"0.00 €"}}]
[null,0]
[null,0,"N+3"]
["Augmentation du besoin en fonds de roulement de la période = (18)",{"v":0,"d":"0.00 €"},{"$f":"SUM(C800:C803)","v":{"v":0,"d":"0.00 €"}}]
["Augmentation des stocks",{"v":0,"d":"0.00 €"}]
["Augmentation des créances (effet volume ou prix)",{"v":0,"d":"0.00 €"}]
["Diminution des dettes fournisseurs (effet volume ou prix)",{"v":0,"d":"0.00 €"}]
["Diminution des autres dettes d'exploitation",{"v":0,"d":"0.00 €"}]
["Diminution du besoin en fonds de roulement de la période = (19)",{"v":0,"d":"0.00 €"},{"$f":"SUM(C805:C808)","v":{"v":0,"d":"0.00 €"}}]
["Diminution des stocks",{"v":0,"d":"0.00 €"}]
["Diminution des créances (effet volume ou prix)",{"v":0,"d":"0.00 €"}]
["Augmentation des dettes fournisseurs",{"v":0,"d":"0.00 €"}]
["Augmentation des autres dettes",{"v":0,"d":"0.00 €"}]
["Variations du BFR = (18) - (19) = (20)",{"v":0,"d":"0.00 €"},{"$f":"C799-C804","v":{"v":0,"d":"0.00 €"}}]
["BFR initial (21)",{"v":0,"d":"0.00 €"}]
["BFR cumulé fin de période = (20) + (21) = (22)",{"v":0,"d":"0.00 €"},{"$f":"C809+C810","v":{"v":0,"d":"0.00 €"}}]
["Variations de la trésorerie sur la période = (7) + (12) - (20) = (23)",{"v":0,"d":"0.00 €"},{"$f":"C794-C809","v":{"v":0,"d":"0.00 €"}}]
["Trésorerie Initiale = (24)",{"v":0,"d":"0.00 €"}]
["Trésorerie de fin de période = (23) + (24) = (25)",{"v":0,"d":"0.00 €"},{"$f":"C812+C813","v":{"v":0,"d":"0.00 €"}}]
["Variations des financements à court terme = (26)",{"v":0,"d":"0.00 €"}]
["Liquidités de fin de période = (25) + (26)",{"v":0,"d":"0.00 €"},{"$f":"C814+C815","v":{"v":0,"d":"0.00 €"}}]
[null,0]
[null,0]
[null,0]
["Données complémentaires nécessaires au calcul des ratios",0]
["Montant cumulé des emprunts en fin d'année (1)",{"v":0,"d":"0.00 €"}]
["Montant cumulé des financements stables du FRI en fin d'année(hors amortissements)",{"v":0,"d":"0.00 €"}]
["Montant cumulé de l'actif immobilisé brut en fin d'année (2)",{"v":0,"d":"0.00 €"},{"$f":"B825+C768+C770+C771+C772+C773+C774+C775","v":{"v":0,"d":"0.00 €"}}]
["Mesures correctives le cas échéant (sorties d'immobilisations, etc.)",{"v":0,"d":"0.00 €"}]
["Montant cumulé de l'actif immobilisé brut en fin d'année pris en compte pour le calcul du taux de vétusté",{"v":0,"d":"0.00 €"}]
["Montant cumulé des amortissements en fin d'année (2)",{"v":0,"d":"0.00 €"}]
["Mesures correctives le cas échéant",{"v":0,"d":"0.00 €"}]
["Montant cumulé des amortissements en fin d'année pris en compte pour le calcul du taux de vétusté",{"v":0,"d":"0.00 €"},{"$f":"C826-C827","v":{"v":0,"d":"0.00 €"}}]
[null,0]
[null,0]
["Taux d'endettement (< 50%)",{"v":0,"d":"0.00%"},{"$f":"IF(C822=0,0,C821/C822)","v":{"v":0,"d":"0.00%"}}]
["Durée apparente de la dette (< 10 ans)",{"v":0,"d":"0.00"},{"$f":"IF(C750=0,0,C821/C750)","v":{"v":0,"d":"0.00"}}]
["CAF / Remboursement annuel du capital des emprunts (>1)",{"v":0,"d":"0.00%"},{"$f":"IF(C766=0,0,C750/C766)","v":{"v":0,"d":"0.00%"}}]
["Taux de CAF en % des produits courants",{"v":0,"d":"0.00%"},{"$f":"IF(C717=0,0,C750/C717)","v":{"v":0,"d":"0.00%"}}]
["Taux de vétusté global des immobilisations (2)",{"v":0,"d":"0.00"},{"$f":"IF(C825=0,0,C828/C825)","v":{"v":0,"d":"0.00"}}]
["Marge brute",{"v":0,"d":"0.00 €"},{"$f":"C710+C712-C719-C722-C725-C726","v":{"v":0,"d":"0.00 €"}}]
["Taux de marge brute en % des produits courants",{"v":0,"d":"0.00%"},{"$f":"IF((C710+C712)=0,0,C836/(C710+C712))","v":{"v":0,"d":"0.00%"}}]
[null,0]
["(1): Pour N-1, comptes 16 hors c/165, c/168 et c/169",{"$f":"SUM(C839:IV839)","v":0}]
["(2) : Le taux de vétusté pour l'année N-1 est calculé à partir des données du tableau \"FDR\". Pour les années qui suivent, les acquisitions nouvelles et les dotations aux amortissements sont intégrées automatiquement à partif des données \"CAF\" et \"FRI\" ci-dessus. Si nécessaire, ces données doivent être corrigées (notamment en cas de sorties d'immobilisation).",{"$f":"SUM(C840:IV840)","v":0}]
[null,{"$f":"SUM(C841:IV841)","v":0}]
[]
[]
["PGFP N+4"]
["Produits",{"$f":"SUM(C845:IV845)","v":0}]
["Groupe I : Produits de la tarification",{"v":0,"d":"0.00 €"},{"$f":"CRP_PGFP!$I$47+CRP_PGFP_SF!$I$47","v":{"v":0,"d":"0.00 €"}}]
["(*) Dont aides ponctuelles par dotations non  reconductibles ",{"v":0,"d":"0.00 €"},{"$f":"CRP_PGFP!$I$53+CRP_PGFP!$I$54+CRP_PGFP!$I$55+CRP_PGFP_SF!$I$53+CRP_PGFP_SF!$I$54+CRP_PGFP_SF!$I$55","v":{"v":0,"d":"0.00 €"}}]
["Groupe II : Autres produits d'exploitation",{"v":0,"d":"0.00 €"},{"$f":"CRP_PGFP!$I$56+CRP_PGFP_SF!$I$56","v":{"v":0,"d":"0.00 €"}}]
["(*) Dont produits du compte 70",{"v":0,"d":"0.00 €"}]
["(*) Dont produits du compte 72",{"v":0,"d":"0.00 €"}]
["Groupe III : Produits financiers, exceptionnels et non encaissables",{"v":0,"d":"0.00 €"},{"$f":"CRP_PGFP!$I$60+CRP_PGFP_SF!$I$60","v":{"v":0,"d":"0.00 €"}}]
["Total des produits (1)",{"v":0,"d":"0.00 €"},{"$f":"C846+C848+C851","v":{"v":0,"d":"0.00 €"}}]
["Dont produits (hors c/747, 757, 775, 777 et 78)",{"v":0,"d":"0.00 €"},{"$f":"CRP_PGFP!$I$77-CRP_PGFP!$I$63-CRP_PGFP!$I$64-CRP_PGFP!$I$65-CRP_PGFP!$I$66-CRP_PGFP!$I$67-CRP_PGFP!$I$68-CRP_PGFP!$I$69-CRP_PGFP!$I$70-CRP_PGFP!$I$71-CRP_PGFP!$I$72-CRP_PGFP!$I$73-CRP_PGFP!$I$74-CRP_PGFP!$I$75+CRP_PGFP_SF!$I$77-CRP_PGFP_SF!$I$63-CRP_PGFP_SF!$I$64-CRP_PGFP_SF!$I$65-CRP_PGFP_SF!$I$66-CRP_PGFP_SF!$I$67-CRP_PGFP_SF!$I$68-CRP_PGFP_SF!$I$69-CRP_PGFP_SF!$I$70-CRP_PGFP_SF!$I$71-CRP_PGFP_SF!$I$72-CRP_PGFP_SF!$I$73-CRP_PGFP_SF!$I$74-CRP_PGFP_SF!$I$75","v":{"v":0,"d":"0.00 €"}}]
["Charges",{"v":0,"d":"0.00 €"}]
["Groupe I : Charges afférentes à l'exploitation courante",{"v":0,"d":"0.00 €"},{"$f":"CRP_PGFP!$I$9+CRP_PGFP_SF!$I$9","v":{"v":0,"d":"0.00 €"}}]
["(*) Dont achats stockés et variation des stocks",{"v":0,"d":"0.00 €"}]
["(*) Dont comptes 709 et 713 en charges",{"v":0,"d":"0.00 €"}]
["Groupe II : Charges afférentes au personnel",{"v":0,"d":"0.00 €"},{"$f":"CRP_PGFP!$I$13+CRP_PGFP_SF!$I$13","v":{"v":0,"d":"0.00 €"}}]
["Groupe III : Charges afférentes à la structure",{"v":0,"d":"0.00 €"},{"$f":"CRP_PGFP!$I$18+CRP_PGFP_SF!$I$18","v":{"v":0,"d":"0.00 €"}}]
["(*) Dont charges non décaissables",{"v":0,"d":"0.00 €"}]
["(*) Dont charges des comptes 61 et 62 du groupe 3",{"v":0,"d":"0.00 €"},{"$f":"CRP_PGFP!$I$19+CRP_PGFP!$I$23+CRP_PGFP_SF!$I$19+CRP_PGFP_SF!$I$23","v":{"v":0,"d":"0.00 €"}}]
["(*) Dont charges des comptes 63 à 65 du Groupe 3 des dépenses",{"v":0,"d":"0.00 €"},{"$f":"CRP_PGFP!$I$21+CRP_PGFP!$I$22+CRP_PGFP_SF!$I$21+CRP_PGFP_SF!$I$22","v":{"v":0,"d":"0.00 €"}}]
["Total des charges (2)",{"v":0,"d":"0.00 €"},{"$f":"C855+C858+C859","v":{"v":0,"d":"0.00 €"}}]
["(*) Dont charges des comptes 60 à 62",{"v":0,"d":"0.00 €"},{"$f":"CRP_PGFP!$I$9+CRP_PGFP!$I$19+CRP_PGFP!$I$23+CRP_PGFP_SF!$I$9+CRP_PGFP_SF!$I$19+CRP_PGFP_SF!$I$23+'CRPP NON SOUMIS EQUIL'!$F$39+'CRPP NON SOUMIS EQUIL'!$F$40+'CRPP SOUMIS EQUILIBRE'!$F$39+'CRPP SOUMIS EQUILIBRE'!$F$40+CRP_SF!$F$39+CRP_SF!$F$40+CRP_PGFP!$F$14+CRP_PGFP!$G$14+CRP_PGFP!$H$14+CRP_PGFP!$I$14+CRP_PGFP_SF!$F$14+CRP_PGFP_SF!$G$14+CRP_PGFP_SF!$H$14+CRP_PGFP_SF!$I$14","v":{"v":0,"d":"0.00 €"}}]
["(*) Dont charges des comptes 63 et 645 à 647",{"v":0,"d":"0.00 €"}]
["Résultat prévisionnel (1) - (2) ",{"v":0,"d":"0.00 €"},{"$f":"C852-C863","v":{"v":0,"d":"0.00 €"}}]
[null,0]
["(FRE) Résultat prévisionnel",{"v":0,"d":"0.00 €"},{"$f":"C866","v":{"v":0,"d":"0.00 €"}}]
["Flux internes (charges) (+)",{"v":0,"d":"0.00 €"},{"$f":"SUM(C870:C876)","v":{"v":0,"d":"0.00 €"}}]
["(FRI) Valeur comptable des immobilisations incorporelles et corporelles cédées",{"v":0,"d":"0.00 €"},{"$f":"CRP_PGFP!$I$25+CRP_PGFP_SF!$I$25","v":{"v":0,"d":"0.00 €"}}]
["(FRI) Dotations aux amortissements des immobilisations incorporelles et corporelles",{"v":0,"d":"0.00 €"},{"$f":"CRP_PGFP!$I$27+CRP_PGFP!$I$26+CRP_PGFP_SF!$I$27+CRP_PGFP_SF!$I$26","v":{"v":0,"d":"0.00 €"}}]
["(FRI) Dotations aux provisions réglementées impactant le FRI",{"v":0,"d":"0.00 €"},{"$f":"CRP_PGFP!$I$30+CRP_PGFP!$I$31+CRP_PGFP_SF!$I$30+CRP_PGFP_SF!$I$31","v":{"v":0,"d":"0.00 €"}}]
["(FRI) Autres dotations aux amortissements,  provisions et dépréciations impactant le FRI (dont c/68748)",{"v":0,"d":"0.00 €"},{"$f":"CRP_PGFP!$I$28+CRP_PGFP!$I$29+CRP_PGFP!$I$32+CRP_PGFP_SF!$I$28+CRP_PGFP_SF!$I$29+CRP_PGFP_SF!$I$32","v":{"v":0,"d":"0.00 €"}}]
["(FRI) Reports en fonds dédiés à l'investissement sur concours publics des entités gestionnaires d'ESSMS (c/68921) - ESSMS privés",{"v":0,"d":"0.00 €"},{"$f":"CRP_PGFP!$I$33+CRP_PGFP_SF!$I$33","v":{"v":0,"d":"0.00 €"}}]
["(FRE) Autres dotations aux amortissements, provisions et dépréciations",{"v":0,"d":"0.00 €"},{"$f":"CRP_PGFP!$I$34+CRP_PGFP!$I$35+CRP_PGFP!$I$36+CRP_PGFP_SF!$I$34+CRP_PGFP_SF!$I$35+CRP_PGFP_SF!$I$36","v":{"v":0,"d":"0.00 €"}}]
["(FRE) Reports en fonds dédiés (sauf c/68921) - ESSMS privés",{"v":0,"d":"0.00 €"},{"$f":"CRP_PGFP!$I$37+CRP_PGFP_SF!$I$37","v":{"v":0,"d":"0.00 €"}}]
["Flux internes (produits) (-)",{"v":0,"d":"0.00 €"},{"$f":"SUM(C878:C885)","v":{"v":0,"d":"0.00 €"}}]
["(FRI) Reprises sur provisions réglementées  impactant le FRI",{"v":0,"d":"0.00 €"},{"$f":"CRP_PGFP!$I$66+CRP_PGFP!$I$68+CRP_PGFP_SF!$I$66+CRP_PGFP_SF!$I$68","v":{"v":0,"d":"0.00 €"}}]
["(FRI) Reprises sur amortissements, autres provisions et dépréciations impactant le FRI (dont c/78748)",{"v":0,"d":"0.00 €"},{"$f":"CRP_PGFP!$I$69+CRP_PGFP_SF!$I$69+CRP_PGFP!$I$67+CRP_PGFP_SF!$I$67+CRP_PGFP!$I$70+CRP_PGFP_SF!$I$70","v":{"v":0,"d":"0.00 €"}}]
["(FRE) Reprises sur autres provisions et dépréciations",{"v":0,"d":"0.00 €"},{"$f":"CRP_PGFP!$I$72+CRP_PGFP!$I$73+CRP_PGFP!$I$74+CRP_PGFP_SF!$I$72+CRP_PGFP_SF!$I$73+CRP_PGFP_SF!$I$74","v":{"v":0,"d":"0.00 €"}}]
["(FRI) Quote-part des subventions virées au résultat de l'exercice",{"v":0,"d":"0.00 €"},{"$f":"CRP_PGFP!$I$64+CRP_PGFP_SF!$I$64","v":{"v":0,"d":"0.00 €"}}]
["(FRI) Quote-part d'éléments du fonds associatif virée au compte de résultat",{"v":0,"d":"0.00 €"},{"$f":"CRP_PGFP!$I$65+CRP_PGFP_SF!$I$65","v":{"v":0,"d":"0.00 €"}}]
["(FRI) Produits des cessions d'immobilisations incorporelles et corporelles",{"v":0,"d":"0.00 €"},{"$f":"CRP_PGFP!$I$63+CRP_PGFP_SF!$I$63","v":{"v":0,"d":"0.00 €"}}]
["(FRI) Utilisation des fonds dédiés à l'investissement sur concours publics des entités gestionnaires d'ESSMS (c/78921) - ESSMS privés",{"v":0,"d":"0.00 €"},{"$f":"CRP_PGFP!$I$71+CRP_PGFP_SF!$I$71","v":{"v":0,"d":"0.00 €"}}]
["(FRE) Utilisation de fonds dédiés et de fonds reportés (sauf c/78921) - ESSMS privés",{"v":0,"d":"0.00 €"},{"$f":"CRP_PGFP!$I$75+CRP_PGFP_SF!$I$75","v":{"v":0,"d":"0.00 €"}}]
["Capacité (+) / Insuffisance (-) d'autofinancement prévisionnelle",{"v":0,"d":"0.00 €"},{"$f":"C866+C869-C877","v":{"v":0,"d":"0.00 €"}}]
["Dont part affectant le fonds de roulement d'investissement FRI = (3)",{"v":0,"d":"0.00 €"},{"$f":"C870+C871+C872+C873-C878-C879-C881-C882-C883","v":{"v":0,"d":"0.00 €"}}]
["Dont part affectant le fonds de roulement d'exploitation FRE = (4)",{"v":0,"d":"0.00 €"},{"$f":"C868+C875+C876-C880-C885","v":{"v":0,"d":"0.00 €"}}]
["(*) : Les lignes précédées d'un astérisque, qui servent à collecter des données intermédiaires nécessaires au calcul d'indicateurs, peuvent être masquées. ",0]
[null,0,"N+4"]
["Augmentation des financements stables d'investissement de la période = (5)",{"v":0,"d":"0.00 €"},{"$f":"SUM(C892:C899)","v":{"v":0,"d":"0.00 €"}}]
["CAF ou IAF (signe -) prévisionnelle affectée au FRI =(3)",{"v":0,"d":"0.00 €"},{"$f":"C887","v":{"v":0,"d":"0.00 €"}}]
["Affectation des résultats à l'investissement",{"v":0,"d":"0.00 €"}]
["Apports",{"v":0,"d":"0.00 €"}]
["Subventions ",{"v":0,"d":"0.00 €"}]
["Emprunts",{"v":0,"d":"0.00 €"}]
["Produits de cessions d'immobilisations",{"v":0,"d":"0.00 €"}]
["Comptes de liaison investissement (ESSMS privés uniquement)",{"v":0,"d":"0.00 €"}]
["Autres",{"v":0,"d":"0.00 €"}]
["Diminution des financements stables d'investissement de la période =(6)",{"v":0,"d":"0.00 €"},{"$f":"C901+C902+C912+C913+C914","v":{"v":0,"d":"0.00 €"}}]
["Fonds associatifs, apports, dotations et réserves (réduction) (ESSMS privés uniquement)",{"v":0,"d":"0.00 €"}]
["Remboursements des emprunts",{"v":0,"d":"0.00 €"}]
["Acquisition d'immobilisations :",{"v":0,"d":"0.00 €"},{"$f":"SUM(C904:C911)","v":{"v":0,"d":"0.00 €"}}]
["Immobilisations incorporelles",{"v":0,"d":"0.00 €"}]
["Terrains",{"v":0,"d":"0.00 €"}]
["Agencements de terrains",{"v":0,"d":"0.00 €"}]
["Constructions",{"v":0,"d":"0.00 €"}]
["Installations techniques matériel et outillage",{"v":0,"d":"0.00 €"}]
["Autres immobilisations corporelles",{"v":0,"d":"0.00 €"}]
["Immobilisations en cours",{"v":0,"d":"0.00 €"}]
["Immobilisations financières",{"$f":"SUM(C911:IV911)","v":{"v":0,"d":"0.00 €"}}]
["Reprise sur les réserves de compensation des charges d'amortissement",{"v":0,"d":"0.00 €"},{"$f":"C920","v":{"v":0,"d":"0.00 €"}}]
["Autres dépenses",{"v":0,"d":"0.00 €"}]
["Comptes de liaison investissement (ESSMS privés uniquement)",{"v":0,"d":"0.00 €"}]
["Variations du FRI (5) - (6) = (7)",{"v":0,"d":"0.00 €"},{"$f":"C891-C900","v":{"v":0,"d":"0.00 €"}}]
["FRI initial (8)",{"v":0,"d":"0.00 €"}]
["FRI cumulé de fin de période = (7) + (8) = (9)",{"v":0,"d":"0.00 €"},{"$f":"C915+C916","v":{"v":0,"d":"0.00 €"}}]
["Augmentation des financements stables d'exploitation de la période = (10)",{"v":0,"d":"0.00 €"},{"$f":"C919+C920+C921","v":{"v":0,"d":"0.00 €"}}]
["CAF  ou IAF (signe -) prévisionnelle affectée au FRE",{"v":0,"d":"0.00 €"},{"$f":"C888","v":{"v":0,"d":"0.00 €"}}]
["Reprises sur les réserves de compensation des charges d'amortissement",{"v":0,"d":"0.00 €"},{"$f":"CRP_PGFP!$I$80+CRP_PGFP_SF!$I$80","v":{"v":0,"d":"0.00 €"}}]
["Comptes de liaison stable exploitation (établissements privés)",{"v":0,"d":"0.00 €"}]
["Diminution des financements stables d'exploitation de la période = (11)",{"v":0,"d":"0.00 €"},{"$f":"SUM(C923:C925)","v":{"v":0,"d":"0.00 €"}}]
["Reprise à l'investissement des réserves de couverture du BFR",{"v":0,"d":"0.00 €"}]
["Affectation des résultats à l'investissement",{"v":0,"d":"0.00 €"}]
["Comptes de liaison stable exploitation (ESSMS privés uniquement)",{"v":0,"d":"0.00 €"}]
["Variations du FRE (10) - (11) = (12)",{"v":0,"d":"0.00 €"},{"$f":"C918-C922","v":{"v":0,"d":"0.00 €"}}]
["FRE initial (13)",{"v":0,"d":"0.00 €"}]
["FRE cumulé de fin de période = (12) + (13) = (14)",{"v":0,"d":"0.00 €"},{"$f":"C926+C927","v":{"v":0,"d":"0.00 €"}}]
[null,0]
["Apport ou prélèvement sur le fonds de roulement net global = (7) + (12) = (15)",{"v":0,"d":"0.00 €"},{"$f":"C915+C926","v":{"v":0,"d":"0.00 €"}}]
["FRNG initial = (16)",{"v":0,"d":"0.00 €"}]
["Fonds de Roulement Net Global (FRNG) de fin de période = (15) + (16) = (17)",{"v":0,"d":"0.00 €"},{"$f":"C930+C931","v":{"v":0,"d":"0.00 €"}}]
[null,0]
[null,0,"N+4"]
["Augmentation du besoin en fonds de roulement de la période = (18)",{"v":0,"d":"0.00 €"},{"$f":"SUM(C936:C939)","v":{"v":0,"d":"0.00 €"}}]
["Augmentation des stocks",{"v":0,"d":"0.00 €"}]
["Augmentation des créances (effet volume ou prix)",{"v":0,"d":"0.00 €"}]
["Diminution des dettes fournisseurs (effet volume ou prix)",{"v":0,"d":"0.00 €"}]
["Diminution des autres dettes d'exploitation",{"v":0,"d":"0.00 €"}]
["Diminution du besoin en fonds de roulement de la période = (19)",{"v":0,"d":"0.00 €"},{"$f":"SUM(C941:C944)","v":{"v":0,"d":"0.00 €"}}]
["Diminution des stocks",{"v":0,"d":"0.00 €"}]
["Diminution des créances (effet volume ou prix)",{"v":0,"d":"0.00 €"}]
["Augmentation des dettes fournisseurs",{"v":0,"d":"0.00 €"}]
["Augmentation des autres dettes",{"v":0,"d":"0.00 €"}]
["Variations du BFR = (18) - (19) = (20)",{"v":0,"d":"0.00 €"},{"$f":"C935-C940","v":{"v":0,"d":"0.00 €"}}]
["BFR initial (21)",{"v":0,"d":"0.00 €"}]
["BFR cumulé fin de période = (20) + (21) = (22)",{"v":0,"d":"0.00 €"},{"$f":"C945+C946","v":{"v":0,"d":"0.00 €"}}]
["Variations de la trésorerie sur la période = (7) + (12) - (20) = (23)",{"v":0,"d":"0.00 €"},{"$f":"C930-C945","v":{"v":0,"d":"0.00 €"}}]
["Trésorerie Initiale = (24)",{"v":0,"d":"0.00 €"}]
["Trésorerie de fin de période = (23) + (24) = (25)",{"v":0,"d":"0.00 €"},{"$f":"C948+C949","v":{"v":0,"d":"0.00 €"}}]
["Variations des financements à court terme = (26)",{"v":0,"d":"0.00 €"}]
["Liquidités de fin de période = (25) + (26)",{"v":0,"d":"0.00 €"},{"$f":"C950+C951","v":{"v":0,"d":"0.00 €"}}]
[null,0]
[null,0]
[null,0]
["Données complémentaires nécessaires au calcul des ratios",0]
["Montant cumulé des emprunts en fin d'année (1)",{"v":0,"d":"0.00 €"}]
["Montant cumulé des financements stables du FRI en fin d'année(hors amortissements)",{"v":0,"d":"0.00 €"}]
["Montant cumulé de l'actif immobilisé brut en fin d'année (2)",{"v":0,"d":"0.00 €"},{"$f":"B961+C904+C906+C907+C908+C909+C910+C911","v":{"v":0,"d":"0.00 €"}}]
["Mesures correctives le cas échéant (sorties d'immobilisations, etc.)",{"v":0,"d":"0.00 €"}]
["Montant cumulé de l'actif immobilisé brut en fin d'année pris en compte pour le calcul du taux de vétusté",{"v":0,"d":"0.00 €"}]
["Montant cumulé des amortissements en fin d'année (2)",{"v":0,"d":"0.00 €"}]
["Mesures correctives le cas échéant",{"v":0,"d":"0.00 €"}]
["Montant cumulé des amortissements en fin d'année pris en compte pour le calcul du taux de vétusté",{"v":0,"d":"0.00 €"},{"$f":"C962-C963","v":{"v":0,"d":"0.00 €"}}]
[null,0]
[null,0]
["Taux d'endettement (< 50%)",{"v":0,"d":"0.00%"},{"$f":"IF(C958=0,0,C957/C958)","v":{"v":0,"d":"0.00%"}}]
["Durée apparente de la dette (< 10 ans)",{"v":0,"d":"0.00"},{"$f":"IF(C886=0,0,C957/C886)","v":{"v":0,"d":"0.00"}}]
["CAF / Remboursement annuel du capital des emprunts (>1)",{"v":0,"d":"0.00%"},{"$f":"IF(C902=0,0,C886/C902)","v":{"v":0,"d":"0.00%"}}]
["Taux de CAF en % des produits courants",{"v":0,"d":"0.00%"},{"$f":"IF(C853=0,0,C886/C853)","v":{"v":0,"d":"0.00%"}}]
["Taux de vétusté global des immobilisations (2)",{"v":0,"d":"0.00"},{"$f":"IF(C961=0,0,C964/C961)","v":{"v":0,"d":"0.00"}}]
["Marge brute",{"v":0,"d":"0.00 €"},{"$f":"C846+C848-C855-C858-C861-C862","v":{"v":0,"d":"0.00 €"}}]
["Taux de marge brute en % des produits courants",{"v":0,"d":"0.00%"},{"$f":"IF((C846+C848)=0,0,C972/(C846+C848))","v":{"v":0,"d":"0.00%"}}]
[null,0]
["(1): Pour N-1, comptes 16 hors c/165, c/168 et c/169",{"$f":"SUM(C975:IV975)","v":0}]
["(2) : Le taux de vétusté pour l'année N-1 est calculé à partir des données du tableau \"FDR\". Pour les années qui suivent, les acquisitions nouvelles et les dotations aux amortissements sont intégrées automatiquement à partif des données \"CAF\" et \"FRI\" ci-dessus. Si nécessaire, ces données doivent être corrigées (notamment en cas de sorties d'immobilisation).",{"$f":"SUM(C976:IV976)","v":0}]
[null,{"$f":"SUM(C977:IV977)","v":0}]
[]
[]
["PGFP N+5"]
["Produits",{"$f":"SUM(C981:IV981)","v":0}]
["Groupe I : Produits de la tarification",{"v":0,"d":"0.00 €"},{"$f":"CRP_PGFP!$J$47+CRP_PGFP_SF!$J$47","v":{"v":0,"d":"0.00 €"}}]
["(*) Dont aides ponctuelles par dotations non  reconductibles ",{"v":0,"d":"0.00 €"},{"$f":"CRP_PGFP!$J$53+CRP_PGFP!$J$54+CRP_PGFP!$J$55+CRP_PGFP_SF!$J$53+CRP_PGFP_SF!$J$54+CRP_PGFP_SF!$J$55","v":{"v":0,"d":"0.00 €"}}]
["Groupe II : Autres produits d'exploitation",{"v":0,"d":"0.00 €"},{"$f":"CRP_PGFP!$J$56+CRP_PGFP_SF!$J$56","v":{"v":0,"d":"0.00 €"}}]
["(*) Dont produits du compte 70",{"v":0,"d":"0.00 €"}]
["(*) Dont produits du compte 72",{"v":0,"d":"0.00 €"}]
["Groupe III : Produits financiers, exceptionnels et non encaissables",{"v":0,"d":"0.00 €"},{"$f":"CRP_PGFP!$J$60+CRP_PGFP_SF!$J$60","v":{"v":0,"d":"0.00 €"}}]
["Total des produits (1)",{"v":0,"d":"0.00 €"},{"$f":"C982+C984+C987","v":{"v":0,"d":"0.00 €"}}]
["Dont produits (hors c/747, 757, 775, 777 et 78)",{"v":0,"d":"0.00 €"},{"$f":"CRP_PGFP!$J$77-CRP_PGFP!$J$63-CRP_PGFP!$J$64-CRP_PGFP!$J$65-CRP_PGFP!$J$66-CRP_PGFP!$J$67-CRP_PGFP!$J$68-CRP_PGFP!$J$69-CRP_PGFP!$J$70-CRP_PGFP!$J$71-CRP_PGFP!$J$72-CRP_PGFP!$J$73-CRP_PGFP!$J$74-CRP_PGFP!$J$75+CRP_PGFP_SF!$J$77-CRP_PGFP_SF!$J$63-CRP_PGFP_SF!$J$64-CRP_PGFP_SF!$J$65-CRP_PGFP_SF!$J$66-CRP_PGFP_SF!$J$67-CRP_PGFP_SF!$J$68-CRP_PGFP_SF!$J$69-CRP_PGFP_SF!$J$70-CRP_PGFP_SF!$J$71-CRP_PGFP_SF!$J$72-CRP_PGFP_SF!$J$73-CRP_PGFP_SF!$J$74-CRP_PGFP_SF!$J$75","v":{"v":0,"d":"0.00 €"}}]
["Charges",{"v":0,"d":"0.00 €"}]
["Groupe I : Charges afférentes à l'exploitation courante",{"v":0,"d":"0.00 €"},{"$f":"CRP_PGFP!$J$9+CRP_PGFP_SF!$J$9","v":{"v":0,"d":"0.00 €"}}]
["(*) Dont achats stockés et variation des stocks",{"v":0,"d":"0.00 €"}]
["(*) Dont comptes 709 et 713 en charges",{"v":0,"d":"0.00 €"}]
["Groupe II : Charges afférentes au personnel",{"v":0,"d":"0.00 €"},{"$f":"CRP_PGFP!$J$13+CRP_PGFP_SF!$J$13","v":{"v":0,"d":"0.00 €"}}]
["Groupe III : Charges afférentes à la structure",{"v":0,"d":"0.00 €"},{"$f":"CRP_PGFP!$J$18+CRP_PGFP_SF!$J$18","v":{"v":0,"d":"0.00 €"}}]
["(*) Dont charges non décaissables",{"v":0,"d":"0.00 €"}]
["(*) Dont charges des comptes 61 et 62 du groupe 3",{"v":0,"d":"0.00 €"},{"$f":"CRP_PGFP!$J$19+CRP_PGFP!$J$23+CRP_PGFP_SF!$J$19+CRP_PGFP_SF!$J$23","v":{"v":0,"d":"0.00 €"}}]
["(*) Dont charges des comptes 63 à 65 du Groupe 3 des dépenses",{"v":0,"d":"0.00 €"},{"$f":"CRP_PGFP!$J$21+CRP_PGFP!$J$22+CRP_PGFP_SF!$J$21+CRP_PGFP_SF!$J$22","v":{"v":0,"d":"0.00 €"}}]
["Total des charges (2)",{"v":0,"d":"0.00 €"},{"$f":"C991+C994+C995","v":{"v":0,"d":"0.00 €"}}]
["(*) Dont charges des comptes 60 à 62",{"v":0,"d":"0.00 €"},{"$f":"CRP_PGFP!$J$9+CRP_PGFP!$J$19+CRP_PGFP!$J$23+CRP_PGFP_SF!$J$9+CRP_PGFP_SF!$J$19+CRP_PGFP_SF!$J$23+'CRPP NON SOUMIS EQUIL'!$F$39+'CRPP NON SOUMIS EQUIL'!$F$40+'CRPP SOUMIS EQUILIBRE'!$F$39+'CRPP SOUMIS EQUILIBRE'!$F$40+CRP_SF!$F$39+CRP_SF!$F$40+CRP_PGFP!$F$14+CRP_PGFP!$G$14+CRP_PGFP!$H$14+CRP_PGFP!$I$14+CRP_PGFP!$J$14+CRP_PGFP_SF!$F$14+CRP_PGFP_SF!$G$14+CRP_PGFP_SF!$H$14+CRP_PGFP_SF!$I$14+CRP_PGFP_SF!$J$14","v":{"v":0,"d":"0.00 €"}}]
["(*) Dont charges des comptes 63 et 645 à 647",{"v":0,"d":"0.00 €"}]
["Résultat prévisionnel (1) - (2) ",{"v":0,"d":"0.00 €"},{"$f":"C988-C999","v":{"v":0,"d":"0.00 €"}}]
[null,0]
["(FRE) Résultat prévisionnel",{"v":0,"d":"0.00 €"},{"$f":"C1002","v":{"v":0,"d":"0.00 €"}}]
["Flux internes (charges) (+)",{"v":0,"d":"0.00 €"},{"$f":"SUM(C1006:C1012)","v":{"v":0,"d":"0.00 €"}}]
["(FRI) Valeur comptable des immobilisations incorporelles et corporelles cédées",{"v":0,"d":"0.00 €"},{"$f":"CRP_PGFP!$J$25+CRP_PGFP_SF!$J$25","v":{"v":0,"d":"0.00 €"}}]
["(FRI) Dotations aux amortissements des immobilisations incorporelles et corporelles",{"v":0,"d":"0.00 €"},{"$f":"CRP_PGFP!$J$27+CRP_PGFP!$J$26+CRP_PGFP_SF!$J$27+CRP_PGFP_SF!$J$26","v":{"v":0,"d":"0.00 €"}}]
["(FRI) Dotations aux provisions réglementées impactant le FRI",{"v":0,"d":"0.00 €"},{"$f":"CRP_PGFP!$J$30+CRP_PGFP!$J$31+CRP_PGFP_SF!$J$30+CRP_PGFP_SF!$J$31","v":{"v":0,"d":"0.00 €"}}]
["(FRI) Autres dotations aux amortissements,  provisions et dépréciations impactant le FRI (dont c/68748)",{"v":0,"d":"0.00 €"},{"$f":"CRP_PGFP!$J$28+CRP_PGFP!$J$29+CRP_PGFP!$J$32+CRP_PGFP_SF!$J$28+CRP_PGFP_SF!$J$29+CRP_PGFP_SF!$J$32","v":{"v":0,"d":"0.00 €"}}]
["(FRI) Reports en fonds dédiés à l'investissement sur concours publics des entités gestionnaires d'ESSMS (c/68921) - ESSMS privés",{"v":0,"d":"0.00 €"},{"$f":"CRP_PGFP!$J$33+CRP_PGFP_SF!$J$33","v":{"v":0,"d":"0.00 €"}}]
["(FRE) Autres dotations aux amortissements, provisions et dépréciations",{"v":0,"d":"0.00 €"},{"$f":"CRP_PGFP!$J$34+CRP_PGFP!$J$35+CRP_PGFP!$J$36+CRP_PGFP_SF!$J$34+CRP_PGFP_SF!$J$35+CRP_PGFP_SF!$J$36","v":{"v":0,"d":"0.00 €"}}]
["(FRE) Reports en fonds dédiés (sauf c/68921) - ESSMS privés",{"v":0,"d":"0.00 €"},{"$f":"CRP_PGFP!$J$37+CRP_PGFP_SF!$J$37","v":{"v":0,"d":"0.00 €"}}]
["Flux internes (produits) (-)",{"v":0,"d":"0.00 €"},{"$f":"SUM(C1014:C1021)","v":{"v":0,"d":"0.00 €"}}]
["(FRI) Reprises sur provisions réglementées  impactant le FRI",{"v":0,"d":"0.00 €"},{"$f":"CRP_PGFP!$J$66+CRP_PGFP!$J$68+CRP_PGFP_SF!$J$66+CRP_PGFP_SF!$J$68","v":{"v":0,"d":"0.00 €"}}]
["(FRI) Reprises sur amortissements, autres provisions et dépréciations impactant le FRI (dont c/78748)",{"v":0,"d":"0.00 €"},{"$f":"CRP_PGFP!$J$69+CRP_PGFP_SF!$J$69+CRP_PGFP!$J$67+CRP_PGFP_SF!$J$67+CRP_PGFP!$J$70+CRP_PGFP_SF!$J$70","v":{"v":0,"d":"0.00 €"}}]
["(FRE) Reprises sur autres provisions et dépréciations",{"v":0,"d":"0.00 €"},{"$f":"CRP_PGFP!$J$72+CRP_PGFP!$J$73+CRP_PGFP!$J$74+CRP_PGFP_SF!$J$72+CRP_PGFP_SF!$J$73+CRP_PGFP_SF!$J$74","v":{"v":0,"d":"0.00 €"}}]
["(FRI) Quote-part des subventions virées au résultat de l'exercice",{"v":0,"d":"0.00 €"},{"$f":"CRP_PGFP!$J$64+CRP_PGFP_SF!$J$64","v":{"v":0,"d":"0.00 €"}}]
["(FRI) Quote-part d'éléments du fonds associatif virée au compte de résultat",{"v":0,"d":"0.00 €"},{"$f":"CRP_PGFP!$J$65+CRP_PGFP_SF!$J$65","v":{"v":0,"d":"0.00 €"}}]
["(FRI) Produits des cessions d'immobilisations incorporelles et corporelles",{"v":0,"d":"0.00 €"},{"$f":"CRP_PGFP!$J$63+CRP_PGFP_SF!$J$63","v":{"v":0,"d":"0.00 €"}}]
["(FRI) Utilisation des fonds dédiés à l'investissement sur concours publics des entités gestionnaires d'ESSMS (c/78921) - ESSMS privés",{"v":0,"d":"0.00 €"},{"$f":"CRP_PGFP!$J$71+CRP_PGFP_SF!$J$71","v":{"v":0,"d":"0.00 €"}}]
["(FRE) Utilisation de fonds dédiés et de fonds reportés (sauf c/78921) - ESSMS privés",{"v":0,"d":"0.00 €"},{"$f":"CRP_PGFP!$J$75+CRP_PGFP_SF!$J$75","v":{"v":0,"d":"0.00 €"}}]
["Capacité (+) / Insuffisance (-) d'autofinancement prévisionnelle",{"v":0,"d":"0.00 €"},{"$f":"C1002+C1005-C1013","v":{"v":0,"d":"0.00 €"}}]
["Dont part affectant le fonds de roulement d'investissement FRI = (3)",{"v":0,"d":"0.00 €"},{"$f":"C1006+C1007+C1008+C1009-C1014-C1015-C1017-C1018-C1019","v":{"v":0,"d":"0.00 €"}}]
["Dont part affectant le fonds de roulement d'exploitation FRE = (4)",{"v":0,"d":"0.00 €"},{"$f":"C1004+C1011+C1012-C1016-C1021","v":{"v":0,"d":"0.00 €"}}]
["(*) : Les lignes précédées d'un astérisque, qui servent à collecter des données intermédiaires nécessaires au calcul d'indicateurs, peuvent être masquées. ",0]
[null,0,"N+5"]
["Augmentation des financements stables d'investissement de la période = (5)",{"v":0,"d":"0.00 €"},{"$f":"SUM(C1028:C1035)","v":{"v":0,"d":"0.00 €"}}]
["CAF ou IAF (signe -) prévisionnelle affectée au FRI =(3)",{"v":0,"d":"0.00 €"},{"$f":"C1023","v":{"v":0,"d":"0.00 €"}}]
["Affectation des résultats à l'investissement",{"v":0,"d":"0.00 €"}]
["Apports",{"v":0,"d":"0.00 €"}]
["Subventions ",{"v":0,"d":"0.00 €"}]
["Emprunts",{"v":0,"d":"0.00 €"}]
["Produits de cessions d'immobilisations",{"v":0,"d":"0.00 €"}]
["Comptes de liaison investissement (ESSMS privés uniquement)",{"v":0,"d":"0.00 €"}]
["Autres",{"v":0,"d":"0.00 €"}]
["Diminution des financements stables d'investissement de la période =(6)",{"v":0,"d":"0.00 €"},{"$f":"C1037+C1038+C1048+C1049+C1050","v":{"v":0,"d":"0.00 €"}}]
["Fonds associatifs, apports, dotations et réserves (réduction) (ESSMS privés uniquement)",{"v":0,"d":"0.00 €"}]
["Remboursements des emprunts",{"v":0,"d":"0.00 €"}]
["Acquisition d'immobilisations :",{"v":0,"d":"0.00 €"},{"$f":"SUM(C1040:C1047)","v":{"v":0,"d":"0.00 €"}}]
["Immobilisations incorporelles",{"v":0,"d":"0.00 €"}]
["Terrains",{"v":0,"d":"0.00 €"}]
["Agencements de terrains",{"v":0,"d":"0.00 €"}]
["Constructions",{"v":0,"d":"0.00 €"}]
["Installations techniques matériel et outillage",{"v":0,"d":"0.00 €"}]
["Autres immobilisations corporelles",{"v":0,"d":"0.00 €"}]
["Immobilisations en cours",{"v":0,"d":"0.00 €"}]
["Immobilisations financières",{"$f":"SUM(C1047:IV1047)","v":{"v":0,"d":"0.00 €"}}]
["Reprise sur les réserves de compensation des charges d'amortissement",{"v":0,"d":"0.00 €"},{"$f":"C1056","v":{"v":0,"d":"0.00 €"}}]
["Autres dépenses",{"v":0,"d":"0.00 €"}]
["Comptes de liaison investissement (ESSMS privés uniquement)",{"v":0,"d":"0.00 €"}]
["Variations du FRI (5) - (6) = (7)",{"v":0,"d":"0.00 €"},{"$f":"C1027-C1036","v":{"v":0,"d":"0.00 €"}}]
["FRI initial (8)",{"v":0,"d":"0.00 €"}]
["FRI cumulé de fin de période = (7) + (8) = (9)",{"v":0,"d":"0.00 €"},{"$f":"C1051+C1052","v":{"v":0,"d":"0.00 €"}}]
["Augmentation des financements stables d'exploitation de la période = (10)",{"v":0,"d":"0.00 €"},{"$f":"C1055+C1056+C1057","v":{"v":0,"d":"0.00 €"}}]
["CAF  ou IAF (signe -) prévisionnelle affectée au FRE",{"v":0,"d":"0.00 €"},{"$f":"C1024","v":{"v":0,"d":"0.00 €"}}]
["Reprises sur les réserves de compensation des charges d'amortissement",{"v":0,"d":"0.00 €"},{"$f":"CRP_PGFP!$J$80+CRP_PGFP_SF!$J$80","v":{"v":0,"d":"0.00 €"}}]
["Comptes de liaison stable exploitation (établissements privés)",{"v":0,"d":"0.00 €"}]
["Diminution des financements stables d'exploitation de la période = (11)",{"v":0,"d":"0.00 €"},{"$f":"SUM(C1059:C1061)","v":{"v":0,"d":"0.00 €"}}]
["Reprise à l'investissement des réserves de couverture du BFR",{"v":0,"d":"0.00 €"}]
["Affectation des résultats à l'investissement",{"v":0,"d":"0.00 €"}]
["Comptes de liaison stable exploitation (ESSMS privés uniquement)",{"v":0,"d":"0.00 €"}]
["Variations du FRE (10) - (11) = (12)",{"v":0,"d":"0.00 €"},{"$f":"C1054-C1058","v":{"v":0,"d":"0.00 €"}}]
["FRE initial (13)",{"v":0,"d":"0.00 €"}]
["FRE cumulé de fin de période = (12) + (13) = (14)",{"v":0,"d":"0.00 €"},{"$f":"C1062+C1063","v":{"v":0,"d":"0.00 €"}}]
[null,0]
["Apport ou prélèvement sur le fonds de roulement net global = (7) + (12) = (15)",{"v":0,"d":"0.00 €"},{"$f":"C1051+C1062","v":{"v":0,"d":"0.00 €"}}]
["FRNG initial = (16)",{"v":0,"d":"0.00 €"}]
["Fonds de Roulement Net Global (FRNG) de fin de période = (15) + (16) = (17)",{"v":0,"d":"0.00 €"},{"$f":"C1066+C1067","v":{"v":0,"d":"0.00 €"}}]
[null,0]
[null,0,"N+5"]
["Augmentation du besoin en fonds de roulement de la période = (18)",{"v":0,"d":"0.00 €"},{"$f":"SUM(C1072:C1075)","v":{"v":0,"d":"0.00 €"}}]
["Augmentation des stocks",{"v":0,"d":"0.00 €"}]
["Augmentation des créances (effet volume ou prix)",{"v":0,"d":"0.00 €"}]
["Diminution des dettes fournisseurs (effet volume ou prix)",{"v":0,"d":"0.00 €"}]
["Diminution des autres dettes d'exploitation",{"v":0,"d":"0.00 €"}]
["Diminution du besoin en fonds de roulement de la période = (19)",{"v":0,"d":"0.00 €"},{"$f":"SUM(C1077:C1080)","v":{"v":0,"d":"0.00 €"}}]
["Diminution des stocks",{"v":0,"d":"0.00 €"}]
["Diminution des créances (effet volume ou prix)",{"v":0,"d":"0.00 €"}]
["Augmentation des dettes fournisseurs",{"v":0,"d":"0.00 €"}]
["Augmentation des autres dettes",{"v":0,"d":"0.00 €"}]
["Variations du BFR = (18) - (19) = (20)",{"v":0,"d":"0.00 €"},{"$f":"C1071-C1076","v":{"v":0,"d":"0.00 €"}}]
["BFR initial (21)",{"v":0,"d":"0.00 €"}]
["BFR cumulé fin de période = (20) + (21) = (22)",{"v":0,"d":"0.00 €"},{"$f":"C1081+C1082","v":{"v":0,"d":"0.00 €"}}]
["Variations de la trésorerie sur la période = (7) + (12) - (20) = (23)",{"v":0,"d":"0.00 €"},{"$f":"C1066-C1081","v":{"v":0,"d":"0.00 €"}}]
["Trésorerie Initiale = (24)",{"v":0,"d":"0.00 €"}]
["Trésorerie de fin de période = (23) + (24) = (25)",{"v":0,"d":"0.00 €"},{"$f":"C1084+C1085","v":{"v":0,"d":"0.00 €"}}]
["Variations des financements à court terme = (26)",{"v":0,"d":"0.00 €"}]
["Liquidités de fin de période = (25) + (26)",{"v":0,"d":"0.00 €"},{"$f":"C1086+C1087","v":{"v":0,"d":"0.00 €"}}]
[null,0]
[null,0]
[null,0]
["Données complémentaires nécessaires au calcul des ratios",0]
["Montant cumulé des emprunts en fin d'année (1)",{"v":0,"d":"0.00 €"}]
["Montant cumulé des financements stables du FRI en fin d'année(hors amortissements)",{"v":0,"d":"0.00 €"}]
["Montant cumulé de l'actif immobilisé brut en fin d'année (2)",{"v":0,"d":"0.00 €"},{"$f":"B1097+C1040+C1042+C1043+C1044+C1045+C1046+C1047","v":{"v":0,"d":"0.00 €"}}]
["Mesures correctives le cas échéant (sorties d'immobilisations, etc.)",{"v":0,"d":"0.00 €"}]
["Montant cumulé de l'actif immobilisé brut en fin d'année pris en compte pour le calcul du taux de vétusté",{"v":0,"d":"0.00 €"}]
["Montant cumulé des amortissements en fin d'année (2)",{"v":0,"d":"0.00 €"}]
["Mesures correctives le cas échéant",{"v":0,"d":"0.00 €"}]
["Montant cumulé des amortissements en fin d'année pris en compte pour le calcul du taux de vétusté",{"v":0,"d":"0.00 €"},{"$f":"C1098-C1099","v":{"v":0,"d":"0.00 €"}}]
[null,0]
[null,0]
["Taux d'endettement (< 50%)",{"v":0,"d":"0.00%"},{"$f":"IF(C1094=0,0,C1093/C1094)","v":{"v":0,"d":"0.00%"}}]
["Durée apparente de la dette (< 10 ans)",{"v":0,"d":"0.00"},{"$f":"IF(C1022=0,0,C1093/C1022)","v":{"v":0,"d":"0.00"}}]
["CAF / Remboursement annuel du capital des emprunts (>1)",{"v":0,"d":"0.00%"},{"$f":"IF(C1038=0,0,C1022/C1038)","v":{"v":0,"d":"0.00%"}}]
["Taux de CAF en % des produits courants",{"v":0,"d":"0.00%"},{"$f":"IF(C989=0,0,C1022/C989)","v":{"v":0,"d":"0.00%"}}]
["Taux de vétusté global des immobilisations (2)",{"v":0,"d":"0.00"},{"$f":"IF(C1097=0,0,C1100/C1097)","v":{"v":0,"d":"0.00"}}]
["Marge brute",{"v":0,"d":"0.00 €"},{"$f":"C982+C984-C991-C994-C997-C998","v":{"v":0,"d":"0.00 €"}}]
["Taux de marge brute en % des produits courants",{"v":0,"d":"0.00%"},{"$f":"IF((C982+C984)=0,0,C1108/(C982+C984))","v":{"v":0,"d":"0.00%"}}]
[null,0]
["(1): Pour N-1, comptes 16 hors c/165, c/168 et c/169",{"$f":"SUM(C1111:IV1111)","v":0}]
["(2) : Le taux de vétusté pour l'année N-1 est calculé à partir des données du tableau \"FDR\". Pour les années qui suivent, les acquisitions nouvelles et les dotations aux amortissements sont intégrées automatiquement à partif des données \"CAF\" et \"FRI\" ci-dessus. Si nécessaire, ces données doivent être corrigées (notamment en cas de sorties d'immobilisation).",{"$f":"SUM(C1112:IV1112)","v":0}]
[null,{"$f":"SUM(C1113:IV1113)","v":0}]
[]
[]
["PGFP N+6"]
["Produits",{"$f":"SUM(C1117:IV1117)","v":0}]
["Groupe I : Produits de la tarification",{"v":0,"d":"0.00 €"},{"$f":"CRP_PGFP!$K$47+CRP_PGFP_SF!$K$47","v":{"v":0,"d":"0.00 €"}}]
["(*) Dont aides ponctuelles par dotations non  reconductibles ",{"v":0,"d":"0.00 €"},{"$f":"CRP_PGFP!$K$53+CRP_PGFP!$K$54+CRP_PGFP!$K$55+CRP_PGFP_SF!$K$53+CRP_PGFP_SF!$K$54+CRP_PGFP_SF!$K$55","v":{"v":0,"d":"0.00 €"}}]
["Groupe II : Autres produits d'exploitation",{"v":0,"d":"0.00 €"},{"$f":"CRP_PGFP!$K$56+CRP_PGFP_SF!$K$56","v":{"v":0,"d":"0.00 €"}}]
["(*) Dont produits du compte 70",{"v":0,"d":"0.00 €"}]
["(*) Dont produits du compte 72",{"v":0,"d":"0.00 €"}]
["Groupe III : Produits financiers, exceptionnels et non encaissables",{"v":0,"d":"0.00 €"},{"$f":"CRP_PGFP!$K$60+CRP_PGFP_SF!$K$60","v":{"v":0,"d":"0.00 €"}}]
["Total des produits (1)",{"v":0,"d":"0.00 €"},{"$f":"C1118+C1120+C1123","v":{"v":0,"d":"0.00 €"}}]
["Dont produits (hors c/747, 757, 775, 777 et 78)",{"v":0,"d":"0.00 €"},{"$f":"CRP_PGFP!$K$77-CRP_PGFP!$K$63-CRP_PGFP!$K$64-CRP_PGFP!$K$65-CRP_PGFP!$K$66-CRP_PGFP!$K$67-CRP_PGFP!$K$68-CRP_PGFP!$K$69-CRP_PGFP!$K$70-CRP_PGFP!$K$71-CRP_PGFP!$K$72-CRP_PGFP!$K$73-CRP_PGFP!$K$74-CRP_PGFP!$K$75+CRP_PGFP_SF!$K$77-CRP_PGFP_SF!$K$63-CRP_PGFP_SF!$K$64-CRP_PGFP_SF!$K$65-CRP_PGFP_SF!$K$66-CRP_PGFP_SF!$K$67-CRP_PGFP_SF!$K$68-CRP_PGFP_SF!$K$69-CRP_PGFP_SF!$K$70-CRP_PGFP_SF!$K$71-CRP_PGFP_SF!$K$72-CRP_PGFP_SF!$K$73-CRP_PGFP_SF!$K$74-CRP_PGFP_SF!$K$75","v":{"v":0,"d":"0.00 €"}}]
["Charges",{"v":0,"d":"0.00 €"}]
["Groupe I : Charges afférentes à l'exploitation courante",{"v":0,"d":"0.00 €"},{"$f":"CRP_PGFP!$K$9+CRP_PGFP_SF!$K$9","v":{"v":0,"d":"0.00 €"}}]
["(*) Dont achats stockés et variation des stocks",{"v":0,"d":"0.00 €"}]
["(*) Dont comptes 709 et 713 en charges",{"v":0,"d":"0.00 €"}]
["Groupe II : Charges afférentes au personnel",{"v":0,"d":"0.00 €"},{"$f":"CRP_PGFP!$K$13+CRP_PGFP_SF!$K$13","v":{"v":0,"d":"0.00 €"}}]
["Groupe III : Charges afférentes à la structure",{"v":0,"d":"0.00 €"},{"$f":"CRP_PGFP!$K$18+CRP_PGFP_SF!$K$18","v":{"v":0,"d":"0.00 €"}}]
["(*) Dont charges non décaissables",{"v":0,"d":"0.00 €"}]
["(*) Dont charges des comptes 61 et 62 du groupe 3",{"v":0,"d":"0.00 €"},{"$f":"CRP_PGFP!$K$19+CRP_PGFP!$K$23+CRP_PGFP_SF!$K$19+CRP_PGFP_SF!$K$23","v":{"v":0,"d":"0.00 €"}}]
["(*) Dont charges des comptes 63 à 65 du Groupe 3 des dépenses",{"v":0,"d":"0.00 €"},{"$f":"CRP_PGFP!$K$21+CRP_PGFP!$K$22+CRP_PGFP_SF!$K$21+CRP_PGFP_SF!$K$22","v":{"v":0,"d":"0.00 €"}}]
["Total des charges (2)",{"v":0,"d":"0.00 €"},{"$f":"C1127+C1130+C1131","v":{"v":0,"d":"0.00 €"}}]
["(*) Dont charges des comptes 60 à 62",{"v":0,"d":"0.00 €"},{"$f":"CRP_PGFP!$K$9+CRP_PGFP!$K$19+CRP_PGFP!$K$23+CRP_PGFP_SF!$K$9+CRP_PGFP_SF!$K$19+CRP_PGFP_SF!$K$23+'CRPP NON SOUMIS EQUIL'!$F$39+'CRPP NON SOUMIS EQUIL'!$F$40+'CRPP SOUMIS EQUILIBRE'!$F$39+'CRPP SOUMIS EQUILIBRE'!$F$40+CRP_SF!$F$39+CRP_SF!$F$40+CRP_PGFP!$F$14+CRP_PGFP!$G$14+CRP_PGFP!$H$14+CRP_PGFP!$I$14+CRP_PGFP!$J$14+CRP_PGFP!$K$14+CRP_PGFP_SF!$F$14+CRP_PGFP_SF!$G$14+CRP_PGFP_SF!$H$14+CRP_PGFP_SF!$I$14+CRP_PGFP_SF!$J$14+CRP_PGFP_SF!$K$14","v":{"v":0,"d":"0.00 €"}}]
["(*) Dont charges des comptes 63 et 645 à 647",{"v":0,"d":"0.00 €"}]
["Résultat prévisionnel (1) - (2) ",{"v":0,"d":"0.00 €"},{"$f":"C1124-C1135","v":{"v":0,"d":"0.00 €"}}]
[null,0]
["(FRE) Résultat prévisionnel",{"v":0,"d":"0.00 €"},{"$f":"C1138","v":{"v":0,"d":"0.00 €"}}]
["Flux internes (charges) (+)",{"v":0,"d":"0.00 €"},{"$f":"SUM(C1142:C1148)","v":{"v":0,"d":"0.00 €"}}]
["(FRI) Valeur comptable des immobilisations incorporelles et corporelles cédées",{"v":0,"d":"0.00 €"},{"$f":"CRP_PGFP!$K$25+CRP_PGFP_SF!$K$25","v":{"v":0,"d":"0.00 €"}}]
["(FRI) Dotations aux amortissements des immobilisations incorporelles et corporelles",{"v":0,"d":"0.00 €"},{"$f":"CRP_PGFP!$K$27+CRP_PGFP!$K$26+CRP_PGFP_SF!$K$27+CRP_PGFP_SF!$K$26","v":{"v":0,"d":"0.00 €"}}]
["(FRI) Dotations aux provisions réglementées impactant le FRI",{"v":0,"d":"0.00 €"},{"$f":"CRP_PGFP!$K$30+CRP_PGFP!$K$31+CRP_PGFP_SF!$K$30+CRP_PGFP_SF!$K$31","v":{"v":0,"d":"0.00 €"}}]
["(FRI) Autres dotations aux amortissements,  provisions et dépréciations impactant le FRI (dont c/68748)",{"v":0,"d":"0.00 €"},{"$f":"CRP_PGFP!$K$28+CRP_PGFP!$K$29+CRP_PGFP!$K$32+CRP_PGFP_SF!$K$28+CRP_PGFP_SF!$K$29+CRP_PGFP_SF!$K$32","v":{"v":0,"d":"0.00 €"}}]
["(FRI) Reports en fonds dédiés à l'investissement sur concours publics des entités gestionnaires d'ESSMS (c/68921) - ESSMS privés",{"v":0,"d":"0.00 €"},{"$f":"CRP_PGFP!$K$33+CRP_PGFP_SF!$K$33","v":{"v":0,"d":"0.00 €"}}]
["(FRE) Autres dotations aux amortissements, provisions et dépréciations",{"v":0,"d":"0.00 €"},{"$f":"CRP_PGFP!$K$34+CRP_PGFP!$K$35+CRP_PGFP!$K$36+CRP_PGFP_SF!$K$34+CRP_PGFP_SF!$K$35+CRP_PGFP_SF!$K$36","v":{"v":0,"d":"0.00 €"}}]
["(FRE) Reports en fonds dédiés (sauf c/68921) - ESSMS privés",{"v":0,"d":"0.00 €"},{"$f":"CRP_PGFP!$K$37+CRP_PGFP_SF!$K$37","v":{"v":0,"d":"0.00 €"}}]
["Flux internes (produits) (-)",{"v":0,"d":"0.00 €"},{"$f":"SUM(C1150:C1157)","v":{"v":0,"d":"0.00 €"}}]
["(FRI) Reprises sur provisions réglementées  impactant le FRI",{"v":0,"d":"0.00 €"},{"$f":"CRP_PGFP!$K$66+CRP_PGFP!$K$68+CRP_PGFP_SF!$K$66+CRP_PGFP_SF!$K$68","v":{"v":0,"d":"0.00 €"}}]
["(FRI) Reprises sur amortissements, autres provisions et dépréciations impactant le FRI  (dont c/78748)",{"v":0,"d":"0.00 €"},{"$f":"CRP_PGFP!$K$69+CRP_PGFP_SF!$K$69+CRP_PGFP!$K$67+CRP_PGFP_SF!$K$67+CRP_PGFP!$K$70+CRP_PGFP_SF!$K$70","v":{"v":0,"d":"0.00 €"}}]
["(FRE) Reprises sur autres provisions et dépréciations",{"v":0,"d":"0.00 €"},{"$f":"CRP_PGFP!$K$72+CRP_PGFP!$K$73+CRP_PGFP!$K$74+CRP_PGFP_SF!$K$72+CRP_PGFP_SF!$K$73+CRP_PGFP_SF!$K$74","v":{"v":0,"d":"0.00 €"}}]
["(FRI) Quote-part des subventions virées au résultat de l'exercice",{"v":0,"d":"0.00 €"},{"$f":"CRP_PGFP!$K$64+CRP_PGFP_SF!$K$64","v":{"v":0,"d":"0.00 €"}}]
["(FRI) Quote-part d'éléments du fonds associatif virée au compte de résultat",{"v":0,"d":"0.00 €"},{"$f":"CRP_PGFP!$K$65+CRP_PGFP_SF!$K$65","v":{"v":0,"d":"0.00 €"}}]
["(FRI) Produits des cessions d'immobilisations incorporelles et corporelles",{"v":0,"d":"0.00 €"},{"$f":"CRP_PGFP!$K$63+CRP_PGFP_SF!$K$63","v":{"v":0,"d":"0.00 €"}}]
["(FRI) Utilisation des fonds dédiés à l'investissement sur concours publics des entités gestionnaires d'ESSMS (c/78921) - ESSMS privés",{"v":0,"d":"0.00 €"},{"$f":"CRP_PGFP!$K$71+CRP_PGFP_SF!$K$71","v":{"v":0,"d":"0.00 €"}}]
["(FRE) Utilisation de fonds dédiés et de fonds reportés (sauf c/78921) - ESSMS privés",{"v":0,"d":"0.00 €"},{"$f":"CRP_PGFP!$K$75+CRP_PGFP_SF!$K$75","v":{"v":0,"d":"0.00 €"}}]
["Capacité (+) / Insuffisance (-) d'autofinancement prévisionnelle",{"v":0,"d":"0.00 €"},{"$f":"C1138+C1141-C1149","v":{"v":0,"d":"0.00 €"}}]
["Dont part affectant le fonds de roulement d'investissement FRI = (3)",{"v":0,"d":"0.00 €"},{"$f":"C1142+C1143+C1144+C1145-C1150-C1151-C1153-C1154-C1155","v":{"v":0,"d":"0.00 €"}}]
["Dont part affectant le fonds de roulement d'exploitation FRE = (4)",{"v":0,"d":"0.00 €"},{"$f":"C1140+C1147+C1148-C1152-C1157","v":{"v":0,"d":"0.00 €"}}]
["(*) : Les lignes précédées d'un astérisque, qui servent à collecter des données intermédiaires nécessaires au calcul d'indicateurs, peuvent être masquées. ",0]
[null,0,"N+6"]
["Augmentation des financements stables d'investissement de la période = (5)",{"v":0,"d":"0.00 €"},{"$f":"SUM(C1164:C1171)","v":{"v":0,"d":"0.00 €"}}]
["CAF ou IAF (signe -) prévisionnelle affectée au FRI =(3)",{"v":0,"d":"0.00 €"},{"$f":"C1159","v":{"v":0,"d":"0.00 €"}}]
["Affectation des résultats à l'investissement",{"v":0,"d":"0.00 €"}]
["Apports",{"v":0,"d":"0.00 €"}]
["Subventions ",{"v":0,"d":"0.00 €"}]
["Emprunts",{"v":0,"d":"0.00 €"}]
["Produits de cessions d'immobilisations",{"v":0,"d":"0.00 €"}]
["Comptes de liaison investissement (ESSMS privés uniquement)",{"v":0,"d":"0.00 €"}]
["Autres",{"v":0,"d":"0.00 €"}]
["Diminution des financements stables d'investissement de la période =(6)",{"v":0,"d":"0.00 €"},{"$f":"C1173+C1174+C1184+C1185+C1186","v":{"v":0,"d":"0.00 €"}}]
["Fonds associatifs, apports, dotations et réserves (réduction) (ESSMS privés uniquement)",{"v":0,"d":"0.00 €"}]
["Remboursements des emprunts",{"v":0,"d":"0.00 €"}]
["Acquisition d'immobilisations :",{"v":0,"d":"0.00 €"},{"$f":"SUM(C1176:C1183)","v":{"v":0,"d":"0.00 €"}}]
["Immobilisations incorporelles",{"v":0,"d":"0.00 €"}]
["Terrains",{"v":0,"d":"0.00 €"}]
["Agencements de terrains",{"v":0,"d":"0.00 €"}]
["Constructions",{"v":0,"d":"0.00 €"}]
["Installations techniques matériel et outillage",{"v":0,"d":"0.00 €"}]
["Autres immobilisations corporelles",{"v":0,"d":"0.00 €"}]
["Immobilisations en cours",{"v":0,"d":"0.00 €"}]
["Immobilisations financières",{"$f":"SUM(C1183:IV1183)","v":{"v":0,"d":"0.00 €"}}]
["Reprise sur les réserves de compensation des charges d'amortissement",{"v":0,"d":"0.00 €"},{"$f":"C1192","v":{"v":0,"d":"0.00 €"}}]
["Autres dépenses",{"v":0,"d":"0.00 €"}]
["Comptes de liaison investissement (ESSMS privés uniquement)",{"v":0,"d":"0.00 €"}]
["Variations du FRI (5) - (6) = (7)",{"v":0,"d":"0.00 €"},{"$f":"C1163-C1172","v":{"v":0,"d":"0.00 €"}}]
["FRI initial (8)",{"v":0,"d":"0.00 €"}]
["FRI cumulé de fin de période = (7) + (8) = (9)",{"v":0,"d":"0.00 €"},{"$f":"C1187+C1188","v":{"v":0,"d":"0.00 €"}}]
["Augmentation des financements stables d'exploitation de la période = (10)",{"v":0,"d":"0.00 €"},{"$f":"C1191+C1192+C1193","v":{"v":0,"d":"0.00 €"}}]
["CAF  ou IAF (signe -) prévisionnelle affectée au FRE",{"v":0,"d":"0.00 €"},{"$f":"C1160","v":{"v":0,"d":"0.00 €"}}]
["Reprises sur les réserves de compensation des charges d'amortissement",{"v":0,"d":"0.00 €"},{"$f":"CRP_PGFP!$K$80+CRP_PGFP_SF!$K$80","v":{"v":0,"d":"0.00 €"}}]
["Comptes de liaison stable exploitation (établissements privés)",{"v":0,"d":"0.00 €"}]
["Diminution des financements stables d'exploitation de la période = (11)",{"v":0,"d":"0.00 €"},{"$f":"SUM(C1195:C1197)","v":{"v":0,"d":"0.00 €"}}]
["Reprise à l'investissement des réserves de couverture du BFR",{"v":0,"d":"0.00 €"}]
["Affectation des résultats à l'investissement",{"v":0,"d":"0.00 €"}]
["Comptes de liaison stable exploitation (ESSMS privés uniquement)",{"v":0,"d":"0.00 €"}]
["Variations du FRE (10) - (11) = (12)",{"v":0,"d":"0.00 €"},{"$f":"C1190-C1194","v":{"v":0,"d":"0.00 €"}}]
["FRE initial (13)",{"v":0,"d":"0.00 €"}]
["FRE cumulé de fin de période = (12) + (13) = (14)",{"v":0,"d":"0.00 €"},{"$f":"C1198+C1199","v":{"v":0,"d":"0.00 €"}}]
[null,0]
["Apport ou prélèvement sur le fonds de roulement net global = (7) + (12) = (15)",{"v":0,"d":"0.00 €"},{"$f":"C1187+C1198","v":{"v":0,"d":"0.00 €"}}]
["FRNG initial = (16)",{"v":0,"d":"0.00 €"}]
["Fonds de Roulement Net Global (FRNG) de fin de période = (15) + (16) = (17)",{"v":0,"d":"0.00 €"},{"$f":"C1202+C1203","v":{"v":0,"d":"0.00 €"}}]
[null,0]
[null,0,"N+6"]
["Augmentation du besoin en fonds de roulement de la période = (18)",{"v":0,"d":"0.00 €"},{"$f":"SUM(C1208:C1211)","v":{"v":0,"d":"0.00 €"}}]
["Augmentation des stocks",{"v":0,"d":"0.00 €"}]
["Augmentation des créances (effet volume ou prix)",{"v":0,"d":"0.00 €"}]
["Diminution des dettes fournisseurs (effet volume ou prix)",{"v":0,"d":"0.00 €"}]
["Diminution des autres dettes d'exploitation",{"v":0,"d":"0.00 €"}]
["Diminution du besoin en fonds de roulement de la période = (19)",{"v":0,"d":"0.00 €"},{"$f":"SUM(C1213:C1216)","v":{"v":0,"d":"0.00 €"}}]
["Diminution des stocks",{"v":0,"d":"0.00 €"}]
["Diminution des créances (effet volume ou prix)",{"v":0,"d":"0.00 €"}]
["Augmentation des dettes fournisseurs",{"v":0,"d":"0.00 €"}]
["Augmentation des autres dettes",{"v":0,"d":"0.00 €"}]
["Variations du BFR = (18) - (19) = (20)",{"v":0,"d":"0.00 €"},{"$f":"C1207-C1212","v":{"v":0,"d":"0.00 €"}}]
["BFR initial (21)",{"v":0,"d":"0.00 €"}]
["BFR cumulé fin de période = (20) + (21) = (22)",{"v":0,"d":"0.00 €"},{"$f":"C1217+C1218","v":{"v":0,"d":"0.00 €"}}]
["Variations de la trésorerie sur la période = (7) + (12) - (20) = (23)",{"v":0,"d":"0.00 €"},{"$f":"C1202-C1217","v":{"v":0,"d":"0.00 €"}}]
["Trésorerie Initiale = (24)",{"v":0,"d":"0.00 €"}]
["Trésorerie de fin de période = (23) + (24) = (25)",{"v":0,"d":"0.00 €"},{"$f":"C1220+C1221","v":{"v":0,"d":"0.00 €"}}]
["Variations des financements à court terme = (26)",{"v":0,"d":"0.00 €"}]
["Liquidités de fin de période = (25) + (26)",{"v":0,"d":"0.00 €"},{"$f":"C1222+C1223","v":{"v":0,"d":"0.00 €"}}]
[null,0]
[null,0]
[null,0]
["Données complémentaires nécessaires au calcul des ratios",0]
["Montant cumulé des emprunts en fin d'année (1)",{"v":0,"d":"0.00 €"}]
["Montant cumulé des financements stables du FRI en fin d'année(hors amortissements)",{"v":0,"d":"0.00 €"}]
["Montant cumulé de l'actif immobilisé brut en fin d'année (2)",{"v":0,"d":"0.00 €"},{"$f":"B1233+C1176+C1178+C1179+C1180+C1181+C1182+C1183","v":{"v":0,"d":"0.00 €"}}]
["Mesures correctives le cas échéant (sorties d'immobilisations, etc.)",{"v":0,"d":"0.00 €"}]
["Montant cumulé de l'actif immobilisé brut en fin d'année pris en compte pour le calcul du taux de vétusté",{"v":0,"d":"0.00 €"}]
["Montant cumulé des amortissements en fin d'année (2)",{"v":0,"d":"0.00 €"}]
["Mesures correctives le cas échéant",{"v":0,"d":"0.00 €"}]
["Montant cumulé des amortissements en fin d'année pris en compte pour le calcul du taux de vétusté",{"v":0,"d":"0.00 €"},{"$f":"C1234-C1235","v":{"v":0,"d":"0.00 €"}}]
[null,0]
[null,0]
["Taux d'endettement (< 50%)",{"v":0,"d":"0.00%"},{"$f":"IF(C1230=0,0,C1229/C1230)","v":{"v":0,"d":"0.00%"}}]
["Durée apparente de la dette (< 10 ans)",{"v":0,"d":"0.00"},{"$f":"IF(C1158=0,0,C1229/C1158)","v":{"v":0,"d":"0.00"}}]
["CAF / Remboursement annuel du capital des emprunts (>1)",{"v":0,"d":"0.00%"},{"$f":"IF(C1174=0,0,C1158/C1174)","v":{"v":0,"d":"0.00%"}}]
["Taux de CAF en % des produits courants",{"v":0,"d":"0.00%"},{"$f":"IF(C1125=0,0,C1158/C1125)","v":{"v":0,"d":"0.00%"}}]
["Taux de vétusté global des immobilisations (2)",{"v":0,"d":"0.00"},{"$f":"IF(C1233=0,0,C1236/C1233)","v":{"v":0,"d":"0.00"}}]
["Marge brute",{"v":0,"d":"0.00 €"},{"$f":"C1118+C1120-C1127-C1130-C1133-C1134","v":{"v":0,"d":"0.00 €"}}]
["Taux de marge brute en % des produits courants",{"v":0,"d":"0.00%"},{"$f":"IF((C1118+C1120)=0,0,C1244/(C1118+C1120))","v":{"v":0,"d":"0.00%"}}]
[null,0]
["(1): Pour N-1, comptes 16 hors c/165, c/168 et c/169",{"$f":"SUM(C1247:IV1247)","v":0}]
["(2) : Le taux de vétusté pour l'année N-1 est calculé à partir des données du tableau \"FDR\". Pour les années qui suivent, les acquisitions nouvelles et les dotations aux amortissements sont intégrées automatiquement à partif des données \"CAF\" et \"FRI\" ci-dessus. Si nécessaire, ces données doivent être corrigées (notamment en cas de sorties d'immobilisation).",{"$f":"SUM(C1248:IV1248)","v":0}]
[null,{"$f":"SUM(C1249:IV1249)","v":0}]
[]
[]
["Total classe 6 (charges décaissables uniquement) - produits en attenuation N-1",{"$f":"SUM(C1252:IV1252)","v":{"v":0,"d":"0.00 €"}},{"$f":"-'CRPP NON SOUMIS EQUIL'!$E$147-'CRPP NON SOUMIS EQUIL'!$E$148-'CRPP NON SOUMIS EQUIL'!$E$149-'CRPP NON SOUMIS EQUIL'!$E$150-'CRPP NON SOUMIS EQUIL'!$E$151-'CRPP NON SOUMIS EQUIL'!$E$152-'CRPP NON SOUMIS EQUIL'!$E$153-'CRPP NON SOUMIS EQUIL'!$E$154-'CRPP NON SOUMIS EQUIL'!$E$155-'CRPP NON SOUMIS EQUIL'!$E$156-'CRPP SOUMIS EQUILIBRE'!$E$144-'CRPP SOUMIS EQUILIBRE'!$E$145-'CRPP SOUMIS EQUILIBRE'!$E$146-'CRPP SOUMIS EQUILIBRE'!$E$147-'CRPP SOUMIS EQUILIBRE'!$E$148-'CRPP SOUMIS EQUILIBRE'!$E$149-'CRPP SOUMIS EQUILIBRE'!$E$150-'CRPP SOUMIS EQUILIBRE'!$E$151-'CRPP SOUMIS EQUILIBRE'!$E$152-'CRPP SOUMIS EQUILIBRE'!$E$153-CRP_SF!$E$147-CRP_SF!$E$148-CRP_SF!$E$149-CRP_SF!$E$150-CRP_SF!$E$151-CRP_SF!$E$152-CRP_SF!$E$153-CRP_SF!$E$154-CRP_SF!$E$155-CRP_SF!$E$156","v":{"v":0,"d":"0.00 €"}}]
["Total des charges (comptes 63 et 645 à 647)",{"$f":"SUM(C1253:IV1253)","v":{"v":0,"d":"0.00 €"}},{"$f":"-'CRPP NON SOUMIS EQUIL'!$E$154-'CRPP SOUMIS EQUILIBRE'!$E$151-CRP_SF!$E$154","v":{"v":0,"d":"0.00 €"}}]
[]
["Ratios financiers"]
["Ratio dettes fournisseurs : prendre en compte dans le dénominateur les charges 62 figurant au groupe II (personnel extérieur et rémunérations d'intermédiaire / honoraires) et soustraire les comptes Rabais, remises, ristournes (c/609,619 et 629)",{"$f":"SUM(C1256:IV1256)","v":{"v":0,"d":"0.00 €"}},{"$f":"(-'CRPP NON SOUMIS EQUIL'!$E$39-'CRPP NON SOUMIS EQUIL'!$E$40-'CRPP NON SOUMIS EQUIL'!$E$148-'CRPP NON SOUMIS EQUIL'!$E$149-'CRPP NON SOUMIS EQUIL'!$E$150)+('CRPP SOUMIS EQUILIBRE'!$E$39+'CRPP SOUMIS EQUILIBRE'!$E$40-'CRPP SOUMIS EQUILIBRE'!$E$145-'CRPP SOUMIS EQUILIBRE'!$E$146-'CRPP SOUMIS EQUILIBRE'!$E$147)+(-CRP_SF!$E$39-CRP_SF!$E$40-CRP_SF!$E$148-CRP_SF!$E$149-CRP_SF!$E$150)","v":{"v":0,"d":"0.00 €"}}]
[]
[]
["Total classe 6 (charges décaissables uniquement) - produits en attenuation N-2",{"$f":"SUM(C1259:IV1259)","v":{"v":0,"d":"0.00 €"}},{"$f":"-'CRPP NON SOUMIS EQUIL'!$D$147-'CRPP NON SOUMIS EQUIL'!$D$148-'CRPP NON SOUMIS EQUIL'!$D$149-'CRPP NON SOUMIS EQUIL'!$D$150-'CRPP NON SOUMIS EQUIL'!$D$151-'CRPP NON SOUMIS EQUIL'!$D$152-'CRPP NON SOUMIS EQUIL'!$D$153-'CRPP NON SOUMIS EQUIL'!$D$154-'CRPP NON SOUMIS EQUIL'!$D$155-'CRPP NON SOUMIS EQUIL'!$D$156-'CRPP SOUMIS EQUILIBRE'!$D$144-'CRPP SOUMIS EQUILIBRE'!$D$145-'CRPP SOUMIS EQUILIBRE'!$D$146-'CRPP SOUMIS EQUILIBRE'!$D$147-'CRPP SOUMIS EQUILIBRE'!$D$148-'CRPP SOUMIS EQUILIBRE'!$D$149-'CRPP SOUMIS EQUILIBRE'!$D$150-'CRPP SOUMIS EQUILIBRE'!$D$151-'CRPP SOUMIS EQUILIBRE'!$D$152-'CRPP SOUMIS EQUILIBRE'!$D$153-CRP_SF!$D$147-CRP_SF!$D$148-CRP_SF!$D$149-CRP_SF!$D$150-CRP_SF!$D$151-CRP_SF!$D$152-CRP_SF!$D$153-CRP_SF!$D$154-CRP_SF!$D$155-CRP_SF!$D$156","v":{"v":0,"d":"0.00 €"}}]
["Total des charges (comptes 63 et 645 à 647) - recettes en atténuation N-2",{"$f":"SUM(C1260:IV1260)","v":{"v":0,"d":"0.00 €"}},{"$f":"-'CRPP NON SOUMIS EQUIL'!$D$154-'CRPP SOUMIS EQUILIBRE'!$D$151-CRP_SF!$D$154","v":{"v":0,"d":"0.00 €"}}]
[]
["Pour le calcul du montant cumulé des financements stables du FRI du PGFP - N "]
["Dotations aux amortissements exceptionnels des immobilisations",{"$f":"SUM(C1263:IV1263)","v":{"v":0,"d":"0.00 €"}},{"$f":"'CRPP NON SOUMIS EQUIL'!$F$93+'CRPP SOUMIS EQUILIBRE'!$F$95+CRP_SF!$F$93","v":{"v":0,"d":"0.00 €"}}]
["Dotations aux amortissements des charges d'exploitation à répartir",{"$f":"SUM(C1264:IV1264)","v":{"v":0,"d":"0.00 €"}},{"$f":"CRP_PGFP!$E$28+CRP_PGFP_SF!$E$28","v":{"v":0,"d":"0.00 €"}}]
["Reprise sur amortissements des immobilisations incoporelles et corporelles",{"$f":"SUM(C1265:IV1265)","v":{"v":0,"d":"0.00 €"}},{"$f":"'CRPP NON SOUMIS EQUIL'!$F$175+'CRPP SOUMIS EQUILIBRE'!$F$171+CRP_SF!$F$175","v":{"v":0,"d":"0.00 €"}}]
[]
["Pour le calcul du montant cumulé des financements stables du FRI du PGFP - N +1"]
["Dotations aux amortissements des charges d'exploitation à répartir",{"$f":"SUM(C1268:IV1268)","v":{"v":0,"d":"0.00 €"}},{"$f":"CRP_PGFP!$F$28+CRP_PGFP_SF!$F$28","v":{"v":0,"d":"0.00 €"}}]
["Reprises sur autres amortissements, autres provisions et dépréciations impactant le FRI",{"$f":"SUM(C1269:IV1269)","v":{"v":0,"d":"0.00 €"}},{"$f":"CRP_PGFP!$F$69+CRP_PGFP_SF!$F$69","v":{"v":0,"d":"0.00 €"}}]
[]
["Pour le calcul du montant cumulé des financements stables du FRI du PGFP - N +2"]
["Dotations aux amortissements des charges d'exploitation à répartir",{"$f":"SUM(C1272:IV1272)","v":{"v":0,"d":"0.00 €"}},{"$f":"CRP_PGFP!$G$28+CRP_PGFP_SF!$G$28","v":{"v":0,"d":"0.00 €"}}]
["Reprises sur autres amortissements, autres provisions et dépréciations impactant le FRI",{"$f":"SUM(C1273:IV1273)","v":{"v":0,"d":"0.00 €"}},{"$f":"CRP_PGFP!$G$69+CRP_PGFP_SF!$G$69","v":{"v":0,"d":"0.00 €"}}]
[]
["Pour le calcul du montant cumulé des financements stables du FRI du PGFP - N +3"]
["Dotations aux amortissements des charges d'exploitation à répartir",{"$f":"SUM(C1276:IV1276)","v":{"v":0,"d":"0.00 €"}},{"$f":"CRP_PGFP!$H$28+CRP_PGFP_SF!$H$28","v":{"v":0,"d":"0.00 €"}}]
["Reprises sur autres amortissements, autres provisions et dépréciations impactant le FRI",{"$f":"SUM(C1277:IV1277)","v":{"v":0,"d":"0.00 €"}},{"$f":"CRP_PGFP!$H$69+CRP_PGFP_SF!$H$69","v":{"v":0,"d":"0.00 €"}}]
[]
["Pour le calcul du montant cumulé des financements stables du FRI du PGFP - N +4"]
["Dotations aux amortissements des charges d'exploitation à répartir",{"$f":"SUM(C1280:IV1280)","v":{"v":0,"d":"0.00 €"}},{"$f":"CRP_PGFP!$I$28+CRP_PGFP_SF!$I$28","v":{"v":0,"d":"0.00 €"}}]
["Reprises sur autres amortissements, autres provisions et dépréciations impactant le FRI",{"$f":"SUM(C1281:IV1281)","v":{"v":0,"d":"0.00 €"}},{"$f":"CRP_PGFP!$I$69+CRP_PGFP_SF!$I$69","v":{"v":0,"d":"0.00 €"}}]
[]
["Pour le calcul du montant cumulé des financements stables du FRI du PGFP - N +5"]
["Dotations aux amortissements des charges d'exploitation à répartir",{"$f":"SUM(C1284:IV1284)","v":{"v":0,"d":"0.00 €"}},{"$f":"CRP_PGFP!$J$28+CRP_PGFP_SF!$J$28","v":{"v":0,"d":"0.00 €"}}]
["Reprises sur autres amortissements, autres provisions et dépréciations impactant le FRI",{"$f":"SUM(C1285:IV1285)","v":{"v":0,"d":"0.00 €"}},{"$f":"CRP_PGFP!$J$69+CRP_PGFP_SF!$J$69","v":{"v":0,"d":"0.00 €"}}]
[]
["Pour le calcul du montant cumulé des financements stables du FRI du PGFP - N +6"]
["Dotations aux amortissements des charges d'exploitation à répartir",{"$f":"SUM(C1288:IV1288)","v":{"v":0,"d":"0.00 €"}},{"$f":"CRP_PGFP!$K$28+CRP_PGFP_SF!$K$28","v":{"v":0,"d":"0.00 €"}}]
["Reprises sur autres amortissements, autres provisions et dépréciations impactant le FRI",{"$f":"SUM(C1289:IV1289)","v":{"v":0,"d":"0.00 €"}},{"$f":"CRP_PGFP!$K$69+CRP_PGFP_SF!$K$69","v":{"v":0,"d":"0.00 €"}}]
[]
["Pour le calcul du taux de marge brute d'exploitation N-1"]
["Marge brute d'exploitation",{"$f":"SUM(C1292:IV1292)","v":{"v":0,"d":"0.00 €"}},{"$f":"'CRPP NON SOUMIS EQUIL'!$E$205+'CRPP SOUMIS EQUILIBRE'!$E$199+CRP_SF!$E$205","v":{"v":0,"d":"0.00 €"}}]
["Produits courants d'exploitation (Comptes 70 à 75 - c/ 709 et 713)",{"$f":"SUM(C1293:IV1293)","v":{"v":0,"d":"0.00 €"}},{"$f":"'CRPP NON SOUMIS EQUIL'!$E$206+'CRPP SOUMIS EQUILIBRE'!$E$200+CRP_SF!$E$206","v":{"v":0,"d":"0.00 €"}}]

{"sheet":"LISEZ-MOI","index":3,"n_rows":258,"n_cols":4,"rows_kept":258,"merged":[[1,1,1,11],[3,2,3,11],[5,2,5,11],[6,2,6,11],[10,2,10,11],[12,2,12,11],[13,2,13,11],[14,2,14,11],[16,2,17,11],[19,2,19,11],[20,2,20,11],[21,2,21,11],[23,2,23,8],[25,2,25,11],[26,2,26,11],[27,2,27,11],[28,2,28,11],[29,2,29,11],[31,2,31,11],[32,2,32,11],[36,2,36,11],[37,2,37,11],[39,2,39,11],[40,2,40,11],[42,2,42,11],[47,2,47,11],[55,2,55,11],[57,2,57,11],[58,2,58,11],[59,2,59,11],[62,2,62,11],[64,2,64,11],[65,2,65,11],[68,2,68,11],[69,2,69,11],[70,2,70,11],[78,2,78,11],[82,2,82,11],[83,2,83,11],[84,2,84,11],[86,2,86,11],[87,2,87,11],[88,2,88,11],[92,2,92,11],[93,2,93,11],[94,2,94,11],[95,2,95,11],[96,2,96,11],[97,2,97,11],[99,2,99,11],[100,2,100,11],[102,2,102,11],[106,1,106,11],[108,2,108,7],[109,2,109,11],[110,2,110,11],[112,2,112,7],[113,2,113,11],[115,2,115,7],[118,2,118,7],[121,3,121,11],[122,3,122,11],[124,2,124,7],[125,2,125,11],[127,2,127,7],[130,2,130,7],[131,2,131,11],[134,2,134,7],[137,2,137,7],[139,2,139,11],[141,2,141,7],[142,2,142,11],[144,2,144,7],[145,2,145,11],[147,2,147,7],[150,2,150,7],[153,2,153,7],[156,2,156,7],[159,2,159,7],[162,2,162,7],[163,2,163,11],[165,2,165,7],[166,2,166,11],[168,2,168,7],[169,2,169,11],[172,2,172,7],[173,2,173,11],[175,2,175,7],[176,2,176,11],[178,2,178,7],[179,2,179,11],[181,2,181,7],[182,2,182,11],[184,2,184,7],[185,2,185,11],[187,2,187,7],[188,2,188,11],[190,2,190,7],[191,2,191,11],[193,2,193,7],[194,2,194,11],[196,2,196,7],[197,2,197,11],[199,2,199,7],[200,2,200,11],[202,2,202,7],[203,2,203,11],[205,2,205,7],[206,2,206,11],[208,2,208,7],[209,2,209,11],[211,2,211,7],[212,2,212,11],[214,2,214,7],[215,2,215,11],[217,2,217,7],[218,2,218,11],[220,2,220,7],[221,2,221,11],[223,2,223,7],[224,2,224,11],[226,2,226,7],[227,2,227,11],[229,2,229,7],[230,2,230,11],[232,2,232,7],[233,2,233,11],[235,2,235,7],[236,2,236,11],[238,2,238,7],[239,2,239,11],[241,2,241,7],[242,2,242,11],[244,2,244,7],[245,2,245,11],[247,2,247,7],[248,2,248,11],[250,2,250,7],[251,2,251,11],[253,2,253,7],[254,2,254,11],[256,2,256,7],[257,2,257,11]]}
[null,"Dernière mise à jour : février 2026"]
[null,"Lisez-moi du cadre \"EPRD complet\""]
[]
[null,null,"Points de vigilance : \nL'attention des gestionnaires est appelée sur la complétude et la fiabilité des informations saisies dans le cadre EPRD et ses annexes, afin de sécuriser la procédure d'analyse et maintenir la qualité de la base de données collectée."]
[]
[null,null,"Ce cadre correspond à l'état des prévisions de recettes et de dépenses (EPRD) complet prévu à l'article R. 314-211 du CASF et conforme au modèle figurant à l'annexe 1 de l'arrêté du 27 décembre 2016 modifié par l'arrêté du 15 décembre 2020 (NOR: SSAA2030779A). \nDans un souci d'adaptation permanente aux pratiques et sans préjudice des obligations générales de dépôt de l'EPRD, des ajustements ponctuels peuvent être apportés par rapport aux modèles joints à l'arrêté précité et régularisés ultérieurement par arrêté modificatif."]
[null,null,"Cette notice, qui n’a qu’une valeur indicative, ne reprend pas toutes les explications nécessaires à l’élaboration des EPRD et ne se substitue pas à la documentation officielle de l'administration. Les organismes gestionnaires et les autorités de tarification peuvent contacter la direction générale de la cohésion sociale (DGCS) pour connaître son interprétation formelle des textes législatifs et réglementaires en vigueur.\nVous avez des suggestions à faire sur le contenu de ce LISEZ-MOI (informations manquantes, intitulés pas suffisamment clairs, non-conformité...) ? Contactez l’équipe référente EPRD-ERRD de la CNSA."]
[]
[null,null,"I.- Quels sont les organismes gestionnaires (OG) concernés par ce cadre ? "]
[]
[null,null,"=> Les organismes gestionnaires de tout statut juridique (hors établissements publics de santé) qui gèrent, à titre exclusif ou non, des EHPAD*, que leurs tarifs hébergement soient fixés ou non par le Conseil Départemental ou la Métropole. "]
[]
[null,null,"A noter : le décret n° 2022-734 du 28 avril 2022 portant diverses mesures d’amélioration de la transparence financière dans la gestion des établissements et services sociaux et médico-sociaux mentionnés au I de l’article L. 312-1 du code de l’action sociale et des familles (NOR: SSAA2208053D) a abrogé les cadres de présentation dits \"simplifiés\" (EPRD simplifié, RIA simplifié et annexe 5B), qui étaient applicables jusqu'à l'exercice 2022 aux gestionnaires privés d'EHPAD dont le tarif hébergement n'est pas administré."]
[null,null,"Dès lors, l'EPRD complet s'applique à tous les gestionnaire d'EHPAD à compter de l'exercice budgétaire et comptable 2023, sauf aux établissements publics de santé qui restent soumis au cadre EPCP."]
[]
[]
[null,null,"=> les OG privés, les établissements publics sociaux et médico-sociaux autonomes (EPSMS), les CCAS et CIAS qui gèrent, à titre exclusif ou non, des établissements/services/activités compris dans le périmètre d'un CPOM \"PH-SSIAD-AJA\" (article L. 313-12-2** du CASF) signé avant le 1er janvier de l'exercice N (ou conclu au cours de l'exercice N si les parties prenantes ont opté pour une mise en place anticipée de l’EPRD dès l’année de signature du CPOM, conformément aux dispositions de l’article 61 de la loi n°2019-774 du 24 juillet 2019 relative à l’organisation et à la transformation du système de santé). "]
[]
[]
[null,null,"* Dont petites unités de vie (PUV)"]
[null,null,"*** ESMS relevant de l’article L. 313-12-2 du CASF : AJA, structures d’hébergement temporaires pour personnes âgées ou personnes handicapées, IME, IEM, IES, EEAP (et autres instituts accueillant des enfants handicapés), ITEP, CAFS, CAMSP,"]
[null,null,"SESSAD, CMPP, CRP, CPO, MAS, FAM, SAMSAH, ESAT, BAPU, jardins d’enfants spécialisés, SPASAD et SSIAD."]
[]
[null,null,"II.- Périmètre de l'EPRD"]
[]
[null,null,"=> EPSMS = toutes les activités de l'entité juridique"]
[null,null,"=> CCAS/CIAS = un EPRD par budget annexe contenant un ESMS inclus dans le CPOM"]
[null,null,"=> OG privés non lucratifs = périmètre du CPOM (*) ou ensemble des établissements et services relevant du ressort territorial du contrat"]
[null,null,"=> OG privés commerciaux = périmètre du CPOM (*)"]
[null,null,"(*) : c.-à-d. l'ensemble des ESSMS/activités médico-sociales pour lesquels une pluriannualité budgétaire est prévue dans le CPOM. \nDans l'attente de la signature de ce contrat, l'EPRD regroupe tous les EHPAD implantés dans le même département. Pour les établissements du champ du handicap (+ SSIAD et AJA), le cadre du BP reste applicable. "]
[]
[null,null,"Concernant les CCAS/CIAS : un EPRD complet par budget annexe (BA)."]
[null,null,"Exemple: 1 BA regroupant 2 EHPAD (A et B) + 1 BA portant sur 1 EHPAD (C) = 2 EPRD, le premier regroupant les 2 EHPAD A et B  (avec un seul CRP pour ces 2 EHPAD) et le second portant sur l'unique EHPAD C."]
[]
[null,null,"III.- Fonctionnement du cadre "]
[]
[null,null,"Ce cadre fonctionne sur la base d'un procédé de création automatique des onglets en remplissant le tableau de page de garde nommé « Etablissements et services relevant du "]
[null,null,"périmètre de l'EPRD » et en cliquant sur l’icône : + , selon l’ordonnancement suivant : "]
[null,null,"1) Le finess juridique (FINESS EJ) doit être saisi dans le champ situé en haut de la page de garde (Champ nommé « N° FINESS (entité juridique) »)."]
[null,null,"2) Chacun des finess Etablissement (FINESS ET) relevant de l’organisme gestionnaire (c'est-à-dire du Finess EJ renseigné plus haut) et inclus dans le périmètre de l’EPRD, doit"]
[null,null,"être renseigné dans le tableau du bas de la page de garde \"Etablissements et services relevant du périmètre de l'EPRD\". "]
[]
[null,null,"Dans ce tableau, il convient de saisir une ligne par établissement ou service (nommé ci-après FINESS ET pour plus de simplicité), selon les modalités suivantes : "]
[null,null,"a) 1er finess ET : "]
[null,null,"i)     saisie de la première ligne"]
[null,null,"ii)   puis clic sur l’icône +"]
[null,null,"iii) l’onglet CRPP (*) relatif au 1er FINESS ET (ainsi que l'onglet \"CRP_PGFP\" de ce FINESS ET) et tous les autres onglets communs du cadre (\"Synthèse_CRP\","]
[null,null,"\"EPRD synthétique\", \"CAF détaillée\", \"TFP\", \"PGFP\", \"FDR\", \"Ratios financiers\", \"Tableau_Rcc\" et \"Tab_Eng. hors bilan\") sont alors automatiquement générés.  "]
[null,null,"b) 2ème finess ET : "]
[null,null,"i)     saisie de la deuxième ligne"]
[null,null,"ii)   puis clic sur l’icône +"]
[null,null,"iii) l’onglet CRPA (**) relatif au 2ème FINESS ET (ainsi que l'onglet \"CRP_PGFP\" de ce FINESS ET) est alors automatiquement généré.  "]
[null,null,"c) Etc. "]
[]
[null,null,"Les champs à saisir obligatoirement sur chaque ligne, pour que les onglets soient effectivement générés, sont: "]
[null,null,"- \"N° FINESS Etablissement\" \n- \"Catégorie\"\n-\" CRP soumis à l'obligation d'une présentation équilibrée - O/N\" (cf aide contextuelle sur le choix d'une présentation équilibrée ou pas)"]
[]
[null,null,"* CRPP : compte de résultat prévisionnel principal - Le nom de l'onglet est construit de la manière suivante : \"CRPP+NON SOUMIS EQUIL_+N°FINESS ET\" (si CRP non soumis à l'équilibre strict) ou \"CRPP+SOUMIS EQUILIBRE_+N°FINESS ET\" (si CRP soumis à l'équilibre strict)."]
[null,null,"** CRPA : compte de résultat prévisionnel annexe (en application de l'article R. 314-217 du CASF) - Le nom de l'onglet est construit de la manière suivante: \"CRPA+NON SOUMIS EQUIL_+N°FINESS ET de l'établissement\" (si CRP non soumis à l'équilibre strict) ou "]
[null,null,"\"CRPA+ SOUMIS EQUILIBRE_+N°FINESS ET\" de l'établissement\" (si CRP soumis à l'équilibre stict)"]
[]
[null,null,"IV.- Consignes d'utilisation"]
[null,null,"Un emploi incorrect ne tenant pas compte des indications ci-dessous peut affecter les fonctionnalités automatiques du cadre, le bon déroulement du dépôt et la performance de la plateforme de collecte des EPRD. "]
[null,null,"- Les cellules sur fond jaune sont à compléter manuellement. Les champs grisés sont des cellules verrouillées, qui peuvent contenir des formules de calcul automatique."]
[null,null,"- Le cadre normalisé n'est pas compatible avec Libre Office ni Open Office.  "]
[null,null,"- Veuillez ne pas copier ni déplacer le contenu d'une cellule vers une autre cellule (\"couper-coller\"/\"cliquer-glisser\"), ces actions pouvant endommager la structure des cadres Excel. Les macros de remplissage automatique des cellules ouvertes à la saisie sont possibles. "]
[null,null,"- Le N° FINESS EJ saisi dans la page de garde doit être le même que le N° FINESS EJ du dossier de dépôt dans la plateforme de collecte des EPRD. "]
[null,null,"- Les FINESS ET (Etablissement) saisis dans le tableau de la page de garde doivent impérativement correspondre aux FINESS ET affectés au dossier dans la plateforme de collecte des EPRD. "]
[null,null,"- Le déverrouillage du fichier peut impacter la bonne marche des fonctions automatiques et la reconnaissance du fichier lors du dépôt sur la plateforme."]
[null,null,"- Ne jamais laisser de liens directs pointant vers des fichiers externes ni de formules dans les cellules ouvertes à la saisie. Ces liaisons entre classeurs ou ces formules génèrent des problèmes de lisibilité pouvant exclure l'établissement concerné des bases de la CNSA."]
[null,null,"- Ne pas utiliser le caractère « | » : ce caractère est généralement réservé pour des opérations techniques. Son utilisation dans les champs de saisie peut provoquer des dysfonctionnements sur la chaîne SI (traitements data ou autres)."]
[null,null,"V.- Cas spécifique des activités sans FINESS"]
[]
[null,null,"Les activités non identifiées par un FINESS ET peuvent concerner notamment (liste non exhaustive) :"]
[null,null,"- accueils de jour adossés ; "]
[null,null,"- budgets commerciaux des ESAT ; "]
[null,null,"- services industriels et commerciaux (SIC) ; "]
[null,null,"- dotations non affectées (DNA) ; "]
[null,null,"- modes d'accueil hors hébergement permanent de plus de 25 places ou représentant plus du tiers de la capacité totale dans les établissements et services accueillant des enfants handicapés ; "]
[null,null,"- etc."]
[]
[null,null,"Afin de permettre leur intégration technique dans le présent cadre, il convient de saisir l'onglet \"Id_CR_SF\" selon le même procédé que le tableau de la page de garde décrit en"]
[null,null,"partie III. ci-dessus, afin que les onglets des CRP sans Finess soient créés automatiquement. "]
[null,null,"Pour chaque ligne, un identifiant est créé automatiquement à partir des données du tableau de l'onglet \"Id_CR_SF\" . Les onglets sont créés dans l'ordre de remplissage de ce"]
[null,null,"tableau et sont nommés selon la règle suivante: CRP_SF + n° identifiant. "]
[null,null,"Le modèle de CRP créé est le CRP non soumis à l'équilibre strict."]
[null,null,"Nous vous invitons à compléter le tableau de l'onglet \"Id_CR_SF\" selon le même ordonnancement chaque année, afin qu'un même numéro d'identification soit toujours attribué à la même activité."]
[null,null,"Tous les CRP_SF sont pris en compte dans les calculs globaux (CAF, PGFP, ratios financiers, etc.). Veillez à bien mettre en cohérence le CRP de l'établissement d'adossement"]
[null,null,"avec le CRP_SF rattaché, en déduisant les charges et produits du CRP_SF des montants indiqués dans le CRP de l'établissement d'adossement."]
[]
[null,null,"VI.- Cas des OG commerciaux"]
[]
[null,null,"Les données renseignées dans le cadre de présentation de l'EPRD complet sont à présenter hors impôts sur les sociétés et participation des salariés."]
[]
[null,null,"Si l'EPRD est établi par un organisme commercial pour le compte de plusieurs sociétés gestionnaires d'EHPAD qu'il contrôle au sens de l'article L.233-3 du code de commerce, le fonctionnement du cadre décrit en III. ci-dessus est valable, même si les FINESS ET ne relèvent pas du même FINESS EJ."]
[null,null,"Un seul FINESS EJ, parmi les FINESS EJ d'une des sociétés contrôlées ou le FINESS EJ de la société mère, peut être indiqué dans le champ \"N° FINESS (entité"]
[null,null,"juridique)\" de la page de garde. Le n° FINESS EJ sélectionné est laissé au choix de l'organisme gestionnaire. Le n° FINESS EJ sélectionné devra également être celui qui est"]
[null,null,"indiqué dans le dossier de dépôt de l'EPRD dans la plateforme."]
[]
[null,null,"Pour rappel, dans la plateforme, l'organisme devra, au moment de son dépôt, cocher la case \"Société commerciale contrôlée\", afin de permettre le choix des FINESS EJ et"]
[null,null,"l'affectation des établissements et services (FINESS ET) relevant de FINESS EJ différents. "]
[]
[]
[]
[]
[]
[null,"Récapitulatif des aides contextuelles "]
[]
[null,1,"N° FINESS (entité juridique)"]
[null,null,"=> Indiquer le numéro finess de l'organisme gestionnaire ou de l'établissement public, en tant que personnalité morale titulaire des autorisations. Il doit correspondre au N° FINESS EJ du dossier de dépôt dans la plateforme de collecte des EPRD."]
[null,null,"=> Pour les organismes commerciaux, indiquer celui qui a été sélectionné pour déposer le fichier dans la plateforme."]
[]
[null,2,"Première ligne du tableau de la page de garde"]
[null,null,"=> Indiquer le CRP principal (au choix de l'organisme suite à la signature du CPOM)"]
[]
[null,3,"Deuxième ligne et lignes suivantes du tableau de la page de garde "]
[null,null,"=> Indiquer les CRP annexes."]
[]
[null,4,"Icônes du tableau de la page de garde"]
[{"$nulls":3},"=> crée les onglets correspondants selon le procédé décrit dans le \"LISEZ-MOI\"."]
[{"$nulls":3},"=> supprime une ligne du tableau (en se plaçant sur la ligne dont la suppression est souhaitée et en colonne C \"Etablissements et services\" puis en cliquant sur \"-\")."]
[{"$nulls":3},"=> modifie une saisie de n° FINESS ET déjà enregistrée (en se plaçant sur la ligne dont la modification est souhaitée et en colonne C \"Etablissements et services\" puis en cliquant sur l'icône)."]
[{"$nulls":3},"Les autres champs peuvent être modifiés à l'aide des menus déroulants excepté l'item \"CRP soumis à l'obligation d'une présentation équilibrée - O/N\". En cas de modification souhaitée de ce dernier, il est nécessaire de supprimer la ligne pour en recommencer une autre."]
[]
[null,5,"N° FINESS Etablissement"]
[null,null,"=> Indiquer le n° FINESS de l'établissement, du service ou de l'activité (relevant nécessairement du finess juridique indiqué plus haut, hors organismes commerciaux). Les Finess ET saisis dans le tableau de la page de garde doivent être identiques aux N° Finess ET affectés au dossier dans la plateforme de collecte des EPRD."]
[]
[null,6,"ESSMS relevant du périmètre du CPOM"]
[null,null,"=> Champ à renseigner après signature du CPOM, le périmètre de l'EPRD pouvant être plus large que celui du CPOM (cf \"II. Périmètre de l'EPRD\" dans la partie \"LISEZ-MOI\" ci-dessus)."]
[]
[null,7,"CRP soumis à l'obligation d'une présentation équilibrée"]
[null,null,"=> NON : EHPAD + établissement, service ou activité dont les règles de fixation pluriannuelle du budget sont définies dans le CPOM (qu'ils soient sous compétence ARS exclusive, CD exclusive ou conjointe ARS/CD)."]
[null,null,"=> OUI : établissements, service ou activité non inclus dans le volet financier du CPOM + ESMS sous la compétence tarifaire du préfet. EHPAD non concernés."]
[]
[null,8,"Dénomination du CRP sans n° FINESS"]
[null,null,"=> Donner un titre explicite : par exemple nom du site et structure de rattachement."]
[]
[null,9,"N° FINESS de rattachement"]
[null,null,"=> Saisir le n° FINESS de l'établissement, service ou activité auquel le budget est adossé (ESAT, AJ par ex.)."]
[null,null,"=> Sans structure d'adossement, saisir le n° FINESS ET de son choix, parmi ceux gérés par l'entité juridique, afin de le rattacher à une structure identifiée au sein du périmètre. Il est préconisé de ne pas changer le n° FINESS de rattachement d'une année sur l'autre."]
[]
[null,10,"Subventions d'investissement virées au résultat de l'exercice"]
[null,null,"Le compte 777 concerne les ESSMS publics seulement. Pour les ESSMS privés, la quote-part de subventions d'investissement virée au résultat de l'exercice est à enregistrer au compte 747."]
[]
[null,11,"Participations et créances rattachées à des participations"]
[null,null,"En cas de cession de titres de participations, l’écriture de sortie est constatée au compte 675 Valeur comptable des éléments d’actif cédés. Ce poste étant déjà pris en compte dans la CAF (lignes « Capacité d’autofinancement » / « Insuffisance d’autofinancement » du tableau de financement), il n’y a pas lieu d’ajouter une ligne spécifique « Participations et créances rattachées à des participations » dans la partie Ressources du tableau de financement prévisionnel (TFP). \nLe prix de cession quant à lui est constaté au compte 775. Son montant est neutralisé dans le calcul de la CAF ; il est donc repris dans la ligne « Produits des cessions d’éléments d’actif » de la partie Ressources du TFP."]
[]
[null,12,"Charges exceptionnelles décaissables"]
[null,null,"=> Par défaut, comptes 671, 673 et 678 ; à ajuster/compléter le cas échéant (avec mention dans le rapport budgétaire et financier)."]
[]
[null,13,"Remboursements des emprunts antérieurs (part capital)"]
[null,null,"=> Indiquer les remboursements en capital des emprunts autorisés contractés antérieurement au début du plan d'investissement (tendance morte)."]
[]
[null,14,"Remboursements des emprunts prévus au plan (part capital)"]
[null,null,"=> Indiquer les remboursements en capital des emprunts autorisés contractés dans le cadre du plan d'investissement en cours."]
[]
[null,15,"Immobilisations corporelles et incorporelles en cours"]
[null,null,"Saisir les comptes 23 sauf c/235."]
[]
[null,16,"Part Investissement PPP"]
[null,null,"Saisir les comptes 235."]
[]
[null,17,"Reprises de résultats"]
[null,null,"Information utile essentiellement pour la période de transition de l'environnement \"BP\" vers l'environnement \"EPRD\". Les résultats repris antérieurement dans le cadre de la tarification n'impactent pas le montant constaté comptablement des charges et des produits. Il s'agit de décisions strictement tarifaires. C'est pourquoi ils ne sont pas intégrés dans les calculs consolidés du présent fichier."]
[]
[null,18,"Taux d'endettement"]
[null,null,"Dette rapportée au montant total des financements de long terme du FRI et non au total des financements de long terme"]
[]
[null,19,"Vétusté des immobilisations"]
[null,null,"En l'état actuel du cadre, les comptes 23 ne sont pas à prendre en compte pour la détermination du dénominateur des taux de vétusté."]
[]
[]
[null,20,"Reprise à l'investissement des réserves de couverture du BFR"]
[null,null,"La somme des montants inscrits en D85 et D86 doit être égale au montant inscrit en D51."]
[]
[null,21,"Affectation des résultats à l'investissement"]
[null,null,"En plus des affectations de résultat au compte 10682, inclure celles éventuellement inscrites au compte 10683 (« Excédents affectés à l’investissement d’un CPOM prévu à l’article R314-43-1 du CASF »)."]
[]
[null,22,"Frais de siège"]
[null,null,"Les frais de siège autorisés sont à intégrer dans les CRP des établissements et services et à détailler dans le tableau de répartition des charges communes (onglet \"Tableau_Rcc\" avec leur clef de répartition), conformément à l'article R. 314-215 du CASF. En l'état de la réglementation, il n'existe pas de CRP spécifique à un siège ou un service commun."]
[]
[null,23,"Produits de la tarification"]
[null,null,"Prendre en compte les dernières notifications budgétaires des autorités de tarification. Le cas échéant, les prévisions de l'exercice N peuvent intégrer des montants qui n’auraient pas encore été notifiés, mais cette inscription ne vaut pas engagement de l’autorité de tarification à attribuer ces financements (article R. 314-210 du CASF)."]
[]
[null,24,"CRP soumis à l'équilibre strict"]
[null,null,"Pour les ESMS soumis à l'équilibre strict, les lignes \"TOTAL GENERAL\" des charges et des produits pour chaque CRP doivent être égales (en incluant le cas échéant les reprises de résultats antérieurs et les amortissements comptables excédentaires différés). Ces mêmes règles d'équilibre doivent être respectées pour chaque CRP_PGFP sur toute la période du plan."]
[]
[null,25,"Cohérence TFP/PGFP/FDR"]
[null,null,"L'objectif du tableau de financement est de retracer la formation du fonds de roulement d'investissement. Il n'existe donc pas une stricte équivalence entre le fonds de roulement du tableau de financement et celui de l'onglet \"Bilan financier\". La différence de périmètre est constituée principalement par les comptes de liaison stables de trésorerie pour les ESSMS privés, les autres mouvements liés au FRE étant par construction intégrés à la CAF. C'est pourquoi, pour les ESSMS privés, les mouvements de l'exercice sur les comptes de liaison stables de trésorerie sont réintégrés dans la variation du fonds de roulement présentée dans l'onglet \"EPRD synthétique\". "]
[]
[null,26,"Fonds associatifs, apports, dotations et réserves"]
[null,null,"Les réserves (comptes 106) sont, par convention, exclues des ressources et emplois stables du TFP, dans la mesure où les mouvements affectant ces comptes sont normalement sans impact sur la variation annuelle du FRNG."]
[]
[null,27,"Comptes de liaison trésorerie (stable)"]
[null,null,"Le TFP ne retrace que les opérations relative à l'investissement et se limite donc aux comptes de liaison investissement, tandis que le PGFP intègre en plus les emplois et ressources stables d'exploitation."]
[]
[null,28,"Ratios de rotation des dettes fournisseurs"]
[null,null,"La méthodologie de calcul retenue dans le cadre normalisé ne prend pas en compte la TVA sur les achats, compte tenu de la diversité des régimes applicables."]
[]
[null,29,"Contrôle de la variation du fonds de roulement et de la trésorerie entre EPRD synthétique et PGFP"]
[null,null,"Contrôle de cohérence intégré à titre indicatif pour sécuriser la saisie. Il pourra évoluer en fonction des pratiques de remplissage et des adaptations apportées au cadre."]
[]
[null,30,"Financements à court terme"]
[null,null,"Correspond à la variation de la trésorerie passive (lignes de trésorerie, intérêts courus non échus, concours bancaires courants, fonds des majeurs protégés, dettes fournisseurs d'immobilisations, compte de liaison trésorerie, etc.). "]
[]
[null,31,"Emprunts à plus d'un an"]
[null,null,"Les emprunts d'un an au plus ne font pas partie des ressources de long terme et sont donc à prendre en compte au niveau de la trésorerie. Cela permet une homogénéité des emprunts entre l'EPRD synthétique et le PGFP. Les données de l'EPRD N-1 sont à retraiter le cas échéant, pour assurer un périmètre harmonisé entre les exercices N/N-1. Si le FRI présente un écart entre l'onglet \"PGFP\" et l'onglet \"Bilan financier\", cela peut provenir du montant des emprunts saisis dans le TFP, qui ne doit pas contenir les intérêts courus non échus (compte 1688)."]
[]
[null,32,"Emprunts à plus d'un an"]
[null,null,"Les emprunts d'un an au plus ne font pas partie des ressources de long terme et sont donc à prendre en compte au niveau de la trésorerie (ligne \"Autres\"). Cela permet une homogénéité des emprunts entre l'EPRD synthétique, le PGFP et le bilan financier. Les données de l'EPRD N-1 sont à retraiter le cas échéant, pour assurer un périmètre harmonisé entre les exercices N/N-1."]
[]
[null,33,"Emprunts et dettes assimilées (EPRD synthétique et TFP)"]
[null,null,"Uniquement les emprunts et dettes assimilées à plus d'un an. Les emprunts d'un an au plus ne font pas partie des ressources de long terme et sont donc à prendre en compte au niveau de la trésorerie."]
[]
[null,34,{"$f":"IF(CREPASIDEN___ANNEEREF___ANN0\\_________=\"\",\"MOUVEMENTS DE L'EXERCICE SUR LES COMPTES DE LIAISON STABLES DE TRESORERIE - EXERCICE N\",\"MOUVEMENTS DE L'EXERCICE SUR LES COMPTES DE LIAISON STABLES DE TRESORERIE - EXERCICE \"&CREPASIDEN___ANNEEREF___ANN0\\_________)","v":"MOUVEMENTS DE L'EXERCICE SUR LES COMPTES DE LIAISON STABLES DE TRESORERIE - EXERCICE N"}]
[null,null,{"$f":"IF(CREPASIDEN___ANNEEREF___ANN0\\_________=\"\",\"Renseigner uniquement les variations nettes entre le 01/01/N et le 31/12/N\",\"Renseigner uniquement les variations nettes entre le 01/01/\"&CREPASIDEN___ANNEEREF___ANN0\\_________&\" et le 31/12/\"&CREPASIDEN___ANNEEREF___ANN0\\_________)","v":"Renseigner uniquement les variations nettes entre le 01/01/N et le 31/12/N"}]
[]
[null,35,"Poste \"Autres\" des augmentations des financements stables d'investissement (FRI)"]
[null,null,"ESSMS privés : inclure notamment les dépôts et cautionnements reçus (c/165) et les dettes rattachées à des participations (c/17)."]
[]
[null,36,"Poste \"Autres\" des diminutions des financements stables d'investissement de la période"]
[null,null,"ESSMS privés : inclure notamment les remboursements de dépôts et cautionnements reçus (c/165) et les dettes rattachées à des participations (c/17)."]
[]
[null,37,"Annulation de mandats sur exercices clos"]
[null,null,"La ligne 070 de l'onglet \"TFP\" concerne  les annulations de dépenses d’investissement. Elle n'est donc pas égale au montant inscrit au compte 773 du compte de résultat, montant qui n'a pas vocation à figurer au TFP. La cohérence avec le bilan est assurée par le traitement comptable de ces annulations, imputées au crédit du compte d’exécution débité à l’origine et au débit du compte 46721 « Débiteurs divers » si le mandat initial a été payé ou du compte de reste à payer où figure le mandat, dans le cas contraire."]
[]
[null,38,"Annulation de titres sur exercices clos"]
[null,null,"La ligne 071 de l'onglet \"TFP\" concerne  les annulations de recettes d’investissement. Elle n'est donc pas égale au montant inscrit au compte 673 du compte de résultat, montant qui n'a pas vocation à figurer au TFP. La cohérence avec le bilan est assurée par le traitement comptable de ces annulations, imputées au débit du compte d’exécution crédité à l’origine et au crédit du compte de débiteurs si le titre figure en restes à recouvrer ou du compte 47141 « recettes perçues en excédent à réimputer » dans le cas contraire."]
[]
[null,39,"Données complémentaires sur les comptes 165 (ESSMS publics) et 169"]
[null,null,"Pour les ESSMS privés, le montant du compte 165 est déjà exclu du périmètre des emprunts pris en compte pour le calcul du taux d'endettement et de la durée apparente de la dette. Inclure uniquement le montant du compte 169."]
[]
[null,40,"Taux de marge brute d'exploitation"]
[null,null,{"$f":"IF(CREPASIDEN___ANNEEREF___ANN0\\_________=\"\",\"Ce ratio est corrigé des comptes 709, 713 et 6611 uniquement pour les exercices N-1 et pour N, les prévisions pour ces comptes pour les exercices N+1 à N+6 n'étant pas détaillées\",\"Ce ratio est corrigé des comptes 709, 713 et 6611 uniquement pour les exercices \"&CREPASIDEN___ANNEEREF___ANN0\\_________-1&\" et \"&CREPASIDEN___ANNEEREF___ANN0\\_________&\", les prévisions pour ces comptes pour les exercices \"&CREPASIDEN___ANNEEREF___ANN0\\_________+1&\" à \"&CREPASIDEN___ANNEEREF___ANN0\\_________+6&\" n'étant pas détaillées.\")","v":"Ce ratio est corrigé des comptes 709, 713 et 6611 uniquement pour les exercices N-1 et pour N, les prévisions pour ces comptes pour les exercices N+1 à N+6 n'étant pas détaillées"}]
[]
[null,41,"Evolution de la trésorerie en jours sur la durée du PGFP (N-1 à N+6)"]
[null,null,"- Exercice N-1 : dans un souci de simplification, le ratio présenté dans le PGFP est calculé en rapportant la trésorerie de fin de période au total des charges des comptes de résultat consolidés moins les charges non décaissables du bloc \"CRP consolidés\" du plan, sans autre retraitement. \n- Exercices N à N+6 : en l'absence de projections relatives aux charges non décaissables, le ratio présenté dans le PGFP est calculé en rapportant la trésorerie de fin de période au total des charges des comptes de résultat prévisionnels du PGFP."]
[]
[null,42,"PGFP - Projection du taux de CAF"]
[null,null,"A la différence du taux de CAF calculé dans l'onglet \"Ratios_financiers\", le taux de CAF des exercices N et N-1 calculés dans le PGFP rapportent la CAF au total des produits, sans retraitement des comptes d'atténuation de charges (c/603, 609 à 629, 6419 à 6489 et 6611) ni réincorporation des comptes 709 et 713 inscrits dans les charges. Ce choix est motivé par un souci de présentation homogène et de meilleure comparabilité avec les projections des exercices N+1 à N+6, qui n'intègrent pas de retraitements particuliers liés aux comptes précités. "]
[]
[null,43,"PGFP - Projection du montant cumulé des financements stables du FRI"]
[null,null,"Sur la période N+1/N+6, la formule ne peut être autant affinée que sur la période N-1/N, pouvant occasionner une légère différence de périmètre, de manière marginale. En effet, certains paramètres ne peuvent pas être isolés. Cela concerne:\n- les éventuelles prévisions de dotations aux amortissements exceptionnels des immobilisations, comprises dans les augmentations de financements stables du FRI, contrairement à à la période N-1/N;\n- les éventuelles prévisions de reprises sur dépréciation des immobilisations incorporelles et corporelles comprises dans les baisses de financements stables du FRI, contrairement à la période N-1/N."]
[]
[null,44,"Excédents et déficits sur opérations de gestion"]
[null,null,"La nomenclature comptable M22 évolue à partir du 1er janvier 2024 avec la création des comptes 6583 « Déficits sur opérations de gestion » et 7583 « Excédents sur opérations de gestion ». Les cadres normalisés seront modifiés ultérieurement pour identifier ces subdivisions comptables. Le compte 6583 enregistre notamment les charges relatives aux écarts de caisse négatifs et aux escroqueries aux faux ordres de virement (FOVI). Le compte 7583 enregistre notamment les produits relatifs aux écarts de caisse positifs."]
[]
[null,45,"Comptes 671/771 Charges et produits exceptionnels sur opérations de gestion"]
[null,null,"ESSMS publics seulement"]
[]
[null,46,"Compte 6812 Dotations aux amortissements des charges d'exploitation à répartir"]
[null,null,"ESSMS publics seulement"]
[]
[null,47,"Compte 79 Transferts de charges"]
[null,null,"ESSMS publics seulement"]
[]
[null,48,"Compte 481 Charges à répartir sur plusieurs exercices"]
[null,null,"ESSMS publics seulement"]

{"sheet":"Recueil_consentement","index":4,"n_rows":33,"n_cols":19,"rows_kept":33,"merged":[[1,1,1,10],[3,1,3,10],[5,1,5,10],[7,1,7,10],[13,1,13,10]]}
[{"$nulls":18},"Liste_Recueil"]
[null,"Recueil du consentement pour la diffusion des données EPRD des ESSMS privés aux fédérations"]
[{"$nulls":18},"Oui"]
[null,"Cet onglet est hors champ réglementaire, son remplissage est donc facultatif. Il a pour seule vocation de permettre aux ESSMS de consentir librement à la communication de données de leurs EPRD aux fédérations de leur choix.",{"$nulls":16},"Non"]
[]
[null,"Le recueil du consentement concerne uniquement les ESSMS privés. Des conventions sont établies entre la CNSA et les fédérations destinatrices pour cadrer ces diffusions, notamment définir les règles de sécurité, de confidentialité et d'usage des données. "]
[]
[null,"Question 1 : Autorisez-vous la CNSA à communiquer les données de vos EPRD de la présente collecte à une ou plusieurs des fédérations dont vous êtes adhérent, parmi celles listées ci-dessous, à des fins de production d'analyses statistiques sur la situation comptable et financière des ESSMS ?"]
[]
[null,null,"Réponse O/N"]
[]
[]
[]
[null,"Question 2 : Si oui, à quelle(s) fédération(s) consentez-vous à ce que ces données soient communiquées pour la finalité susvisée ?\nComplétez le tableau ci-dessous."]
[]
[null,"Fédérations","Je consens à la diffusion à : "]
[null,"MUTUALITE"]
[null,"UNIOPSS.ASSO"]
[null,"UNAPEI"]
[null,"NEXEM"]
[null,"FNAQPA"]
[null,"UNA"]
[null,"UNCCAS"]
[null,"FHF"]
[null,"FEHAP"]
[null,"SYNERPA"]
[null,"APF.ASSO"]
[null,"APAJH.ASSO"]
[null,"GEPSO"]
[null,"ANDICAT"]
[null,"FNMF"]
[null,"FPEP"]
[null,"UGECAM"]

{"sheet":"Onglet_Contrôle","index":5,"n_rows":89,"n_cols":11,"rows_kept":89,"merged":[[0,0,0,8],[2,0,2,4],[2,7,2,8],[10,0,11,0],[11,7,12,7],[13,7,14,7],[15,7,16,7],[17,7,18,7],[19,7,20,7],[21,7,22,7],[23,7,24,7],[26,7,27,7],[28,7,29,7],[30,7,31,7],[32,7,33,7],[34,7,35,7],[36,7,37,7],[38,7,39,7],[41,7,42,7],[43,7,44,7],[45,7,46,7],[47,7,48,7],[49,7,50,7],[51,7,52,7],[53,7,54,7],[56,7,57,7],[58,7,59,7],[60,7,61,7],[62,7,63,7],[64,7,65,7],[66,7,67,7],[68,7,69,7],[71,7,72,7],[73,7,74,7],[75,7,76,7],[77,7,78,7],[79,7,80,7],[81,7,82,7],[83,7,84,7]]}
["Cet onglet a été ajouté à titre expérimental. Il n'est pas protégé. Toutefois, toute modification des formules ou de la structure du tableau ci-dessous peut entraver son bon fonctionnement."]
[]
["FICHE D'AUTO-CONTRÔLE A TITRE D'INFORMATION",{"$nulls":6},"Informations complémentaires :"]
[]
["Contrôle ","Onglet","Valeur ","Ok/Ko","Observations"]
["Version  ","Tous",{"$f":"'Page de garde'!$A$1","v":"#EPRDHA-2026-01#"},{"$f":"IF(CREPASIDEN___ANNEEREF___ANN0\\_________=\"\",\"Non saisi\",IF(AND(C6=\"#EPRDHA-2026-01#\",CREPASIDEN___ANNEEREF___ANN0\\_________=2026)=TRUE,\"Ok\",\"A priori, vous utilisez une version qui n'est plus en vigueur, veuillez vous référer à l'adresse de téléchargement des cadres rappelée ci-contre.\"))","v":"Non saisi"},"Le fichier utilisé doit être celui en vigueur à la date de la campagne de dépôt des EPRD. Il est mis à disposition sur le site de la DGCS : https://solidarites-sante.gouv.fr/affaires-sociales/personnes-agees/droits-et-aides/etablissements-et-services-sociaux-et-medico-sociaux/article/reforme-de-la-tarification. "]
["Nom du fichier ","Tous","Au choix ou selon règle de nommage indiquée par l'autorité de tarification",null,"Veillez à choisir un nom explicite pour vous et vos autorités de tarification. \nExemple : ID_FINESSEJ_Type_AAAAMMJJ_V1\nAvec ID : identifiant du dossier sur la plateforme de collecte\nFINESSEJ : numéro finess de l’entité juridique\nType :  type de document (ex : eprd_complet) ou n° de l'annexe (ex : A1)\nAAAAMMJJ : date du fichier \nVx : numéro de version",{"$nulls":4},4,4]
["Intitulés des onglets","Tous","Saisie prédéfinie",null,"Les intitulés des onglets du fichier sont ceux du cadre vierge téléchargeable sur le site de la DGCS et ne doivent pas être modifiés. Toute modification peut empêcher le traitement des données. ",null,null,"Détail par compte de résultat (CR) : ",null,null,{"$f":"$J$7-2","v":{"v":2,"d":"2.00"}}]
["Statut juridique  ","Page de garde",{"$f":"'Page de garde'!$D$10","v":0},{"$f":"IF(OR(C9=Liste!$A$3,C9=Liste!$A$4,C9=Liste!$A$5,C9=Liste!$A$6),\"Ok\",IF(C9=0,\"Non saisi\",\"Incohérence\"))","v":"Non saisi"},"La valeur de ce champ doit être \"Etablissement Public\", \"Etat & Col.Territ.\", \"Org. Privé Commer.\" ou \"Org.Privé non Lucr.\". ",null,null,"N° FINESS ET",null,null,{"$f":"IF(VLOOKUP(\"Conso\",Conso!$C$1:$IV$1,K8,FALSE)=\"\",\"\",VLOOKUP(\"Conso\",Conso!$C$1:$IV$1,K8,FALSE))","v":""}]
["Date d'effet du CPOM","Page de garde",{"$f":"'Page de garde'!$D$22","v":"00:00:00"},{"$f":"IF(C10=0/1/1900,\"Non saisi\", \"Ok\")","v":"Non saisi"},"Si un CPOM a été conclu à la date d'établissement de l'EPRD, alors ce champ doit être non vide. ",null,null,{"$f":"IF(CREPASIDEN___ANNEEREF___ANN0\\_________=\"\",\"Capacité installée N\",\"Capacité installée \"&CREPASIDEN___ANNEEREF___ANN0\\_________)","v":"Capacité installée N"},null,null,{"$f":"IFERROR(IF(LEFT(K9,2)<>\"SF\",VLOOKUP(K9,'Page de garde'!E27:I33,5,FALSE),VLOOKUP(K9,Id_CR_SF!B7:H11,6,FALSE)),\"\")","v":""}]
["Capacité installée","Page de garde et Id_CR_SF",{"$f":"MIN(K10:IV10)","v":0},{"$f":"IF(C11=0,\"Au moins une des capacités est non saisie\",\"Ok\")","v":"Au moins une des capacités est non saisie"},"Les champs relatifs aux capacités installées (colonnes I de la page de garde et H de l'onglet \"Id_CR_SF\" doivent être non vides.  ",null,null,{"$f":"IF(CREPASIDEN___ANNEEREF___ANN0\\_________=\"\",\"Total produits réalisés N-1\",\"Total produits réalisés \"&CREPASIDEN___ANNEEREF___ANN0\\_________-1)","v":"Total produits réalisés N-1"},"Montant",null,{"$f":"VLOOKUP(\"Total des produits (1)\",Conso!$161:$180,$J$7,FALSE)","v":{"v":0,"d":"0.00 €"}}]
[null,"Page de garde  et Id_CR_SF",{"$f":"MAX(K10:IV10)","v":0},{"$f":"IF(C12>=1000,\"Au moins une des capacités est égale ou supérieure à 1000 (atypie)\",\"Ok\")","v":"Ok"},"SI valeur supérieure ou égale à 1000, vérification de la saisie recommandée",null,null,{"$f":"IF(CREPASIDEN___ANNEEREF___ANN0\\_________=\"\",\"Total produits prévus N\",\"Total produits prévus \"&CREPASIDEN___ANNEEREF___ANN0\\_________)","v":"Total produits prévus N"},"Montant",null,{"$f":"VLOOKUP(\"Total des produits (1)\",Conso!$299:$320,$J$7,FALSE)","v":{"v":0,"d":"0.00 €"}}]
["Amplitude d'ouverture sur l'année (en jours)","Page de garde",{"$f":"HLOOKUP(A13,'Page de garde'!$J$27:$J$33,2,FALSE)","v":0},{"$f":"IF(C13=0,\"Non saisi\",IF(C13>366,\"Atypie\",\"Ok\"))","v":"Non saisi"},"Ce champ doit être non vide. Si valeur supérieure à 366 (atypie), vérification de la saisie recommandée. \nCe contrôle porte uniquement sur le compte de résultat principal (1ère ligne du tableau de page de garde). ",{"$nulls":3},"% évolution / N-1",null,{"$f":"IFERROR((K12-K11)/K11,\"\")","v":""}]
["Convention collective majoritaire de travail","Page de garde",{"$f":"CREPASIDEN___CCNT_______ANN0\\_________","v":0},{"$f":"IF(OR(C14=Liste!$F$3,C14=Liste!$F$4,C14=Liste!$F$5,C14=Liste!$F$6,C14=Liste!$F$7,C14=Liste!$F$8,C14=Liste!$F$9,C14=Liste!$F$10,C14=Liste!$F$11,C14=Liste!$F$12,C14=Liste!$F$13,C14=Liste!$F$14,C14=Liste!$F$15,C14=Liste!$F$16,C14=Liste!$F$17),\"Ok\",IF(C14=0,\"Non saisi\",\"Incohérence\"))","v":"Non saisi"},"La valeur de ce champ doit être un des items de la liste déroulante proposée en page de garde. ",null,null,{"$f":"IF(CREPASIDEN___ANNEEREF___ANN0\\_________=\"\",\"Total produits prévus N+1\",\"Total produits prévus \"&CREPASIDEN___ANNEEREF___ANN0\\_________+1)","v":"Total produits prévus N+1"},"Montant",null,{"$f":"VLOOKUP(\"Total des produits (1)\",Conso!$436:$457,$J$7,FALSE)","v":{"v":0,"d":"0.00 €"}}]
["Amplitude d'ouverture sur l'année (en jours)","Id_CR_SF",{"$f":"HLOOKUP(A15,Id_CR_SF!$H$7:$H$10,2,FALSE)","v":0},{"$f":"IF(HLOOKUP(\"Identifiant (*)\",Id_CR_SF!$B$7:$HB$10,2,FALSE)=\"\",\"Non applicable\",IF(C15=0,\"Non saisi\",IF(C15>366,\"Atypie\",\"Ok\")))","v":"Non applicable"},"Ce champ doit être non vide. Si valeur supérieure à 366 (atypie), vérification de la saisie recommandée. \nCe contrôle porte uniquement sur le 1er compte de résultat du tableau de l'onglet \"Id_CR_SF\". ",{"$nulls":3},"% évolution / N",null,{"$f":"IFERROR((K14-K12)/K12,\"\")","v":""}]
["Total produits de N-1 à N+6 (comptes de résultat consolidés)","PGFP",{"$f":"IF(OR(PGFP!D11<=0,PGFP!E11<=0,PGFP!F11<=0,PGFP!G11<=0,PGFP!H11<=0,PGFP!I11<=0,PGFP!J11<=0,PGFP!K11<=0)=TRUE,\"Au moins un des montants de total produits est nul ou négatif\",\"Ok\")","v":"Au moins un des montants de total produits est nul ou négatif"},{"$f":"IF(C16=\"Au moins un des montants de total produits est nul ou négatif\",\"Atypie\",\"Ok\")","v":"Atypie"},"Le total des produits ne peut être vide, quelle que soit l'année considérée. Si valeur négative (atypie), vérification de la saisie recommandée. ",null,null,{"$f":"IF(CREPASIDEN___ANNEEREF___ANN0\\_________=\"\",\"Total produits prévus N+2\",\"Total produits prévus \"&CREPASIDEN___ANNEEREF___ANN0\\_________+2)","v":"Total produits prévus N+2"},"Montant",null,{"$f":"VLOOKUP(\"Total des produits (1)\",Conso!$573:$594,$J$7,FALSE)","v":{"v":0,"d":"0.00 €"}}]
["Total charges de N-1 à N+6 (comptes de résultat consolidés)","PGFP",{"$f":"IF(OR(PGFP!D21<=0,PGFP!E21<=0,PGFP!F21<=0,PGFP!G21<=0,PGFP!H21<=0,PGFP!I21<=0,PGFP!J21<=0,PGFP!K21<=0)=TRUE,\"Au moins un des montants de total charges est nul ou négatif\",\"Ok\")","v":"Au moins un des montants de total charges est nul ou négatif"},{"$f":"IF(C17=\"Au moins un des montants de total charges est nul ou négatif\",\"Atypie\",\"Ok\")","v":"Atypie"},"Le total des charges ne peut être vide, quelle que soit l'année considérée. Si valeur négative (atypie), vérification de la saisie recommandée. ",{"$nulls":3},"% évolution / N+1",null,{"$f":"IFERROR((K16-K14)/K14,\"\")","v":""}]
["Produits de la tarification (GI) de N-1 à N+6 (comptes de résultat consolidés)","PGFP",{"$f":"IF(OR(PGFP!D6<=0,PGFP!E6<=0,PGFP!F6<=0,PGFP!G6<=0,PGFP!H6<=0,PGFP!I6<=0,PGFP!J6<=0,PGFP!K6<=0)=TRUE,\"Au moins un des montants de total produits est nul ou négatif\",\"Ok\")","v":"Au moins un des montants de total produits est nul ou négatif"},{"$f":"IF(C18=\"Au moins un des montants de total produits est nul ou négatif\",\"Atypie\",\"Ok\")","v":"Atypie"},"Le total des produits de la tarification ne peut être vide, quelle que soit l'année considérée. Si valeur négative (atypie), vérification de la saisie recommandée. ",null,null,{"$f":"IF(CREPASIDEN___ANNEEREF___ANN0\\_________=\"\",\"Total produits prévus N+3\",\"Total produits prévus \"&CREPASIDEN___ANNEEREF___ANN0\\_________+3)","v":"Total produits prévus N+3"},"Montant",null,{"$f":"VLOOKUP(\"Total des produits (1)\",Conso!$709:$730,$J$7,FALSE)","v":{"v":0,"d":"0.00 €"}}]
["Charges de personnel (GII) de N-1 à N+6 (comptes de résultat consolidés)","PGFP",{"$f":"IF(OR(PGFP!D16<=0,PGFP!E16<=0,PGFP!F16<=0,PGFP!G16<=0,PGFP!H16<=0,PGFP!I16<=0,PGFP!J16<=0,PGFP!K16<=0)=TRUE,\"Au moins un des montants de total charges est nul ou négatif\",\"Ok\")","v":"Au moins un des montants de total charges est nul ou négatif"},{"$f":"IF(C19=\"Au moins un des montants de total charges est nul ou négatif\",\"Atypie\",\"Ok\")","v":"Atypie"},"Le total des charges de personnel ne peut être vide, quelle que soit l'année considérée. Si valeur négative (atypie), vérification de la saisie recommandée. ",{"$nulls":3},"% évolution / N+2",null,{"$f":"IFERROR((K18-K16)/K16,\"\")","v":""}]
["Total des produits : écart N/N-1 en % (par compte de résultat)","CRPP/A et CRPA_SF",{"$f":"IF(ABS(MIN(K13:IV13))=ABS(MAX(K13:IV13)),MAX(K13:IV13),IF(ABS(MIN(K13:IV13))>ABS(MAX(K13:IV13)),MIN(K13:IV13),MAX(K13:IV13)))","v":{"v":0,"d":"0.00%"}},{"$f":"IF(OR(C20<-0.1,C20>0.1)=TRUE,\"Au moins un des CR présente un écart de plus de 10% entre N-1 et N\",\"Ok\")","v":"Ok"},"En cas d'écart significatif (ici : +/-10%), vérification de la saisie recommandée. ",null,null,{"$f":"IF(CREPASIDEN___ANNEEREF___ANN0\\_________=\"\",\"Total produits prévus N+4\",\"Total produits prévus \"&CREPASIDEN___ANNEEREF___ANN0\\_________+4)","v":"Total produits prévus N+4"},"Montant",null,{"$f":"VLOOKUP(\"Total des produits (1)\",Conso!$845:$866,$J$7,FALSE)","v":{"v":0,"d":"0.00 €"}}]
["Total des produits : écart N+1/N en % (par compte de résultat)","CRPP/A et CRPA_SF",{"$f":"IF(ABS(MIN(K15:IV15))=ABS(MAX(K15:IV15)),MAX(K15:IV15),IF(ABS(MIN(K15:IV15))>ABS(MAX(K15:IV15)),MIN(K15:IV15),MAX(K15:IV15)))","v":{"v":0,"d":"0.00%"}},{"$f":"IF(OR(C21<-0.1,C21>0.1)=TRUE,\"Au moins un des CR présente un écart de plus de 10% entre N et N+1\",\"Ok\")","v":"Ok"},"En cas d'écart significatif (ici : +/-10%), vérification de la saisie recommandée. ",{"$nulls":3},"% évolution / N+3",null,{"$f":"IFERROR((K20-K18)/K18,\"\")","v":""}]
["Total des produits : écart N+2/N+1 en % (par compte de résultat)","CRPP/A et CRPA_SF",{"$f":"IF(ABS(MIN(K17:IV17))=ABS(MAX(K17:IV17)),MAX(K17:IV17),IF(ABS(MIN(K17:IV17))>ABS(MAX(K17:IV17)),MIN(K17:IV17),MAX(K17:IV17)))","v":{"v":0,"d":"0.00%"}},{"$f":"IF(OR(C22<-0.1,C22>0.1)=TRUE,\"Au moins un des CR présente un écart de plus de 10% entre N+1 et N+2\",\"Ok\")","v":"Ok"},"En cas d'écart significatif (ici : +/-10%), vérification de la saisie recommandée. ",null,null,{"$f":"IF(CREPASIDEN___ANNEEREF___ANN0\\_________=\"\",\"Total produits prévus N+5\",\"Total produits prévus \"&CREPASIDEN___ANNEEREF___ANN0\\_________+5)","v":"Total produits prévus N+5"},"Montant",null,{"$f":"VLOOKUP(\"Total des produits (1)\",Conso!$981:$1002,$J$7,FALSE)","v":{"v":0,"d":"0.00 €"}}]
["Total des produits : écart N+3/N+2 en % (par compte de résultat)","CRPP/A et CRPA_SF",{"$f":"IF(ABS(MIN(K19:IV19))=ABS(MAX(K19:IV19)),MAX(K19:IV19),IF(ABS(MIN(K19:IV19))>ABS(MAX(K19:IV19)),MIN(K19:IV19),MAX(K19:IV19)))","v":{"v":0,"d":"0.00%"}},{"$f":"IF(OR(C23<-0.1,C23>0.1)=TRUE,\"Au moins un des CR présente un écart de plus de 10% entre N+2 et N+3\",\"Ok\")","v":"Ok"},"En cas d'écart significatif (ici : +/-10%), vérification de la saisie recommandée. ",{"$nulls":3},"% évolution / N+4",null,{"$f":"IFERROR((K22-K20)/K20,\"\")","v":""}]
["Total des produits : écart N+4/N+3 en % (par compte de résultat)","CRPP/A et CRPA_SF",{"$f":"IF(ABS(MIN(K21:IV21))=ABS(MAX(K21:IV21)),MAX(K21:IV21),IF(ABS(MIN(K21:IV21))>ABS(MAX(K21:IV21)),MIN(K21:IV21),MAX(K21:IV21)))","v":{"v":0,"d":"0.00%"}},{"$f":"IF(OR(C24<-0.1,C24>0.1)=TRUE,\"Au moins un des CR présente un écart de plus de 10% entre N+3 et N+4\",\"Ok\")","v":"Ok"},"En cas d'écart significatif (ici : +/-10%), vérification de la saisie recommandée. ",null,null,{"$f":"IF(CREPASIDEN___ANNEEREF___ANN0\\_________=\"\",\"Total produits prévus N+6\",\"Total produits prévus \"&CREPASIDEN___ANNEEREF___ANN0\\_________+6)","v":"Total produits prévus N+6"},"Montant",null,{"$f":"VLOOKUP(\"Total des produits (1)\",Conso!$1117:$1138,$J$7,FALSE)","v":{"v":0,"d":"0.00 €"}}]
["Total des produits : écart N+5/N+4 en % (par compte de résultat)","CRPP/A et CRPA_SF",{"$f":"IF(ABS(MIN(K23:IV23))=ABS(MAX(K23:IV23)),MAX(K23:IV23),IF(ABS(MIN(K23:IV23))>ABS(MAX(K23:IV23)),MIN(K23:IV23),MAX(K23:IV23)))","v":{"v":0,"d":"0.00%"}},{"$f":"IF(OR(C25<-0.1,C25>0.1)=TRUE,\"Au moins un des CR présente un écart de plus de 10% entre N+4 et N+5\",\"Ok\")","v":"Ok"},"En cas d'écart significatif (ici : +/-10%), vérification de la saisie recommandée. ",{"$nulls":3},"% évolution / N+5",null,{"$f":"IFERROR((K24-K22)/K22,\"\")","v":""}]
["Total des produits : écart N+6/N+5 en % (par compte de résultat)","CRPP/A et CRPA_SF",{"$f":"IF(ABS(MIN(K25:IV25))=ABS(MAX(K25:IV25)),MAX(K25:IV25),IF(ABS(MIN(K25:IV25))>ABS(MAX(K25:IV25)),MIN(K25:IV25),MAX(K25:IV25)))","v":{"v":0,"d":"0.00%"}},{"$f":"IF(OR(C26<-0.1,C26>0.1)=TRUE,\"Au moins un des CR présente un écart de plus de 10% entre N+5 et N+6\",\"Ok\")","v":"Ok"},"En cas d'écart significatif (ici : +/-10%), vérification de la saisie recommandée. ",null,null,{"$f":"IF(CREPASIDEN___ANNEEREF___ANN0\\_________=\"\",\"Total charges réalisées N-1\",\"Total charges réalisées \"&CREPASIDEN___ANNEEREF___ANN0\\_________-1)","v":"Total charges réalisées N-1"},"Montant",null,{"$f":"VLOOKUP(\"Total des charges (2)\",Conso!$161:$180,$J$7,FALSE)","v":{"v":0,"d":"0.00 €"}}]
["Total des charges : écart N/N-1 en % (par compte de résultat)","CRPP/A et CRPA_SF",{"$f":"IF(ABS(MIN(K28:IV28))=ABS(MAX(K28:IV28)),MAX(K28:IV28),IF(ABS(MIN(K28:IV28))>ABS(MAX(K28:IV28)),MIN(K28:IV28),MAX(K28:IV28)))","v":{"v":0,"d":"0.00%"}},{"$f":"IF(OR(C27<-0.1,C27>0.1)=TRUE,\"Au moins un des CR présente un écart de plus de 10% entre N-1 et N\",\"Ok\")","v":"Ok"},"En cas d'écart significatif (ici : +/-10%), vérification de la saisie recommandée. ",null,null,{"$f":"IF(CREPASIDEN___ANNEEREF___ANN0\\_________=\"\",\"Total charges prévues N\",\"Total charges prévues \"&CREPASIDEN___ANNEEREF___ANN0\\_________)","v":"Total charges prévues N"},"Montant",null,{"$f":"VLOOKUP(\"Total des charges (2)\",Conso!$299:$320,$J$7,FALSE)","v":{"v":0,"d":"0.00 €"}}]
["Total des charges : écart N+1/N en % (par compte de résultat)","CRPP/A et CRPA_SF",{"$f":"IF(ABS(MIN(K30:IV30))=ABS(MAX(K30:IV30)),MAX(K30:IV30),IF(ABS(MIN(K30:IV30))>ABS(MAX(K30:IV30)),MIN(K30:IV30),MAX(K30:IV30)))","v":{"v":0,"d":"0.00%"}},{"$f":"IF(OR(C28<-0.1,C28>0.1)=TRUE,\"Au moins un des CR présente un écart de plus de 10% entre N et N+1\",\"Ok\")","v":"Ok"},"En cas d'écart significatif (ici : +/-10%), vérification de la saisie recommandée. ",{"$nulls":3},"% évolution / N-1",null,{"$f":"IFERROR((K27-K26)/K26,\"\")","v":""}]
["Total des charges : écart N+2/N+1 en % (par compte de résultat)","CRPP/A et CRPA_SF",{"$f":"IF(ABS(MIN(K32:IV32))=ABS(MAX(K32:IV32)),MAX(K32:IV32),IF(ABS(MIN(K32:IV32))>ABS(MAX(K32:IV32)),MIN(K32:IV32),MAX(K32:IV32)))","v":{"v":0,"d":"0.00%"}},{"$f":"IF(OR(C29<-0.1,C29>0.1)=TRUE,\"Au moins un des CR présente un écart de plus de 10% entre N+1 et N+2\",\"Ok\")","v":"Ok"},"En cas d'écart significatif (ici : +/-10%), vérification de la saisie recommandée. ",null,null,{"$f":"IF(CREPASIDEN___ANNEEREF___ANN0\\_________=\"\",\"Total charges prévues N+1\",\"Total charges prévues \"&CREPASIDEN___ANNEEREF___ANN0\\_________+1)","v":"Total charges prévues N+1"},"Montant",null,{"$f":"VLOOKUP(\"Total des charges (2)\",Conso!$436:$457,$J$7,FALSE)","v":{"v":0,"d":"0.00 €"}}]
["Total des charges : écart N+3/N+2 en % (par compte de résultat)","CRPP/A et CRPA_SF",{"$f":"IF(ABS(MIN(K34:IV34))=ABS(MAX(K34:IV34)),MAX(K34:IV34),IF(ABS(MIN(K34:IV34))>ABS(MAX(K34:IV34)),MIN(K34:IV34),MAX(K34:IV34)))","v":{"v":0,"d":"0.00%"}},{"$f":"IF(OR(C30<-0.1,C30>0.1)=TRUE,\"Au moins un des CR présente un écart de plus de 10% entre N+2 et N+3\",\"Ok\")","v":"Ok"},"En cas d'écart significatif (ici : +/-10%), vérification de la saisie recommandée. ",{"$nulls":3},"% évolution / N",null,{"$f":"IFERROR((K29-K27)/K27,\"\")","v":""}]
["Total des charges : écart N+4/N+3 en % (par compte de résultat)","CRPP/A et CRPA_SF",{"$f":"IF(ABS(MIN(K36:IV36))=ABS(MAX(K36:IV36)),MAX(K36:IV36),IF(ABS(MIN(K36:IV36))>ABS(MAX(K36:IV36)),MIN(K36:IV36),MAX(K36:IV36)))","v":{"v":0,"d":"0.00%"}},{"$f":"IF(OR(C31<-0.1,C31>0.1)=TRUE,\"Au moins un des CR présente un écart de plus de 10% entre N+3 et N+4\",\"Ok\")","v":"Ok"},"En cas d'écart significatif (ici : +/-10%), vérification de la saisie recommandée. ",null,null,{"$f":"IF(CREPASIDEN___ANNEEREF___ANN0\\_________=\"\",\"Total charges prévues N+2\",\"Total charges prévues \"&CREPASIDEN___ANNEEREF___ANN0\\_________+2)","v":"Total charges prévues N+2"},"Montant",null,{"$f":"VLOOKUP(\"Total des charges (2)\",Conso!$573:$594,$J$7,FALSE)","v":{"v":0,"d":"0.00 €"}}]
["Total des charges : écart N+5/N+4 en % (par compte de résultat)","CRPP/A et CRPA_SF",{"$f":"IF(ABS(MIN(K38:IV38))=ABS(MAX(K38:IV38)),MAX(K38:IV38),IF(ABS(MIN(K38:IV38))>ABS(MAX(K38:IV38)),MIN(K38:IV38),MAX(K38:IV38)))","v":{"v":0,"d":"0.00%"}},{"$f":"IF(OR(C32<-0.1,C32>0.1)=TRUE,\"Au moins un des CR présente un écart de plus de 10% entre N+4 et N+5\",\"Ok\")","v":"Ok"},"En cas d'écart significatif (ici : +/-10%), vérification de la saisie recommandée. ",{"$nulls":3},"% évolution / N+1",null,{"$f":"IFERROR((K31-K29)/K29,\"\")","v":""}]
["Total des charges : écart N+6/N+5 en % (par compte de résultat)","CRPP/A et CRPA_SF",{"$f":"IF(ABS(MIN(K40:IV40))=ABS(MAX(K40:IV40)),MAX(K40:IV40),IF(ABS(MIN(K40:IV40))>ABS(MAX(K40:IV40)),MIN(K40:IV40),MAX(K40:IV40)))","v":{"v":0,"d":"0.00%"}},{"$f":"IF(OR(C33<-0.1,C33>0.1)=TRUE,\"Au moins un des CR présente un écart de plus de 10% entre N+5 et N+6\",\"Ok\")","v":"Ok"},"En cas d'écart significatif (ici : +/-10%), vérification de la saisie recommandée. ",null,null,{"$f":"IF(CREPASIDEN___ANNEEREF___ANN0\\_________=\"\",\"Total charges prévues N+3\",\"Total Charges prévues \"&CREPASIDEN___ANNEEREF___ANN0\\_________+3)","v":"Total charges prévues N+3"},"Montant",null,{"$f":"VLOOKUP(\"Total des charges (2)\",Conso!$709:$730,$J$7,FALSE)","v":{"v":0,"d":"0.00 €"}}]
["Produits de la tarification (GI) : écart N/N-1 en % (par compte de résultat)","CRPP/A et CRPA_SF",{"$f":"IF(ABS(MIN(K43:IV43))=ABS(MAX(K43:IV43)),MAX(K43:IV43),IF(ABS(MIN(K43:IV43))>ABS(MAX(K43:IV43)),MIN(K43:IV43),MAX(K43:IV43)))","v":{"v":0,"d":"0.00%"}},{"$f":"IF(OR(C34<-0.1,C34>0.1)=TRUE,\"Au moins un des CR présente un écart de plus de 10% entre N-1 et N\",\"Ok\")","v":"Ok"},"En cas d'écart significatif (ici : +/-10%), vérification de la saisie recommandée. ",{"$nulls":3},"% évolution / N+2",null,{"$f":"IFERROR((K33-K31)/K31,\"\")","v":""}]
["Produits de la tarification (GI) : écart N+1/N en % (par compte de résultat)","CRPP/A et CRPA_SF",{"$f":"IF(ABS(MIN(K45:IV45))=ABS(MAX(K45:IV45)),MAX(K45:IV45),IF(ABS(MIN(K45:IV45))>ABS(MAX(K45:IV45)),MIN(K45:IV45),MAX(K45:IV45)))","v":{"v":0,"d":"0.00%"}},{"$f":"IF(OR(C35<-0.1,C35>0.1)=TRUE,\"Au moins un des CR présente un écart de plus de 10% entre N et N+1\",\"Ok\")","v":"Ok"},"En cas d'écart significatif (ici : +/-10%), vérification de la saisie recommandée. ",null,null,{"$f":"IF(CREPASIDEN___ANNEEREF___ANN0\\_________=\"\",\"Total charges prévues N+4\",\"Total charges prévues \"&CREPASIDEN___ANNEEREF___ANN0\\_________+4)","v":"Total charges prévues N+4"},"Montant",null,{"$f":"VLOOKUP(\"Total des charges (2)\",Conso!$845:$866,$J$7,FALSE)","v":{"v":0,"d":"0.00 €"}}]
["Produits de la tarification (GI) : écart N+2/N+1 en % (par compte de résultat)","CRPP/A et CRPA_SF",{"$f":"IF(ABS(MIN(K47:IV47))=ABS(MAX(K47:IV47)),MAX(K47:IV47),IF(ABS(MIN(K47:IV47))>ABS(MAX(K47:IV47)),MIN(K47:IV47),MAX(K47:IV47)))","v":{"v":0,"d":"0.00%"}},{"$f":"IF(OR(C36<-0.1,C36>0.1)=TRUE,\"Au moins un des CR présente un écart de plus de 10% entre N+1 et N+2\",\"Ok\")","v":"Ok"},"En cas d'écart significatif (ici : +/-10%), vérification de la saisie recommandée. ",{"$nulls":3},"% évolution / N+3",null,{"$f":"IFERROR((K35-K33)/K33,\"\")","v":""}]
["Produits de la tarification (GI) : écart N+3/N+2 en % (par compte de résultat)","CRPP/A et CRPA_SF",{"$f":"IF(ABS(MIN(K49:IV49))=ABS(MAX(K49:IV49)),MAX(K49:IV49),IF(ABS(MIN(K49:IV49))>ABS(MAX(K49:IV49)),MIN(K49:IV49),MAX(K49:IV49)))","v":{"v":0,"d":"0.00%"}},{"$f":"IF(OR(C37<-0.1,C37>0.1)=TRUE,\"Au moins un des CR présente un écart de plus de 10% entre N+2 et N+3\",\"Ok\")","v":"Ok"},"En cas d'écart significatif (ici : +/-10%), vérification de la saisie recommandée. ",null,null,{"$f":"IF(CREPASIDEN___ANNEEREF___ANN0\\_________=\"\",\"Total charges prévues N+5\",\"Total charges prévues \"&CREPASIDEN___ANNEEREF___ANN0\\_________+5)","v":"Total charges prévues N+5"},"Montant",null,{"$f":"VLOOKUP(\"Total des charges (2)\",Conso!$981:$1002,$J$7,FALSE)","v":{"v":0,"d":"0.00 €"}}]
["Produits de la tarification (GI) : écart N+4/N+3 en % (par compte de résultat)","CRPP/A et CRPA_SF",{"$f":"IF(ABS(MIN(K51:IV51))=ABS(MAX(K51:IV51)),MAX(K51:IV51),IF(ABS(MIN(K51:IV51))>ABS(MAX(K51:IV51)),MIN(K51:IV51),MAX(K51:IV51)))","v":{"v":0,"d":"0.00%"}},{"$f":"IF(OR(C38<-0.1,C38>0.1)=TRUE,\"Au moins un des CR présente un écart de plus de 10% entre N+3 et N+4\",\"Ok\")","v":"Ok"},"En cas d'écart significatif (ici : +/-10%), vérification de la saisie recommandée. ",{"$nulls":3},"% évolution / N+4",null,{"$f":"IFERROR((K37-K35)/K35,\"\")","v":""}]
["Produits de la tarification (GI) : écart N+5/N+4 en % (par compte de résultat)","CRPP/A et CRPA_SF",{"$f":"IF(ABS(MIN(K53:IV53))=ABS(MAX(K53:IV53)),MAX(K53:IV53),IF(ABS(MIN(K53:IV53))>ABS(MAX(K53:IV53)),MIN(K53:IV53),MAX(K53:IV53)))","v":{"v":0,"d":"0.00%"}},{"$f":"IF(OR(C39<-0.1,C39>0.1)=TRUE,\"Au moins un des CR présente un écart de plus de 10% entre N+4 et N+5\",\"Ok\")","v":"Ok"},"En cas d'écart significatif (ici : +/-10%), vérification de la saisie recommandée. ",null,null,{"$f":"IF(CREPASIDEN___ANNEEREF___ANN0\\_________=\"\",\"Total charges prévues N+6\",\"Total charges prévues \"&CREPASIDEN___ANNEEREF___ANN0\\_________+6)","v":"Total charges prévues N+6"},"Montant",null,{"$f":"VLOOKUP(\"Total des charges (2)\",Conso!$1117:$1138,$J$7,FALSE)","v":{"v":0,"d":"0.00 €"}}]
["Produits de la tarification (GI) : écart N+6/N+5 en % (par compte de résultat)","CRPP/A et CRPA_SF",{"$f":"IF(ABS(MIN(K55:IV55))=ABS(MAX(K55:IV55)),MAX(K55:IV55),IF(ABS(MIN(K55:IV55))>ABS(MAX(K55:IV55)),MIN(K55:IV55),MAX(K55:IV55)))","v":{"v":0,"d":"0.00%"}},{"$f":"IF(OR(C40<-0.1,C40>0.1)=TRUE,\"Au moins un des CR présente un écart de plus de 10% entre N+5 et N+6\",\"Ok\")","v":"Ok"},"En cas d'écart significatif (ici : +/-10%), vérification de la saisie recommandée. ",{"$nulls":3},"% évolution / N+5",null,{"$f":"IFERROR((K39-K37)/K37,\"\")","v":""}]
["Charges afférentes au personnel (GII) : écart N/N-1 en % (par compte de résultat)","CRPP/A et CRPA_SF",{"$f":"IF(ABS(MIN(K58:IV58))=ABS(MAX(K58:IV58)),MAX(K58:IV58),IF(ABS(MIN(K58:IV58))>ABS(MAX(K58:IV58)),MIN(K58:IV58),MAX(K58:IV58)))","v":{"v":0,"d":"0.00%"}},{"$f":"IF(OR(C41<-0.1,C41>0.1)=TRUE,\"Au moins un des CR présente un écart de plus de 10% entre N-1 et N\",\"Ok\")","v":"Ok"},"En cas d'écart significatif (ici : +/-10%), vérification de la saisie recommandée. ",null,null,{"$f":"IF(CREPASIDEN___ANNEEREF___ANN0\\_________=\"\",\"Produits de la tarification (GI) réalisés N-1\",\"Produits de la tarification (GI) réalisés \"&CREPASIDEN___ANNEEREF___ANN0\\_________-1)","v":"Produits de la tarification (GI) réalisés N-1"},"Montant",null,{"$f":"VLOOKUP(\"Groupe I : Produits de la tarification\",Conso!$161:$180,$J$7,FALSE)","v":{"v":0,"d":"0.00 €"}}]
["Charges afférentes au personnel (GII) : écart N+1/N en % (par compte de résultat)","CRPP/A et CRPA_SF",{"$f":"IF(ABS(MIN(K60:IV60))=ABS(MAX(K60:IV60)),MAX(K60:IV60),IF(ABS(MIN(K60:IV60))>ABS(MAX(K60:IV60)),MIN(K60:IV60),MAX(K60:IV60)))","v":{"v":0,"d":"0.00%"}},{"$f":"IF(OR(C42<-0.1,C42>0.1)=TRUE,\"Au moins un des CR présente un écart de plus de 10% entre N et N+1\",\"Ok\")","v":"Ok"},"En cas d'écart significatif (ici : +/-10%), vérification de la saisie recommandée. ",null,null,{"$f":"IF(CREPASIDEN___ANNEEREF___ANN0\\_________=\"\",\"Produits de la tarification (GI) prévus N\",\"Produits de la tarification (GI) prévus \"&CREPASIDEN___ANNEEREF___ANN0\\_________)","v":"Produits de la tarification (GI) prévus N"},"Montant",null,{"$f":"VLOOKUP(\"Groupe I : Produits de la tarification\",Conso!$299:$320,$J$7,FALSE)","v":{"v":0,"d":"0.00 €"}}]
["Charges afférentes au personnel (GII) : écart N+2/N+1 en % (par compte de résultat)","CRPP/A et CRPA_SF",{"$f":"IF(ABS(MIN(K62:IV62))=ABS(MAX(K62:IV62)),MAX(K62:IV62),IF(ABS(MIN(K62:IV62))>ABS(MAX(K62:IV62)),MIN(K62:IV62),MAX(K62:IV62)))","v":{"v":0,"d":"0.00%"}},{"$f":"IF(OR(C43<-0.1,C43>0.1)=TRUE,\"Au moins un des CR présente un écart de plus de 10% entre N+1 et N+2\",\"Ok\")","v":"Ok"},"En cas d'écart significatif (ici : +/-10%), vérification de la saisie recommandée. ",{"$nulls":3},"% évolution / N-1",null,{"$f":"IFERROR((K42-K41)/K41,\"\")","v":""}]
["Charges afférentes au personnel (GII) : écart N+3/N+2 en % (par compte de résultat)","CRPP/A et CRPA_SF",{"$f":"IF(ABS(MIN(K64:IV64))=ABS(MAX(K64:IV64)),MAX(K64:IV64),IF(ABS(MIN(K64:IV64))>ABS(MAX(K64:IV64)),MIN(K64:IV64),MAX(K64:IV64)))","v":{"v":0,"d":"0.00%"}},{"$f":"IF(OR(C44<-0.1,C44>0.1)=TRUE,\"Au moins un des CR présente un écart de plus de 10% entre N+2 et N+3\",\"Ok\")","v":"Ok"},"En cas d'écart significatif (ici : +/-10%), vérification de la saisie recommandée. ",null,null,{"$f":"IF(CREPASIDEN___ANNEEREF___ANN0\\_________=\"\",\"Produits de la tarification (GI) prévus N+1\",\"Produits de la tarification (GI) prévus \"&CREPASIDEN___ANNEEREF___ANN0\\_________+1)","v":"Produits de la tarification (GI) prévus N+1"},"Montant",null,{"$f":"VLOOKUP(\"Groupe I : Produits de la tarification\",Conso!$436:$457,$J$7,FALSE)","v":{"v":0,"d":"0.00 €"}}]
["Charges afférentes au personnel (GII) : écart N+4/N+3 en % (par compte de résultat)","CRPP/A et CRPA_SF",{"$f":"IF(ABS(MIN(K66:IV66))=ABS(MAX(K66:IV66)),MAX(K66:IV66),IF(ABS(MIN(K66:IV66))>ABS(MAX(K66:IV66)),MIN(K66:IV66),MAX(K66:IV66)))","v":{"v":0,"d":"0.00%"}},{"$f":"IF(OR(C45<-0.1,C45>0.1)=TRUE,\"Au moins un des CR présente un écart de plus de 10% entre N+3 et N+4\",\"Ok\")","v":"Ok"},"En cas d'écart significatif (ici : +/-10%), vérification de la saisie recommandée. ",{"$nulls":3},"% évolution / N",null,{"$f":"IFERROR((K44-K42)/K42,\"\")","v":""}]
["Charges afférentes au personnel (GII) : écart N+5/N+4 en % (par compte de résultat)","CRPP/A et CRPA_SF",{"$f":"IF(ABS(MIN(K68:IV68))=ABS(MAX(K68:IV68)),MAX(K68:IV68),IF(ABS(MIN(K68:IV68))>ABS(MAX(K68:IV68)),MIN(K68:IV68),MAX(K68:IV68)))","v":{"v":0,"d":"0.00%"}},{"$f":"IF(OR(C46<-0.1,C46>0.1)=TRUE,\"Au moins un des CR présente un écart de plus de 10% entre N+4 et N+5\",\"Ok\")","v":"Ok"},"En cas d'écart significatif (ici : +/-10%), vérification de la saisie recommandée. ",null,null,{"$f":"IF(CREPASIDEN___ANNEEREF___ANN0\\_________=\"\",\"Produits de la tarification (GI) prévus N+2\",\"Produits de la tarification (GI) prévus \"&CREPASIDEN___ANNEEREF___ANN0\\_________+2)","v":"Produits de la tarification (GI) prévus N+2"},"Montant",null,{"$f":"VLOOKUP(\"Groupe I : Produits de la tarification\",Conso!$573:$594,$J$7,FALSE)","v":{"v":0,"d":"0.00 €"}}]
["Charges afférentes au personnel (GII) : écart N+6/N+5 en % (par compte de résultat)","CRPP/A et CRPA_SF",{"$f":"IF(ABS(MIN(K70:IV70))=ABS(MAX(K70:IV70)),MAX(K70:IV70),IF(ABS(MIN(K70:IV70))>ABS(MAX(K70:IV70)),MIN(K70:IV70),MAX(K70:IV70)))","v":{"v":0,"d":"0.00%"}},{"$f":"IF(OR(C47<-0.1,C47>0.1)=TRUE,\"Au moins un des CR présente un écart de plus de 10% entre N+5 et N+6\",\"Ok\")","v":"Ok"},"En cas d'écart significatif (ici : +/-10%), vérification de la saisie recommandée. ",{"$nulls":3},"% évolution / N+1",null,{"$f":"IFERROR((K46-K44)/K44,\"\")","v":""}]
["Charges afférentes à la structure (GIII) : écart N/N-1 en % (par compte de résultat)","CRPP/A et CRPA_SF",{"$f":"IF(ABS(MIN(K73:IV73))=ABS(MAX(K73:IV73)),MAX(K73:IV73),IF(ABS(MIN(K73:IV73))>ABS(MAX(K73:IV73)),MIN(K73:IV73),MAX(K73:IV73)))","v":{"v":0,"d":"0.00%"}},{"$f":"IF(OR(C48<-0.1,C48>0.1)=TRUE,\"Au moins un des CR présente un écart de plus de 10% entre N-1 et N\",\"Ok\")","v":"Ok"},"En cas d'écart significatif (ici : +/-10%), vérification de la saisie recommandée. ",null,null,{"$f":"IF(CREPASIDEN___ANNEEREF___ANN0\\_________=\"\",\"Produits de la tarification (GI) prévus N+3\",\"Produits de la tarification (GI) prévus \"&CREPASIDEN___ANNEEREF___ANN0\\_________+3)","v":"Produits de la tarification (GI) prévus N+3"},"Montant",null,{"$f":"VLOOKUP(\"Groupe I : Produits de la tarification\",Conso!$709:$730,$J$7,FALSE)","v":{"v":0,"d":"0.00 €"}}]
["Charges afférentes à la structure (GIII) : écart N+1/N en % (par compte de résultat)","CRPP/A et CRPA_SF",{"$f":"IF(ABS(MIN(K75:IV75))=ABS(MAX(K75:IV75)),MAX(K75:IV75),IF(ABS(MIN(K75:IV75))>ABS(MAX(K75:IV75)),MIN(K75:IV75),MAX(K75:IV75)))","v":{"v":0,"d":"0.00%"}},{"$f":"IF(OR(C49<-0.1,C49>0.1)=TRUE,\"Au moins un des CR présente un écart de plus de 10% entre N et N+1\",\"Ok\")","v":"Ok"},"En cas d'écart significatif (ici : +/-10%), vérification de la saisie recommandée. ",{"$nulls":3},"% évolution / N+2",null,{"$f":"IFERROR((K48-K46)/K46,\"\")","v":""}]
["Charges afférentes à la structure (GIII) : écart N+2/N+1 en % (par compte de résultat)","CRPP/A et CRPA_SF",{"$f":"IF(ABS(MIN(K77:IV77))=ABS(MAX(K77:IV77)),MAX(K77:IV77),IF(ABS(MIN(K77:IV77))>ABS(MAX(K77:IV77)),MIN(K77:IV77),MAX(K77:IV77)))","v":{"v":0,"d":"0.00%"}},{"$f":"IF(OR(C50<-0.1,C50>0.1)=TRUE,\"Au moins un des CR présente un écart de plus de 10% entre N+1 et N+2\",\"Ok\")","v":"Ok"},"En cas d'écart significatif (ici : +/-10%), vérification de la saisie recommandée. ",null,null,{"$f":"IF(CREPASIDEN___ANNEEREF___ANN0\\_________=\"\",\"Produits de la tarification (GI) prévus N+4\",\"Produits de la tarification (GI) prévus \"&CREPASIDEN___ANNEEREF___ANN0\\_________+4)","v":"Produits de la tarification (GI) prévus N+4"},"Montant",null,{"$f":"VLOOKUP(\"Groupe I : Produits de la tarification\",Conso!$845:$866,$J$7,FALSE)","v":{"v":0,"d":"0.00 €"}}]
["Charges afférentes à la structure (GIII) : écart N+3/N+2 en % (par compte de résultat)","CRPP/A et CRPA_SF",{"$f":"IF(ABS(MIN(K79:IV79))=ABS(MAX(K79:IV79)),MAX(K79:IV79),IF(ABS(MIN(K79:IV79))>ABS(MAX(K79:IV79)),MIN(K79:IV79),MAX(K79:IV79)))","v":{"v":0,"d":"0.00%"}},{"$f":"IF(OR(C51<-0.1,C51>0.1)=TRUE,\"Au moins un des CR présente un écart de plus de 10% entre N+2 et N+3\",\"Ok\")","v":"Ok"},"En cas d'écart significatif (ici : +/-10%), vérification de la saisie recommandée. ",{"$nulls":3},"% évolution / N+3",null,{"$f":"IFERROR((K50-K48)/K48,\"\")","v":""}]
["Charges afférentes à la structure (GIII) : écart N+4/N+3 en % (par compte de résultat)","CRPP/A et CRPA_SF",{"$f":"IF(ABS(MIN(K81:IV81))=ABS(MAX(K81:IV81)),MAX(K81:IV81),IF(ABS(MIN(K81:IV81))>ABS(MAX(K81:IV81)),MIN(K81:IV81),MAX(K81:IV81)))","v":{"v":0,"d":"0.00%"}},{"$f":"IF(OR(C52<-0.1,C52>0.1)=TRUE,\"Au moins un des CR présente un écart de plus de 10% entre N+3 et N+4\",\"Ok\")","v":"Ok"},"En cas d'écart significatif (ici : +/-10%), vérification de la saisie recommandée. ",null,null,{"$f":"IF(CREPASIDEN___ANNEEREF___ANN0\\_________=\"\",\"Produits de la tarification (GI) prévus N+5\",\"Produits de la tarification (GI) prévus \"&CREPASIDEN___ANNEEREF___ANN0\\_________+5)","v":"Produits de la tarification (GI) prévus N+5"},"Montant",null,{"$f":"VLOOKUP(\"Groupe I : Produits de la tarification\",Conso!$981:$1002,$J$7,FALSE)","v":{"v":0,"d":"0.00 €"}}]
["Charges afférentes à la structure (GIII) : écart N+5/N+4 en % (par compte de résultat)","CRPP/A et CRPA_SF",{"$f":"IF(ABS(MIN(K83:IV83))=ABS(MAX(K83:IV83)),MAX(K83:IV83),IF(ABS(MIN(K83:IV83))>ABS(MAX(K83:IV83)),MIN(K83:IV83),MAX(K83:IV83)))","v":{"v":0,"d":"0.00%"}},{"$f":"IF(OR(C53<-0.1,C53>0.1)=TRUE,\"Au moins un des CR présente un écart de plus de 10% entre N+4 et N+5\",\"Ok\")","v":"Ok"},"En cas d'écart significatif (ici : +/-10%), vérification de la saisie recommandée. ",{"$nulls":3},"% évolution / N+4",null,{"$f":"IFERROR((K52-K50)/K50,\"\")","v":""}]
["Charges afférentes à la structure (GIII) : écart N+6/N+5 en % (par compte de résultat)","CRPP/A et CRPA_SF",{"$f":"IF(ABS(MIN(K85:IV85))=ABS(MAX(K85:IV85)),MAX(K85:IV85),IF(ABS(MIN(K85:IV85))>ABS(MAX(K85:IV85)),MIN(K85:IV85),MAX(K85:IV85)))","v":{"v":0,"d":"0.00%"}},{"$f":"IF(OR(C54<-0.1,C54>0.1)=TRUE,\"Au moins un des CR présente un écart de plus de 10% entre N+5 et N+6\",\"Ok\")","v":"Ok"},"En cas d'écart significatif (ici : +/-10%), vérification de la saisie recommandée. ",null,null,{"$f":"IF(CREPASIDEN___ANNEEREF___ANN0\\_________=\"\",\"Produits de la tarification (GI) prévus N+6\",\"Produits de la tarification (GI) prévus \"&CREPASIDEN___ANNEEREF___ANN0\\_________+6)","v":"Produits de la tarification (GI) prévus N+6"},"Montant",null,{"$f":"VLOOKUP(\"Groupe I : Produits de la tarification\",Conso!$1117:$1138,$J$7,FALSE)","v":{"v":0,"d":"0.00 €"}}]
["Total des biens N-1","Bilan financier",{"$f":"'Bilan Financier'!$G$64","v":{"v":0,"d":"0.00 €"}},{"$f":"IF(C55=0,\"Non saisi\",IF(C55<0,\"Atypie\",\"Ok\"))","v":"Non saisi"},"Ce champ doit être non vide. Si valeur négative (atypie), vérification de la saisie recommandée. ",{"$nulls":3},"% évolution / N+5",null,{"$f":"IFERROR((K54-K52)/K52,\"\")","v":""}]
["Total des biens N-2","Bilan financier",{"$f":"'Bilan Financier'!$F$64","v":{"v":0,"d":"0.00 €"}},{"$f":"IF(C56=0,\"Non saisi\",IF(C56<0,\"Atypie\",\"Ok\"))","v":"Non saisi"},"Ce champ doit être non vide. Si valeur négative (atypie), vérification de la saisie recommandée. ",null,null,{"$f":"IF(CREPASIDEN___ANNEEREF___ANN0\\_________=\"\",\"Charges afférentes au personnel (GII) réalisées N-1\",\"Charges afférentes au personnel (GII) réalisées \"&CREPASIDEN___ANNEEREF___ANN0\\_________-1)","v":"Charges afférentes au personnel (GII) réalisées N-1"},"Montant",null,{"$f":"VLOOKUP(\"Groupe II : Charges afférentes au personnel\",Conso!$161:$180,$J$7,FALSE)","v":{"v":0,"d":"0.00 €"}}]
["Total des financements N-1","Bilan financier",{"$f":"'Bilan Financier'!$M$64","v":{"v":0,"d":"0.00 €"}},{"$f":"IF(C57=0,\"Non saisi\",IF(C57<0,\"Atypie\",\"Ok\"))","v":"Non saisi"},"Ce champ doit être non vide. Si valeur négative (atypie), vérification de la saisie recommandée. ",null,null,{"$f":"IF(CREPASIDEN___ANNEEREF___ANN0\\_________=\"\",\"Charges afférentes au personnel (GII) prévues N\",\"Charges afférentes au personnel (GII) prévues \"&CREPASIDEN___ANNEEREF___ANN0\\_________)","v":"Charges afférentes au personnel (GII) prévues N"},"Montant",null,{"$f":"VLOOKUP(\"Groupe II : Charges afférentes au personnel\",Conso!$299:$320,$J$7,FALSE)","v":{"v":0,"d":"0.00 €"}}]
["Total des financements N-2","Bilan financier",{"$f":"'Bilan Financier'!$L$64","v":{"v":0,"d":"0.00 €"}},{"$f":"IF(C58=0,\"Non saisi\",IF(C58<0,\"Atypie\",\"Ok\"))","v":"Non saisi"},"Ce champ doit être non vide. Si valeur négative (atypie), vérification de la saisie recommandée. ",{"$nulls":3},"% évolution / N-1",null,{"$f":"IFERROR((K57-K56)/K56,\"\")","v":""}]
["Equilibre du bilan financier (exercice N-1) ","Bilan financier",{"$f":"'Bilan Financier'!$G$64-'Bilan Financier'!$M$64","v":{"v":0,"d":"0.00 €"}},{"$f":"IF(ROUND(C59,0)=0,\"Ok\",\"Incohérence\")","v":"Ok"},"Le total des biens doit être égal au total des financements. En cas d'écart (incohérence), vérification de la saisie recommandée. ",null,null,{"$f":"IF(CREPASIDEN___ANNEEREF___ANN0\\_________=\"\",\"Charges afférentes au personnel (GII) prévues N+1\",\"Charges afférentes au personnel (GII) prévues \"&CREPASIDEN___ANNEEREF___ANN0\\_________+1)","v":"Charges afférentes au personnel (GII) prévues N+1"},"Montant",null,{"$f":"VLOOKUP(\"Groupe II : Charges afférentes au personnel\",Conso!$436:$457,$J$7,FALSE)","v":{"v":0,"d":"0.00 €"}}]
["Equilibre du bilan financier (exercice N-2) ","Bilan financier",{"$f":"'Bilan Financier'!$F$64-'Bilan Financier'!$L$64","v":{"v":0,"d":"0.00 €"}},{"$f":"IF(ROUND(C60,0)=0,\"Ok\",\"Incohérence\")","v":"Ok"},"Le total des biens doit être égal au total des financements. En cas d'écart (incohérence), vérification de la saisie recommandée. ",{"$nulls":3},"% évolution / N",null,{"$f":"IFERROR((K59-K57)/K57,\"\")","v":""}]
["Résultat net (exercice N-1) ","Bilan financier",{"$f":"'Bilan Financier'!$M$31-'Bilan Financier'!$G$30","v":{"v":0,"d":"0.00 €"}},{"$f":"IF(ROUND(C61-PGFP!D24,0)=0,\"Ok\",\"Incohérence\")","v":"Ok"},"Cohérence inter-onglet : lorsque les résultats sont sous contrôle de tiers financeurs, la valeur de ce champ doit être égale au résultat comptable issu de l'onglet \"PGFP\". En cas d'écart (incohérence), vérification de la saisie recommandée. \nA noter : les résultats d'activités sous gestion non contrôlée (ex : budget annexe de production/commercialisation d'un ESAT) sont à enregistrer dans le poste \"Autres\" des financements stables du bilan financier. Dans ce cas, l'écart qui en résulte entre le résultat net affiché dans l'onglet \"PGFP\" et celui du bilan financier est justifié et peut être utilement expliqué dans le rapport budgétaire et financier joint à l'EPRD.",null,null,{"$f":"IF(CREPASIDEN___ANNEEREF___ANN0\\_________=\"\",\"Charges afférentes au personnel (GII) prévues N+2\",\"Charges afférentes au personnel (GII) prévues \"&CREPASIDEN___ANNEEREF___ANN0\\_________+2)","v":"Charges afférentes au personnel (GII) prévues N+2"},"Montant",null,{"$f":"VLOOKUP(\"Groupe II : Charges afférentes au personnel\",Conso!$573:$594,$J$7,FALSE)","v":{"v":0,"d":"0.00 €"}}]
["VB d'immo corp. amortissables (exercice N-1)","Bilan financier",{"$f":"'Bilan Financier'!$G$8-'Bilan Financier'!$G$9","v":{"v":0,"d":"0.00 €"}},{"$f":"IF(OR('Bilan Financier'!$G$10<0, 'Bilan Financier'!$G$11<0, 'Bilan Financier'!$G$12<0, 'Bilan Financier'!$G$13<0),\"Incohérence\",\"Ok\")","v":"Ok"},"VB : valeur brute. Si au moins un poste d'immobilisations affiche une valeur négative (incohérence), vérification de la saisie recommandée. ",{"$nulls":3},"% évolution / N+1",null,{"$f":"IFERROR((K61-K59)/K59,\"\")","v":""}]
["Amort. des immo corp. (exercice N-1)","Bilan financier",{"$f":"'Bilan Financier'!$M$16","v":{"v":0,"d":"0.00 €"}},{"$f":"IF(C63=0,\"Non saisi\",IF(C63<0,\"Atypie\",\"Ok\"))","v":"Non saisi"},"Amort. : amortissements. S'il existe un patrimoine immobilier, ce champ doit être non vide. Si valeur négative (atypie), nous nous invitons à vérifier votre saisie. ",null,null,{"$f":"IF(CREPASIDEN___ANNEEREF___ANN0\\_________=\"\",\"Charges afférentes au personnel (GII) prévues N+3\",\"Charges afférentes au personnel (GII) prévues \"&CREPASIDEN___ANNEEREF___ANN0\\_________+3)","v":"Charges afférentes au personnel (GII) prévues N+3"},"Montant",null,{"$f":"VLOOKUP(\"Groupe II : Charges afférentes au personnel\",Conso!$709:$730,$J$7,FALSE)","v":{"v":0,"d":"0.00 €"}}]
["Ecart total VB d'immo corp. amortissables - total amort. des immo corp. (exercice N-1)","Bilan financier",{"$f":"C62-C63","v":{"v":0,"d":"0.00 €"}},{"$f":"IF(C64<0,\"Incohérence\",\"Ok\")","v":"Ok"},"Le total des amortissements ne peut excéder le total des valeurs brutes d'immobilisations amortissables. En cas d'écart négatif (incohérence), vérification de la saisie recommandée. ",{"$nulls":3},"% évolution / N+2",null,{"$f":"IFERROR((K63-K61)/K61,\"\")","v":""}]
["Agencements de terrain : écart VB - amort. (exercice N-1)","Bilan financier",{"$f":"'Bilan Financier'!$G$10-'Bilan Financier'!$M$17","v":{"v":0,"d":"0.00 €"}},{"$f":"IF(C65<0,\"Incohérence\",\"Ok\")","v":"Ok"},"Le montant des amortissements ne peut excéder le montant de la valeur brute. En cas d'écart négatif (incohérence), vérification de la saisie recommandée. ",null,null,{"$f":"IF(CREPASIDEN___ANNEEREF___ANN0\\_________=\"\",\"Charges afférentes au personnel (GII) prévues N+4\",\"Charges afférentes au personnel (GII) prévues \"&CREPASIDEN___ANNEEREF___ANN0\\_________+4)","v":"Charges afférentes au personnel (GII) prévues N+4"},"Montant",null,{"$f":"VLOOKUP(\"Groupe II : Charges afférentes au personnel\",Conso!$845:$866,$J$7,FALSE)","v":{"v":0,"d":"0.00 €"}}]
["Constructions : écart VB - amort. (exercice N-1)","Bilan financier",{"$f":"'Bilan Financier'!$G$11-'Bilan Financier'!$M$18","v":{"v":0,"d":"0.00 €"}},{"$f":"IF(C66<0,\"Incohérence\",\"Ok\")","v":"Ok"},"Le montant des amortissements ne peut excéder le montant de la valeur brute. En cas d'écart négatif (incohérence), vérification de la saisie recommandée. ",{"$nulls":3},"% évolution / N+3",null,{"$f":"IFERROR((K65-K63)/K63,\"\")","v":""}]
["Install. Techniques : écart VB - amort. (exercice N-1)","Bilan financier",{"$f":"'Bilan Financier'!$G$12-'Bilan Financier'!$M$19","v":{"v":0,"d":"0.00 €"}},{"$f":"IF(C67<0,\"Incohérence\",\"Ok\")","v":"Ok"},"Le montant des amortissements ne peut excéder le montant de la valeur brute. En cas d'écart négatif (incohérence), nous vous invitons à véirifier votre saisie. ",null,null,{"$f":"IF(CREPASIDEN___ANNEEREF___ANN0\\_________=\"\",\"Charges afférentes au personnel (GII) prévues N+5\",\"Charges afférentes au personnel (GII) prévues \"&CREPASIDEN___ANNEEREF___ANN0\\_________+5)","v":"Charges afférentes au personnel (GII) prévues N+5"},"Montant",null,{"$f":"VLOOKUP(\"Groupe II : Charges afférentes au personnel\",Conso!$981:$1002,$J$7,FALSE)","v":{"v":0,"d":"0.00 €"}}]
["Autres immo corp. : écart VB - amort. (exercice N-1)","Bilan financier",{"$f":"'Bilan Financier'!$G$13-'Bilan Financier'!$M$20","v":{"v":0,"d":"0.00 €"}},{"$f":"IF(C68<0,\"Incohérence\",\"Ok\")","v":"Ok"},"Le montant des amortissements ne peut excéder le montant de la valeur brute. En cas d'écart négatif (incohérence), vérification de la saisie recommandée. ",{"$nulls":3},"% évolution / N+4",null,{"$f":"IFERROR((K67-K65)/K65,\"\")","v":""}]
["Dotations aux amortissements des immo c/6811 prévues N","CRPP/A et CRPA_SF",{"$f":"Conso!B79","v":{"v":0,"d":"0.00 €"}},{"$f":"IF('Bilan Financier'!$G$7+'Bilan Financier'!$G$8-'Bilan Financier'!$G$9-'Bilan Financier'!$M$16-'Bilan Financier'!$M$21=0,\"Non applicable\",IF(C69<=0,\"Incohérence\",\"OK\"))","v":"Non applicable"},"Cohérence inter-onglet : si la valeur nette au 31/12/N-1 des immobilisations corporelles amortissables est non nulle selon le bilan financier, alors le montant des dotations au compte 6811 inscrites au compte de résultat au titre de l'exercice N devrait être non nul. En cas d'incohérence, vérification de la saisie recommandée. ",null,null,{"$f":"IF(CREPASIDEN___ANNEEREF___ANN0\\_________=\"\",\"Charges afférentes au personnel (GII) prévues N+6\",\"Charges afférentes au personnel (GII)) \"&CREPASIDEN___ANNEEREF___ANN0\\_________+6)","v":"Charges afférentes au personnel (GII) prévues N+6"},"Montant",null,{"$f":"VLOOKUP(\"Groupe II : Charges afférentes au personnel\",Conso!$1117:$1138,$J$7,FALSE)","v":{"v":0,"d":"0.00 €"}}]
["Total des emplois (hors IAF) prévus N","Tableau de financement",{"$f":"TFP!$F$47-TFP!$F$26","v":{"v":0,"d":"0.00 €"}},{"$f":"IF(C70=0,\"Non saisi\",IF(C70<0,\"Atypie\",\"Ok\"))","v":"Non saisi"},"Ce champ est généralement non vide. Si \"Non saisi\" ou \"Incohérence\", vérification de la saisie recommandée. ",{"$nulls":3},"% évolution / N+5",null,{"$f":"IFERROR((K69-K67)/K67,\"\")","v":""}]
["Total des emplois (hors IAF) réalisés N-1","Tableau de financement",{"$f":"TFP!$E$47-TFP!$E$26","v":{"v":0,"d":"0.00 €"}},{"$f":"IF(C71=0,\"Non saisi\",IF(C71<0,\"Atypie\",\"Ok\"))","v":"Non saisi"},"Ce champ est généralement non vide. Si \"Non saisi\" ou \"Incohérence\", vérification de la saisie recommandée. ",null,null,{"$f":"IF(CREPASIDEN___ANNEEREF___ANN0\\_________=\"\",\"Charges afférentes à la structure (GIII) réalisées N-1\",\"Charges afférentes à la structure (GIII) réalisées \"&CREPASIDEN___ANNEEREF___ANN0\\_________-1)","v":"Charges afférentes à la structure (GIII) réalisées N-1"},"Montant",null,{"$f":"VLOOKUP(\"Groupe III : Charges afférentes à la structure\",Conso!$161:$180,$J$7,FALSE)","v":{"v":0,"d":"0.00 €"}}]
["Variation des dettes financières c/16 (réalisé N-1)","Tableau de financement",{"$f":"TFP!$E$11+TFP!$E$12-TFP!$E$29-TFP!$E$30","v":{"v":0,"d":"0.00 €"}},{"$f":"IF(ROUND(C72-('Bilan Financier'!$M$14+'Bilan Financier'!$M$15-'Bilan Financier'!$L$14-'Bilan Financier'!$L$15),0)=0,\"Ok\",\"Incohérence\")","v":"Ok"},"Cohérence inter-onglet : les mouvements d'emplois et de ressources afférents aux emprunts, dépôts et cautionnements (compte 16) doivent concorder avec la variation des postes \"Emprunts et dettes assimilées\" et \"Dépôts et cautionnements reçus\" au bilan financier. En cas d'écart (incohérence), vérification de la saisie recommandée. Si cet écart est justifié, il doit être expliqué dans le rapport budgétaire et financier. ",null,null,{"$f":"IF(CREPASIDEN___ANNEEREF___ANN0\\_________=\"\",\"Charges afférentes à la structure (GIII) prévues N\",\"Charges afférentes à la structure (GIII) prévues \"&CREPASIDEN___ANNEEREF___ANN0\\_________)","v":"Charges afférentes à la structure (GIII) prévues N"},"Montant",null,{"$f":"VLOOKUP(\"Groupe III : Charges afférentes à la structure\",Conso!$299:$320,$J$7,FALSE)","v":{"v":0,"d":"0.00 €"}}]
["Remboursement des emprunts et dettes assimilées au 31/12/N","TFP/PGFP",{"$f":"PGFP!E61+PGFP!E62","v":{"v":0,"d":"0.00 €"}},{"$f":"IF(ROUND(C73-(TFP!F29),0)=0,\"Ok\",\"écart entre le TFP et le PGFP de \"&TFP!F29-(PGFP!E61+PGFP!E62))","v":"Ok"},"Cohérence inter-onglet : le montant global des remboursements des emprunts inscrit au PGFP doit être égal à la valeur des remboursements retracée dans l'onglet \"TFP\". En cas d'écart (incohérence), vérification de la saisie recommandée. ",{"$nulls":3},"% évolution / N-1",null,{"$f":"IFERROR((K72-K71)/K71,\"\")","v":""}]
["Remboursement des emprunts et dettes assimilées au 31/12/N-1","TFP/PGFP",{"$f":"PGFP!D61+PGFP!D62","v":{"v":0,"d":"0.00 €"}},{"$f":"IF(ROUND(C74-(TFP!E29),0)=0,\"Ok\",\"écart entre le TFP et le PGFP de \"&TFP!E29-(PGFP!D61+PGFP!D62))","v":"Ok"},"Cohérence inter-onglet : le montant global des remboursements des emprunts inscrit au PGFP doit être égal à la valeur des remboursements retracée dans l'onglet \"TFP\". En cas d'écart (incohérence), vérification de la saisie recommandée.",null,null,{"$f":"IF(CREPASIDEN___ANNEEREF___ANN0\\_________=\"\",\"Charges afférentes à la structure (GIII) prévues N+1\",\"Charges afférentes  à la structure (GIII) prévues \"&CREPASIDEN___ANNEEREF___ANN0\\_________+1)","v":"Charges afférentes à la structure (GIII) prévues N+1"},"Montant",null,{"$f":"VLOOKUP(\"Groupe III : Charges afférentes à la structure\",Conso!$436:$457,$J$7,FALSE)","v":{"v":0,"d":"0.00 €"}}]
["Apports, dotations, réserves et fonds propres au 31/12/N-1","Bilan financier",{"$f":"'Bilan Financier'!M7","v":{"v":0,"d":"0.00 €"}},{"$f":"IF(C75=0,\"Non saisi\",IF(C75<0,\"Incohérence\",\"Ok\"))","v":"Non saisi"},"Les apports, dotations, réserves fonds propres ne peuvent pas être négatifs par nature. En cas d'incohérence, vérification de la saisie recommandée.",{"$nulls":3},"% évolution / N",null,{"$f":"IFERROR((K74-K72)/K72,\"\")","v":""}]
["Reprises à l'investissement des réserves de couverture de BFR (exercice N-1)","PGFP / Bilan financier",{"$f":"PGFP!D85","v":{"v":0,"d":"0.00 €"}},{"$f":"IF(AND(C76<>0,('Bilan Financier'!M29-'Bilan Financier'!L29=0))=TRUE,\"Montant au PGFP incohérent avec la stabilité de cette réserve au bilan financier\",\"Ok\")","v":"Ok"},"Cohérence inter-onglet : une reprise sur la réserve de couverture de BFR doit réduire le montant de cette réserve, sauf affectation d'un montant plus élevé que la reprise la même année et ne peut être faite qu'au profit de la réseve d'investissement. En cas d'incohérence, vérification de la saisie recommandée (ou ajoutez une mention spécifique dans le rapport budgétaire et financier pour l'expliquer).",null,null,{"$f":"IF(CREPASIDEN___ANNEEREF___ANN0\\_________=\"\",\"Charges afférentes à la structure (GIII) prévues N+2\",\"Charges afférentes à la structure (GIII) prévues \"&CREPASIDEN___ANNEEREF___ANN0\\_________+2)","v":"Charges afférentes à la structure (GIII) prévues N+2"},"Montant",null,{"$f":"VLOOKUP(\"Groupe III : Charges afférentes à la structure\",Conso!$573:$594,$J$7,FALSE)","v":{"v":0,"d":"0.00 €"}}]
["Affectation du résultat à l'investissement (exercice N-1)","PGFP / Bilan financier",{"$f":"PGFP!D86","v":{"v":0,"d":"0.00 €"}},{"$f":"IF(AND(C77<>0,('Bilan Financier'!M8-'Bilan Financier'!L8=0))=TRUE,\"Montant au PGFP incohérent avec la stabilité de cette réserve au bilan financier\",\"Ok\")","v":"Ok"},"Cohérence inter-onglet : un excédent affecté à l'investissement doit augmenter le montant de cette réserve. En cas d'incohérence, vérification de la saisie recommandée (ou ajout d'une mention spécifique dans le rapport budgétaire et financier pour l'expliquer).",{"$nulls":3},"% évolution / N+1",null,{"$f":"IFERROR((K76-K74)/K74,\"\")","v":""}]
["Affectation des résultats à la réserve de compensation des charges d'amortissement (exercice N-1)","PGFP / Bilan financier",{"$f":"PGFP!D87","v":{"v":0,"d":"0.00 €"}},{"$f":"IF(AND(C78<>0,('Bilan Financier'!M10-'Bilan Financier'!L10=0))=TRUE,\"Montant au PGFP incohérente avec la stabilité de cette réserve au bilan financier\",\"Ok\")","v":"Ok"},"Cohérence inter-onglet : une affectation de résultats en réserve de compensation des charges d'amortissements doit augmenter le montant de cette réserve. En cas d'incohérence, vérification de la saisie recommandée (ou ajout d'une mention spécifique dans le rapport budgétaire et financier pour l'expliquer).",null,null,{"$f":"IF(CREPASIDEN___ANNEEREF___ANN0\\_________=\"\",\"Charges afférentes à la structure (GIII) prévues N+3\",\"Charges afférentes à la structure (GIII) prévues \"&CREPASIDEN___ANNEEREF___ANN0\\_________+3)","v":"Charges afférentes à la structure (GIII) prévues N+3"},"Montant",null,{"$f":"VLOOKUP(\"Groupe III : Charges afférentes à la structure\",Conso!$709:$730,$J$7,FALSE)","v":{"v":0,"d":"0.00 €"}}]
["FRI au 31/12/N-1","PGFP / Bilan financier",{"$f":"PGFP!D78","v":{"v":0,"d":"0.00 €"}},{"$f":"IF(ROUND(C79,0)<>ROUND(('Bilan Financier'!M27-'Bilan Financier'!G27),0),\"FRI du PGFP différent du FRI du bilan financier\",\"Ok\")","v":"Ok"},"Cohérence inter-onglet : le montant du FRI au 31/12/N-1 doit être identique entre les onglets \"PGFP\" et \"Bilan financier\". En cas d'écart, vérification de la saisie recommandée.",{"$nulls":3},"% évolution / N+2",null,{"$f":"IFERROR((K78-K76)/K76,\"\")","v":""}]
["FRE au 31/12/N-1","PGFP / Bilan financier",{"$f":"PGFP!D92","v":{"v":0,"d":"0.00 €"}},{"$f":"IF(ROUND(C80,0)<>ROUND(('Bilan Financier'!M39-'Bilan Financier'!G39),0),\"FRE du PGFP différent du FRE du bilan financier\",\"Ok\")","v":"Ok"},"Cohérence inter-onglet : le montant du FRE au 31/12/N-1 doit être identique entre les onglets \"PGFP\" et \"Bilan financier\". En cas d'écart, vérification de la saisie recommandée.",null,null,{"$f":"IF(CREPASIDEN___ANNEEREF___ANN0\\_________=\"\",\"Charges afférentes à la structure (GIII) prévues N+4\",\"Charges afférentes à la structure (GIII) prévues \"&CREPASIDEN___ANNEEREF___ANN0\\_________+4)","v":"Charges afférentes à la structure (GIII) prévues N+4"},"Montant",null,{"$f":"VLOOKUP(\"Groupe III : Charges afférentes à la structure\",Conso!$845:$866,$J$7,FALSE)","v":{"v":0,"d":"0.00 €"}}]
["Variation du FRNG au 31/12/N-1","PGFP / Bilan financier",{"$f":"PGFP!$D$94","v":{"v":0,"d":"0.00 €"}},{"$f":"IF(ROUND(C81-('Bilan Financier'!$M$40-'Bilan Financier'!$G$40-('Bilan Financier'!$L$40-'Bilan Financier'!$F$40)),0)=0,\"Ok\",\"Incohérence des montants de variation du FRNG entre PGFP et bilan financier\")","v":"Ok"},"Cohérence inter-onglet : la variation du fonds de roulement calculée à partir du PGFP doit être égale à la variation du FRNG calculée à partir du bilan financier. En cas d'écart (incohérence), vérification de la saisie recommandée. Si cet écart est justifié, il doit être expliqué dans le rapport budgétaire et financier. ",{"$nulls":3},"% évolution / N+3",null,{"$f":"IFERROR((K80-K78)/K78,\"\")","v":""}]
["FRNG au 31/12/N-1","PGFP / Bilan financier",null,{"$f":"PGFP!D119","v":"OK"},"report ici du contrôle effectué directement dans l'onglet \"PGFP\"",null,null,{"$f":"IF(CREPASIDEN___ANNEEREF___ANN0\\_________=\"\",\"Charges afférentes à la structure (GIII) prévues N+5\",\"Charges afférentes à la structure (GIII) prévues \"&CREPASIDEN___ANNEEREF___ANN0\\_________+5)","v":"Charges afférentes à la structure (GIII) prévues N+5"},"Montant",null,{"$f":"VLOOKUP(\"Groupe III : Charges afférentes à la structure\",Conso!$981:$1002,$J$7,FALSE)","v":{"v":0,"d":"0.00 €"}}]
["BFR au 31/12/N-1","PGFP / Bilan financier",{"$f":"PGFP!D111","v":{"v":0,"d":"0.00 €"}},{"$f":"IF(ROUND(C83,0)<>ROUND(('Bilan Financier'!G53-'Bilan Financier'!M53),0),\"BFR du PGFP différent du BFR du bilan financier\",\"Ok\")","v":"Ok"},"Cohérence inter-onglet : le montant du BFR au 31/12/N-1 doit être identique entre les onglets \"PGFP\" et \"Bilan financier\". En cas d'écart, vérification de la saisie recommandée.",{"$nulls":3},"% évolution / N+4",null,{"$f":"IFERROR((K82-K80)/K80,\"\")","v":""}]
["Variation de la trésorerie au 31/12/N-1","PGFP / Bilan financier",{"$f":"PGFP!D112","v":{"v":0,"d":"0.00 €"}},{"$f":"IF(ROUND(C84,0)<>ROUND(('Bilan Financier'!G63-'Bilan Financier'!M63-('Bilan Financier'!F63-'Bilan Financier'!L63)),0),\"Trésorerie du PGFP différente de la trésorerie du bilan financier\",\"Ok\")","v":"Ok"},"Cohérence inter-onglet : le montant de la trésorerie au 31/12/N-1 doit être identique entre les onglets \"PGFP\" et \"Bilan financier\". En cas d'écart, vérification de la saisie recommandée.",null,null,{"$f":"IF(CREPASIDEN___ANNEEREF___ANN0\\_________=\"\",\"Charges afférentes à la structure (GIII) prévues N+6\",\"Charges afférentes à la structure (GIII)) \"&CREPASIDEN___ANNEEREF___ANN0\\_________+6)","v":"Charges afférentes à la structure (GIII) prévues N+6"},"Montant",null,{"$f":"VLOOKUP(\"Groupe III : Charges afférentes à la structure\",Conso!$1117:$1138,$J$7,FALSE)","v":{"v":0,"d":"0.00 €"}}]
["Trésorerie au 31/12/N-1","PGFP / Bilan financier",null,{"$f":"PGFP!D120","v":"OK"},"report ici du contrôle effectué directement dans l'onglet \"PGFP\"",{"$nulls":3},"% évolution / N+5",null,{"$f":"IFERROR((K84-K82)/K82,\"\")","v":""}]
["Mouvements du FRE pouvant impacter le FRNG et non pris en compte dans l'onglet \"TFP\", au 31/12/N","EPRD synthétique / TFP / PGFP",{"$f":"'EPRD synthétique'!C37-'EPRD synthétique'!D37","v":{"v":0,"d":"0.00 €"}},{"$f":"IF(ROUND(ABS(C86),0)<>ROUND(ABS((PGFP!E94-(TFP!F48-TFP!F20))),0),\"Incohérence des variations du FRNG entre le tableau de financement prévisionnel et le PGFP\",\"Ok\")","v":"Ok"},"Cohérence inter-onglet : La variation du FRNG du TFP intègre uniquement les variations liées au FRI, alors que celle du PGFP prend en compte toutes les variations (FRI + FRE). Un écart provient donc a priori des comptes de liaison trésorerie (stable). Ce contrôle porte sur l'égalité entre la variation des comptes de liaison trésorerie (stable) et l'écart d'apport ou prélèvement sur le FRNG entre PGFP et TFP. Si un écart subsiste, vérification de la saisie recommandée."]
["Variation du FRNG - y compris mouvements ci-dessus (réalisé N-1)","PGFP / TFP",{"$f":"PGFP!$E$94","v":{"v":0,"d":"0.00 €"}},{"$f":"IF(ROUND(ABS(C87),0)<>ROUND(ABS('EPRD synthétique'!C44),0),\"Incohérence entre le PGFP et l'EPRD synthétique\",\"Ok\")","v":"Ok"},"Cohérence inter-onglet : la variation du fonds de roulement calculée à partir du PGFP doit être égale à la variation du FRNG calculée dans l'EPRD synthétique, hormis le cas des comptes de liaison trésorerie (stable) pour les ESSMS privés. En cas d'écart (incohérence), vérification de la saisie recommandée."]
["Variation de la trésorerie au 31/12/N","EPRD synthétique / PGFP",null,{"$f":"'EPRD synthétique'!C62","v":"Ok"},"report ici du contrôle effectué directement dans l'onglet \"EPRD synthétique\""]
["Trésorerie au 31/12/N","EPRD synthétique / PGFP",{"$f":"PGFP!E114","v":{"v":0,"d":"0.00 €"}},{"$f":"IF(ROUND(C89,0)<>ROUND(('EPRD synthétique'!C58),0),\"Trésorerie du PGFP différente de la trésorerie de l'EPRD synthétique\",\"Ok\")","v":"Ok"},"Cohérence inter-onglet : le montant de la trésorerie au 31/12/N doit être identique entre les onglets \"EPRD synthétique\" et \"PGFP\". En cas d'écart, vérification de la saisie recommandée."]

{"sheet":"Page de garde","index":6,"n_rows":32,"n_cols":16,"rows_kept":32,"merged":[[1,2,1,11],[7,3,7,10],[11,3,11,10],[31,2,31,3],[31,4,31,11]]}
["#EPRDHA-2026-01#"]
[null,null,"Annexe 1: Cadre normalisé de présentation de l'Etat des Prévisions de Recettes et de Dépenses (EPRD) des établissements et services sociaux et médico-sociaux relevant du I de l'article L. 312-1 du code de l'action sociale et des familles"]
[]
[null,null,"Exercice :"]
[]
[null,null,"N° FINESS (entité juridique) :",""]
[]
[null,null,"Organisme gestionnaire :"]
[]
[null,null,"Statut de l'entité juridique :"]
[]
[null,null,"Adresse :"]
[]
[null,null,"Téléphone :"]
[]
[null,null,"Fax :"]
[]
[null,null,"Email :"]
[]
[null,null,"Nom et qualité de la personne habilitée à représenter l'organisme gestionnaire :"]
[]
[null,null,"Date d'effet du contrat pluriannuel d'objectifs et de moyens :"]
[]
[]
[null,null,"Etablissements et services relevant du périmètre de l'EPRD"]
[]
[null,null,"Etablissements et services","Adresses","N° FINESS Etablissement","Catégorie","Date d'autorisation","Capacité autorisée","Capacité installée","Amplitude d'ouverture sur l'année (en jours)","ESSMS relevant du périmètre du CPOM - O/N ","CRP soumis à l'obligation d'une présentation équilibrée - O/N"]
[{"$nulls":15},{"$f":"G28","v":0}]
[]
[{"$nulls":15},{"$f":"G30","v":0}]
[]
[null,null,"Convention collective majoritaire de travail :"]

{"sheet":"Id_CR_SF","index":7,"n_rows":15,"n_cols":10,"rows_kept":15,"merged":[[1,1,1,9]]}
[]
[null,"Identification des activités sans numéro FINESS"]
[]
[null,"Liste des activités sans FINESS Etablissement relevant du périmètre de l'EPRD"]
[]
[]
[null,"Identifiant (*)","Dénomination du CRP sans n° FINESS","Adresse","Catégorie","Capacité autorisée","Capacité installée","Amplitude d'ouverture sur l'année (en jours)","CRP relevant du périmètre du CPOM \nO/N","N° FINESS ET de rattachement"]
[{"$nulls":9},""]
[]
[]
[]
[null,"(*) Veuillez saisir un identifiant de votre choix comprenant 6 caractères (sans caractères spéciaux, tirets, accents…)."]
[null,"Le modèle de CRP créé est le CRP non soumis à l'équilibre strict."]
[null,"Nous vous invitons à compléter le tableau de l'onglet \"Id_CR_SF\" selon le même ordonnancement chaque année, afin qu'un même numéro d'identification soit toujours attribué à la même activité."]
[null,"Tous les CRP_SF sont pris en compte dans les calculs globaux (CAF, FDR etc.). Veillez à bien établir le CRP de l'établissement d'adossement sans les charges relatives au CRP_SF rattaché."]

{"sheet":"Sommaire","index":8,"n_rows":32,"n_cols":3,"rows_kept":32,"hidden":true}
["Sommaire"]
[]
["Documents","Identification de l'onglet","Pagination"]
["Comptes de résultat prévisionnel"]
["ESSMS 1","CRPP","Page  à"]
["ESSMS 2","CRPA_1","Page  à"]
["ESSMS 3","CRPA_2","Page  à"]
["ESSMS …","CRPA_...","Page  à"]
[]
["Synthèse des CRP","Synthèse_CRP","Page  à"]
[]
["EPRD synthétique","EPRD-Synthétique","Page "]
[]
["CAF détaillée","CAF_détaillée","Page "]
[]
["Tableau de financement prévisionnel","TFP","Page"]
[]
["Projection des comptes de résultat prévisionnels"]
["ESSMS 1","CRPP_PGFP","Page  à"]
["ESSMS 2","CRPA_1 PGFP","Page  à"]
["ESSMS 3","CRPA_2  PGFP","Page  à"]
["ESSMS …","CRPA_... PGFP","Page  à"]
[]
["Plan global de financement pluriannuel","PGFP","Page  à"]
[]
["Détermination du fonds de roulement au 31 décembre N-1 ","Bilan financier","Page  à"]
[]
["Ratios d'analyse financière","Ratios_financiers","Page"]
[]
["Tableau de répartition des charges communes et opérations faites en commun","Tableau_Rcc","Page"]
[]
["Engagements hors bilan","Tab_Eng. hors bilan","Page"]

{"sheet":"CRPP NON SOUMIS EQUIL","index":9,"n_rows":213,"n_cols":6,"rows_kept":213,"hidden":true,"merged":[[1,1,1,2],[1,3,1,5],[2,1,2,2],[2,3,2,5],[5,1,5,5],[8,3,9,3],[8,4,9,4],[8,5,9,5],[8,8,8,13],[35,3,36,3],[35,4,36,4],[35,5,36,5],[52,3,53,3],[52,4,53,4],[52,5,53,5],[115,3,116,3],[115,4,116,4],[115,5,116,5],[133,2,134,2],[133,3,134,3],[133,4,134,4],[133,5,134,5],[160,3,161,3],[160,4,161,4],[160,5,161,5],[212,1,212,5]]}
[]
[null,"Raison sociale :"]
[null,"FINESS ET :"]
[]
[]
[null,"Compte de résultat prévisionnel principal/annexe non soumis à l'obligation d'équilibre"]
[]
[null,"Présentation des charges :"]
[{"$nulls":3},{"$f":"IF(CREPASIDEN___ANNEEREF___ANN0\\_________=\"\",\"Réel N-2\",\"Réel \"&(CREPASIDEN___ANNEEREF___ANN0\\_________-2))","v":"Réel N-2"},{"$f":"IF(CREPASIDEN___ANNEEREF___ANN0\\_________=\"\",\"Anticipé ou réel N-1 (1)\",\"Anticipé ou réel \"&(CREPASIDEN___ANNEEREF___ANN0\\_________-1)&\" (1) \")","v":"Anticipé ou réel N-1 (1)"},{"$f":"IF(CREPASIDEN___ANNEEREF___ANN0\\_________=\"\",\"Exercice N\",\"Exercice \"&CREPASIDEN___ANNEEREF___ANN0\\_________)","v":"Exercice N"}]
[null,null,"GROUPE I : CHARGES AFFERENTES A L'EXPLOITATION COURANTE"]
[null,"ACHATS"]
[null,"601/602/603","Achats stockés et variation des stocks"]
[null,606,"Achats non stockés de matières et fournitures"]
[null,607,"Achats de marchandises"]
[null,709,"Rabais, remises, ristournes accordés par l'établissement"]
[null,713,"Variation des stocks, en cours de production, produits (en dépenses)"]
[]
[null,"SERVICES EXTERIEURS"]
[null,6111,"Sous-traitance: prestations à caractère médical"]
[null,6112,"Sous-traitance: prestations à caractère médico-social"]
[null,6118,"Sous-traitance: autres prestations de service"]
[null," "," "]
[null,"AUTRES SERVICES EXTERIEURS "]
[null,624,"Transports de biens, d'usagers et transports collectifs du personnel (autres que c/6242)"]
[null,6242,"Transports d'usagers"]
[null,625,"Déplacements, missions et réceptions"]
[null,626,"Frais postaux et frais de télécommunications"]
[null,6281,"Prestations de blanchissage à l'extérieur"]
[null,6282,"Prestations d'alimentation à l'extérieur"]
[null,6283,"Prestations de nettoyage à l'extérieur"]
[null,6284,"Prestations d'informatique à l'extérieur"]
[null,"6287/6288","Divers - Remboursements de frais et autres"]
[]
[null,null,"TOTAL GROUPE I",{"$f":"SUM(D12:D16)+SUM(D19:D21)+SUM(D24:D32)","v":{"v":0,"d":"0.00 €"}},{"$f":"SUM(E12:E16)+SUM(E19:E21)+SUM(E24:E32)","v":{"v":0,"d":"0.00 €"}},{"$f":"SUM(F12:F16)+SUM(F19:F21)+SUM(F24:F32)","v":{"v":0,"d":"0.00 €"}}]
[]
[{"$nulls":3},{"$f":"IF(CREPASIDEN___ANNEEREF___ANN0\\_________=\"\",\"Réel N-2\",\"Réel \"&(CREPASIDEN___ANNEEREF___ANN0\\_________-2))","v":"Réel N-2"},{"$f":"IF(CREPASIDEN___ANNEEREF___ANN0\\_________=\"\",\"Anticipé ou réel N-1\",\"Anticipé ou réel \"&(CREPASIDEN___ANNEEREF___ANN0\\_________-1))","v":"Anticipé ou réel N-1"},{"$f":"IF(CREPASIDEN___ANNEEREF___ANN0\\_________=\"\",\"Exercice N\",\"Exercice \"&CREPASIDEN___ANNEEREF___ANN0\\_________)","v":"Exercice N"}]
[null,null,"GROUPE II : CHARGES AFFERENTES AU PERSONNEL"]
[]
[null,621,"Personnel extérieur à l'établissement"]
[null,622,"Rémunérations d'intermédiaires et honoraires"]
[null,631,"Impôts, taxes et versements assimilés sur rémunérations (administration des impôts)"]
[null,633,"Impôts, taxes et versements assimilés sur rémunérations (autres organismes)"]
[null,641,"Rémunérations du personnel non médical"]
[null,642,"Rémunérations du personnel médical"]
[null,643,"Rémunération du personnel handicapé"]
[null,645,"Cotisations de sécurité sociale et de prévoyance "]
[null,646,"Personnes handicapées"]
[null,647,"Autres charges sociales"]
[null,648,"Autres charges de personnel"]
[]
[null,null,"TOTAL GROUPE II",{"$f":"SUM(D39:D49)","v":{"v":0,"d":"0.00 €"}},{"$f":"SUM(E39:E49)","v":{"v":0,"d":"0.00 €"}},{"$f":"SUM(F39:F49)","v":{"v":0,"d":"0.00 €"}}]
[null,null,"(1) : Anticipé pour les EPRD établis avant la clôture de l'exercice N-1."]
[{"$nulls":3},{"$f":"IF(CREPASIDEN___ANNEEREF___ANN0\\_________=\"\",\"Réel N-2\",\"Réel \"&(CREPASIDEN___ANNEEREF___ANN0\\_________-2))","v":"Réel N-2"},{"$f":"IF(CREPASIDEN___ANNEEREF___ANN0\\_________=\"\",\"Anticipé ou réel N-1\",\"Anticipé ou réel \"&(CREPASIDEN___ANNEEREF___ANN0\\_________-1))","v":"Anticipé ou réel N-1"},{"$f":"IF(CREPASIDEN___ANNEEREF___ANN0\\_________=\"\",\"Exercice N\",\"Exercice \"&CREPASIDEN___ANNEEREF___ANN0\\_________)","v":"Exercice N"}]
[null,null,"GROUPE III : CHARGES AFFERENTES A LA STRUCTURE "]
[]
[null,612,"Redevances de crédit-bail"]
[null,613,"Locations"]
[null,614,"Charges locatives et de copropriété"]
[null,615,"Entretien et réparations"]
[null,616,"Primes d'assurances"]
[null,617,"Etudes et recherches"]
[null,618,"Divers"]
[null,623,"Information, publications, relations publiques"]
[null,627,"Services bancaires et assimilés"]
[null,635,"Autres impôts taxes et versements assimilés (administration des impôts) "]
[null,"637/638","Autres impôts, taxes et versements assimilés (autres organismes) et rappel d'impôts (autres qu'impôts sur les bénéfices)"]
[]
[null,"AUTRES CHARGES DE GESTION COURANTE"]
[null,651,"Redevances pour concessions, brevets, licences, procédés, droits et valeurs similaires"]
[null,652,"Valeur comptable des immobilisations incorporelles et corporelles cédées"]
[null,653,"Contribution versée au groupement hospitalier de territoire "]
[null,654,"Pertes sur créances irrécouvrables"]
[null,655,"Quotes-parts de résultat sur opérations faites en commun"]
[null,657,"Subventions"]
[null,658,"Charges diverses de gestion courante"]
[]
[null,"CHARGES FINANCIERES"]
[null,66,"Charges financières"]
[]
[null,"CHARGES EXCEPTIONNELLES"]
[null,671,"Charges exceptionnelles sur opérations de gestion"]
[null,673,"Titres annulés (sur exercices antérieurs) (ESSMS publics)"]
[null,675,"Valeurs comptables des éléments d'actif cédés (ESSMS publics)"]
[null,678,"Autres charges exceptionnelles"]
[]
[null,"DOTATIONS AUX AMORTISSEMENTS, AUX DEPRECIATIONS, AUX PROVISIONS ET ENGAGEMENTS"]
[null,6811,"Dotations aux amortissements des immobilisations incorporelles et corporelles"]
[null,6812,"Dotations aux amortissements des charges d'exploitation à répartir"]
[null,6815,"Dotations aux provisions des charges d'exploitation"]
[null,6816,"Dotations aux dépréciations des immobilisations incorporelles et corporelles"]
[null,6817,"Dotations aux dépréciations des actifs circulants"]
[null,686,"Dotations aux amortissements, dépréciations et provisions : charges financières"]
[null,6871,"Dotations aux amortissements exceptionnels des immobilisations"]
[null,68725,"Dotations aux amortissements dérogatoires"]
[null,68741,"Dotations aux provisions réglementées destinées à renforcer la couverture du BFR"]
[null,68742,"Dotations aux provisions réglementées pour renouvellement des immobilisations"]
[null,68746,"Dotations aux provisions réglementées : réserves des plus-values nettes d'actif (ESSMS privés)"]
[null,68748,"Autres dotations aux provisions réglementées"]
[null,6875,"Dotations aux provisions exceptionnelles"]
[null,6876,"Dotations aux dépréciations exceptionnelles"]
[null,689,"Reports en fonds dédiés (sauf c/6892 et c/6895) (ESSMS privés)"]
[null,68921,"Reports en fonds dédiés à l'investissement sur concours publics des entités gestionnaires d'ESSMS (ESSMS privés)"]
[null,68922,"Reports en fonds dédiés à l'exploitation sur concours publics des entités gestionnaires d'ESSMS (ESSMS privés)"]
[null,6895,"Reports en fonds dédiés sur contribution financière d'autres organismes (ESSMS privés)"]
[]
[null,null,"TOTAL GROUPE III",{"$f":"SUM(D56:D66)+SUM(D69:D75)+D78+SUM(D81:D84)+SUM(D87:D104)","v":{"v":0,"d":"0.00 €"}},{"$f":"SUM(E56:E66)+SUM(E69:E75)+E78+SUM(E81:E84)+SUM(E87:E104)","v":{"v":0,"d":"0.00 €"}},{"$f":"SUM(F56:F66)+SUM(F69:F75)+F78+SUM(F81:F84)+SUM(F87:F104)","v":{"v":0,"d":"0.00 €"}}]
[]
[null,null,"TOTAL DES CHARGES",{"$f":"D34+D51+D106","v":{"v":0,"d":"0.00 €"}},{"$f":"E34+E51+E106","v":{"v":0,"d":"0.00 €"}},{"$f":"F34+F51+F106","v":{"v":0,"d":"0.00 €"}}]
[]
[null,null,"EXCEDENT PREVISIONNEL",{"$f":"IF(D194<D108,0,D194-D108)","v":{"v":0,"d":"0.00 €"}},{"$f":"IF(E194<E108,0,E194-E108)","v":{"v":0,"d":"0.00 €"}},{"$f":"IF(F194<F108,0,F194-F108)","v":{"v":0,"d":"0.00 €"}}]
[]
[null,null,"TOTAL EQUILIBRE DU COMPTE DE RESULTAT PREVISIONNEL PRINCIPAL/ANNEXE",{"$f":"D108+D110","v":{"v":0,"d":"0.00 €"}},{"$f":"E108+E110","v":{"v":0,"d":"0.00 €"}},{"$f":"F108+F110","v":{"v":0,"d":"0.00 €"}}]
[]
[null,"Présentation des produits :"]
[]
[null,null,"GROUPE I : PRODUITS DE LA TARIFICATION",{"$f":"IF(CREPASIDEN___ANNEEREF___ANN0\\_________=\"\",\"Réel N-2\",\"Réel \"&(CREPASIDEN___ANNEEREF___ANN0\\_________-2))","v":"Réel N-2"},{"$f":"IF(CREPASIDEN___ANNEEREF___ANN0\\_________=\"\",\"Anticipé ou réel N-1\",\"Anticipé ou réel \"&(CREPASIDEN___ANNEEREF___ANN0\\_________-1))","v":"Anticipé ou réel N-1"},{"$f":"IF(CREPASIDEN___ANNEEREF___ANN0\\_________=\"\",\"Exercice N\",\"Exercice \"&CREPASIDEN___ANNEEREF___ANN0\\_________)","v":"Exercice N"}]
[]
[]
[null,731,"Produits à la charge de l’assurance maladie (hors EHPAD) (autres que c/731224 et c/7312132)"]
[null,"731224/7312132","Prise en charge au titre des dispositions de l'article L.242-4 du CASF"]
[null,732,"Produits à la charge de l’Etat"]
[null,733,"Produits à la charge du département (hors EHPAD) (autres que c/733222)"]
[null,733222,"Prise en charge au titre des dispositions de l'article L.242-4 du CASF"]
[null,734,"Produits à la charge de l’usager (hors EHPAD)"]
[null,7351,"Produits des EHPAD à la charge de l'assurance maladie"]
[null,7352,"Produits des EHPAD à la charge du département"]
[null,7353,"Produits des EHPAD à la charge de l'usager"]
[null,7358,"Produits des EHPAD à la charge d'autres financeurs"]
[null,738,"Produits à la charge d’autres financeurs"]
[]
[null,null,"TOTAL GROUPE I",{"$f":"SUM(D119:D129)","v":{"v":0,"d":"0.00 €"}},{"$f":"SUM(E119:E129)","v":{"v":0,"d":"0.00 €"}},{"$f":"SUM(F119:F129)","v":{"v":0,"d":"0.00 €"}}]
[]
[]
[null,null,"GROUPE II : AUTRES PRODUITS RELATIFS A L'EXPLOITATION",{"$f":"IF(CREPASIDEN___ANNEEREF___ANN0\\_________=\"\",\"Réel N-2\",\"Réel \"&(CREPASIDEN___ANNEEREF___ANN0\\_________-2))","v":"Réel N-2"},{"$f":"IF(CREPASIDEN___ANNEEREF___ANN0\\_________=\"\",\"Anticipé ou réel N-1\",\"Anticipé ou réel \"&(CREPASIDEN___ANNEEREF___ANN0\\_________-1))","v":"Anticipé ou réel N-1"},{"$f":"IF(CREPASIDEN___ANNEEREF___ANN0\\_________=\"\",\"Exercice N\",\"Exercice \"&CREPASIDEN___ANNEEREF___ANN0\\_________)","v":"Exercice N"}]
[]
[]
[null,70,"Produits (autres que forfaits journaliers et participations ci-dessous : c/70821, 70822 et 70823)"]
[null,70821,"Forfaits journaliers"]
[null,70822,"Participations des personnes handicapées prévues au 4° alinéa de l'article L. 242-4 du CASF"]
[null,70823,"Participations aux frais de repas et de transport dans les ESAT"]
[null,71,"Production stockée"]
[null,72,"Production immobilisée"]
[null,74,"Subventions et participations (sauf c/747)"]
[null,747,"Quotes-parts des subventions d’investissement virées au résultat de l’exercice "]
[null,75,"Autres produits de gestion courante (sauf c/757)"]
[null,757,"Produits des cessions d'immobilisations incorporelles et corporelles"]
[null,603,"Variation des stocks (en recettes)"]
[null,609,"Rabais, remises et ristournes obtenus sur achats "]
[null,619,"Rabais, remises et ristournes obtenus sur services extérieurs"]
[null,629,"Rabais, remises et ristournes obtenus sur autres services extérieurs"]
[null,6419,"Remboursements sur rémunérations du personnel non médical"]
[null,6429,"Remboursements sur rémunérations du personnel médical"]
[null,6439,"Remboursements sur rémunérations des personnes handicapées"]
[null,"6459/ 69/79","Remboursements sur charges de sécurité sociale et de prévoyance et sur autres charges sociales"]
[null,6489,"Fonds de compensation des cessations anticipées d'activité"]
[null,6611,"Intérêts des emprunts et dettes - en recettes - (hors ESSMS publics)"]
[]
[null,null,"TOTAL GROUPE II",{"$f":"SUM(D137:D156)","v":{"v":0,"d":"0.00 €"}},{"$f":"SUM(E137:E156)","v":{"v":0,"d":"0.00 €"}},{"$f":"SUM(F137:F156)","v":{"v":0,"d":"0.00 €"}}]
[]
[]
[null,null,"GROUPE III : PRODUITS FINANCIERS, PRODUITS EXCEPTIONNELS ET PRODUITS NON ENCAISSABLES ",{"$f":"IF(CREPASIDEN___ANNEEREF___ANN0\\_________=\"\",\"Réel N-2\",\"Réel \"&(CREPASIDEN___ANNEEREF___ANN0\\_________-2))","v":"Réel N-2"},{"$f":"IF(CREPASIDEN___ANNEEREF___ANN0\\_________=\"\",\"Anticipé ou réel N-1\",\"Anticipé ou réel \"&(CREPASIDEN___ANNEEREF___ANN0\\_________-1))","v":"Anticipé ou réel N-1"},{"$f":"IF(CREPASIDEN___ANNEEREF___ANN0\\_________=\"\",\"Exercice N\",\"Exercice \"&CREPASIDEN___ANNEEREF___ANN0\\_________)","v":"Exercice N"}]
[]
[]
[null,76,"Produits financiers"]
[]
[null,"PRODUITS EXCEPTIONNELS "]
[null,771,"Produits exceptionnels sur opérations de gestion"]
[null,773,"Mandats annulés (sur exercices antérieurs) ou atteints par la déchéance quadriennale (ESSMS publics)"]
[null,775,"Produits des cessions d'éléments d'actif (ESSMS publics)"]
[null,777,"Quote-part des subventions d'investissement virée au résultat de l'exercice (ESSMS publics)"]
[null,778,"Autres produits exceptionnels"]
[]
[]
[null,"AUTRES PRODUITS"]
[null,7811,"Reprises sur amortissements des immobilisations incorporelles et corporelles"]
[null,7815,"Reprises sur provisions d'exploitation"]
[null,7816,"Reprises sur dépréciations des immobilisations incorporelles et corporelles"]
[null,7817,"Reprises sur dépréciations des actifs circulants"]
[null,786,"Reprises sur dépréciations et provisions (à inscrire dans les produits financiers)"]
[null,78725,"Reprises sur amortissements dérogatoires"]
[null,78741,"Reprises sur provisions réglementées destinées à renforcer la couverture du besoin en fonds de roulement"]
[null,78742,"Reprises sur provisions réglementées pour renouvellement des immobilisations"]
[null,78746,"Reprises sur provisions réglementées : réserves des plus-values nettes d'actif (ESSMS privés)"]
[null,78748,"Autres reprises sur provisions réglementées"]
[null,"7875/7876","Reprises sur provisions et dépréciations exceptionnelles"]
[null,789,"Utilisation de fonds dédiés et de fonds reportés (sauf c/78921, 78922, 7895) (ESSMS privés)"]
[null,78921,"Utilisation des fonds dédiés à l'investissement sur concours publics des entités gestionnaires d'ESSMS"]
[null,78922,"Utilisation des fonds dédiés à l'exploitation sur concours publics des entités gestionnaires d'ESSMS (ESSMS privés)"]
[null,7895,"Utilisation des fonds dédiés sur ressources financières d'autres financeurs (ESSMS privés)"]
[null,79,"Transferts de charges"]
[]
[null,null,"TOTAL GROUPE III",{"$f":"D164+SUM(D167:D172)+SUM(D175:D190)","v":{"v":0,"d":"0.00 €"}},{"$f":"E164+SUM(E167:E172)+SUM(E175:E190)","v":{"v":0,"d":"0.00 €"}},{"$f":"F164+SUM(F167:F172)+SUM(F175:F190)","v":{"v":0,"d":"0.00 €"}}]
[]
[null,null,"TOTAL DES PRODUITS",{"$f":"D131+D158+D192","v":{"v":0,"d":"0.00 €"}},{"$f":"E131+E158+E192","v":{"v":0,"d":"0.00 €"}},{"$f":"F131+F158+F192","v":{"v":0,"d":"0.00 €"}}]
[]
[null,null,"DEFICIT PREVISIONNEL",{"$f":"IF(D194>D108,0,D108-D194)","v":{"v":0,"d":"0.00 €"}},{"$f":"IF(E194>E108,0,E108-E194)","v":{"v":0,"d":"0.00 €"}},{"$f":"IF(F194>F108,0,F108-F194)","v":{"v":0,"d":"0.00 €"}}]
[]
[null,null,"TOTAL EQUILIBRE DU COMPTE DE RESULTAT PREVISIONNEL PRINCIPAL/ANNEXE",{"$f":"D194+D196","v":{"v":0,"d":"0.00 €"}},{"$f":"E194+E196","v":{"v":0,"d":"0.00 €"}},{"$f":"F194+F196","v":{"v":0,"d":"0.00 €"}}]
[]
[null,null,"Résultats antérieurs repris dans le cadre de la tarification (déficits)"]
[null,null,"Résultats antérieurs repris dans le cadre de la tarification (excédents)"]
[]
[]
[null,null,"Ratios",{"$f":"IF(CREPASIDEN___ANNEEREF___ANN0\\_________=\"\",\"Réel N-2\",\"Réel \"&(CREPASIDEN___ANNEEREF___ANN0\\_________-2))","v":"Réel N-2"},{"$f":"IF(CREPASIDEN___ANNEEREF___ANN0\\_________=\"\",\"Anticipé ou réel N-1\",\"Anticipé ou réel \"&(CREPASIDEN___ANNEEREF___ANN0\\_________-1))","v":"Anticipé ou réel N-1"},{"$f":"IF(CREPASIDEN___ANNEEREF___ANN0\\_________=\"\",\"Exercice N\",\"Exercice \"&CREPASIDEN___ANNEEREF___ANN0\\_________)","v":"Exercice N"}]
[null,null,"Marge brute d'exploitation",{"$f":"D131+D158-D34-D51-SUM(D56:D66)-SUM(D69:D75)-D156","v":{"v":0,"d":"0.00 €"}},{"$f":"E131+E158-E34-E51-SUM(E56:E66)-SUM(E69:E75)-E156","v":{"v":0,"d":"0.00 €"}},{"$f":"F131+F158-F34-F51-SUM(F56:F66)-SUM(F69:F75)-F156","v":{"v":0,"d":"0.00 €"}}]
[null,null,"Produits courants d'exploitation (Comptes 70 à 75 - c/709 et 713)",{"$f":"D131+SUM(D137:D146)-D15-D16","v":{"v":0,"d":"0.00 €"}},{"$f":"E131+SUM(E137:E146)-E15-E16","v":{"v":0,"d":"0.00 €"}},{"$f":"F131+SUM(F137:F146)-F15-F16","v":{"v":0,"d":"0.00 €"}}]
[null,null,"Taux de marge brute",{"$f":"IFERROR(D205/D206,0)","v":{"v":0,"d":"0.00%"}},{"$f":"IFERROR(E205/E206,0)","v":{"v":0,"d":"0.00%"}},{"$f":"IFERROR(F205/F206,0)","v":{"v":0,"d":"0.00%"}}]
[null,null,"Résultat net",{"$f":"D110-D196","v":{"v":0,"d":"0.00 €"}},{"$f":"E110-E196","v":{"v":0,"d":"0.00 €"}},{"$f":"F110-F196","v":{"v":0,"d":"0.00 €"}}]
[null,null,"Produits comptes classe 7 - c/709 et 713",{"$f":"D194-SUM(D15:D16)-SUM(D147:D156)","v":{"v":0,"d":"0.00 €"}},{"$f":"E194-SUM(E15:E16)-SUM(E147:E156)","v":{"v":0,"d":"0.00 €"}},{"$f":"F194-SUM(F15:F16)-SUM(F147:F156)","v":{"v":0,"d":"0.00 €"}}]
[null,null,"Taux de résultat ",{"$f":"IFERROR(D208/D209,0)","v":{"v":0,"d":"0.00%"}},{"$f":"IFERROR(E208/E209,0)","v":{"v":0,"d":"0.00%"}},{"$f":"IFERROR(F208/F209,0)","v":{"v":0,"d":"0.00%"}}]
[]
[]
[null,"Nota : Les CRPA relevant de l'article R. 314-74 du CASF (dotations non affectées et services industriels et commerciaux des établissements publics sociaux et médico-sociaux autonomes) ne peuvent être présentés qu'en équilibre ou en excédent."]

{"sheet":"CRPP SOUMIS EQUILIBRE","index":10,"n_rows":204,"n_cols":6,"rows_kept":204,"hidden":true,"merged":[[1,1,1,2],[1,3,1,5],[2,1,2,2],[2,3,2,5],[5,1,5,5],[8,3,9,3],[8,4,9,4],[8,5,9,5],[8,12,8,17],[35,3,36,3],[35,4,36,4],[35,5,36,5],[54,3,55,3],[54,4,55,4],[54,5,55,5],[117,3,118,3],[117,4,118,4],[117,5,118,5],[130,2,131,2],[130,3,131,3],[130,4,131,4],[130,5,131,5],[156,3,157,3],[156,4,157,4],[156,5,157,5]]}
[]
[null,"Raison sociale :"]
[null,"FINESS ET :"]
[]
[]
[null,"Compte de résultat prévisionnel principal/annexe soumis à l'obligation d'équilibre"]
[]
[null,"Présentation des charges :"]
[{"$nulls":3},{"$f":"IF(CREPASIDEN___ANNEEREF___ANN0\\_________=\"\",\"Réel N-2\",\"Réel \"&(CREPASIDEN___ANNEEREF___ANN0\\_________-2))","v":"Réel N-2"},{"$f":"IF(CREPASIDEN___ANNEEREF___ANN0\\_________=\"\",\"Anticipé ou réel N-1 (1)\",\"Anticipé ou réel \"&(CREPASIDEN___ANNEEREF___ANN0\\_________-1)&\" (1)\")","v":"Anticipé ou réel N-1 (1)"},{"$f":"IF(CREPASIDEN___ANNEEREF___ANN0\\_________=\"\",\"Exercice N\",\"Exercice \"&CREPASIDEN___ANNEEREF___ANN0\\_________)","v":"Exercice N"}]
[null,null,"GROUPE I : CHARGES AFFERENTES A L'EXPLOITATION COURANTE"]
[null,"ACHATS"]
[null,"601/602/603","Achats stockés et variation des stocks"]
[null,606,"Achats non stockés de matières et fournitures"]
[null,607,"Achats de marchandises"]
[null,709,"Rabais, remises, ristournes accordés par l'établissement"]
[null,713,"Variation des stocks, en cours de production, produits (en dépenses)"]
[]
[null,"SERVICES EXTERIEURS"]
[null,6111,"Sous-traitance: prestations à caractère médical"]
[null,6112,"Sous-traitance: prestations à caractère médico-social"]
[null,6118,"Sous-traitance: autres prestations de service"]
[null," "," "]
[null,"AUTRES SERVICES EXTERIEURS "]
[null,624,"Transports de biens, d'usagers et transports collectifs du personnel (autres que c/6242)"]
[null,6242,"Transports d'usagers"]
[null,625,"Déplacements, missions et réceptions"]
[null,626,"Frais postaux et frais de télécommunications"]
[null,6281,"Prestations de blanchissage à l'extérieur"]
[null,6282,"Prestations d'alimentation à l'extérieur"]
[null,6283,"Prestations de nettoyage à l'extérieur"]
[null,6284,"Prestations d'informatique à l'extérieur"]
[null,"6287/ 6288","Divers - Remboursements de frais et autres"]
[]
[null,null,"TOTAL GROUPE I",{"$f":"SUM(D12:D16)+SUM(D19:D21)+SUM(D24:D32)","v":{"v":0,"d":"0.00 €"}},{"$f":"SUM(E12:E16)+SUM(E19:E21)+SUM(E24:E32)","v":{"v":0,"d":"0.00 €"}},{"$f":"SUM(F12:F16)+SUM(F19:F21)+SUM(F24:F32)","v":{"v":0,"d":"0.00 €"}}]
[]
[null,null,"GROUPE II : CHARGES AFFERENTES AU PERSONNEL",{"$f":"IF(CREPASIDEN___ANNEEREF___ANN0\\_________=\"\",\"Réel N-2\",\"Réel \"&(CREPASIDEN___ANNEEREF___ANN0\\_________-2))","v":"Réel N-2"},{"$f":"IF(CREPASIDEN___ANNEEREF___ANN0\\_________=\"\",\"Anticipé ou réel N-1\",\"Anticipé ou réel \"&(CREPASIDEN___ANNEEREF___ANN0\\_________-1))","v":"Anticipé ou réel N-1"},{"$f":"IF(CREPASIDEN___ANNEEREF___ANN0\\_________=\"\",\"Exercice N\",\"Exercice \"&CREPASIDEN___ANNEEREF___ANN0\\_________)","v":"Exercice N"}]
[]
[]
[null,621,"Personnel extérieur à l'établissement"]
[null,622,"Rémunérations d'intermédiaires et honoraires"]
[null,631,"Impôts, taxes et versements assimilés sur rémunérations (administration des impôts)"]
[null,633,"Impôts, taxes et versements assimilés sur rémunérations (autres organismes)"]
[null,641,"Rémunérations du personnel non médical"]
[null,642,"Rémunérations du personnel médical"]
[null,643,"Rémunération du personnel handicapé"]
[null,645,"Cotisations de sécurité sociale et de prévoyance "]
[null,646,"Personnes handicapées"]
[null,647,"Autres charges sociales"]
[null,648,"Autres charges de personnel"]
[]
[null,null,"TOTAL GROUPE II",{"$f":"SUM(D39:D49)","v":{"v":0,"d":"0.00 €"}},{"$f":"SUM(E39:E49)","v":{"v":0,"d":"0.00 €"}},{"$f":"SUM(F39:F49)","v":{"v":0,"d":"0.00 €"}}]
[null,null,"(1): Anticipé pour les EPRD établis avant la clôture de l'exercice N-1."]
[]
[]
[null,null,"GROUPE III : CHARGES AFFERENTES A LA STRUCTURE ",{"$f":"IF(CREPASIDEN___ANNEEREF___ANN0\\_________=\"\",\"Réel N-2\",\"Réel \"&(CREPASIDEN___ANNEEREF___ANN0\\_________-2))","v":"Réel N-2"},{"$f":"IF(CREPASIDEN___ANNEEREF___ANN0\\_________=\"\",\"Anticipé ou réel N-1\",\"Anticipé ou réel \"&(CREPASIDEN___ANNEEREF___ANN0\\_________-1))","v":"Anticipé ou réel N-1"},{"$f":"IF(CREPASIDEN___ANNEEREF___ANN0\\_________=\"\",\"Exercice N\",\"Exercice \"&CREPASIDEN___ANNEEREF___ANN0\\_________)","v":"Exercice N"}]
[]
[]
[null,612,"Redevances de crédit-bail"]
[null,613,"Locations"]
[null,614,"Charges locatives et de copropriété"]
[null,615,"Entretien et réparations"]
[null,616,"Primes d'assurances"]
[null,617,"Etudes et recherches"]
[null,618,"Divers"]
[null,623,"Information, publications, relations publiques"]
[null,627,"Services bancaires et assimilés"]
[null,635,"Autres impôts taxes et versements assimilés (administration des impôts) "]
[null,"637/638","Autres impôts, taxes et versements assimilés (autres organismes) et rappel d'impôts (autres qu'impôts sur les bénéfices)"]
[]
[null,"AUTRES CHARGES DE GESTION COURANTE"]
[null,651,"Redevances pour concessions, brevets, licences, procédés, droits et valeurs similaires"]
[null,652,"Valeur comptable des immobilisations incorporelles et corporelles cédées"]
[null,653,"Contribution versée au groupement hospitalier de territoire "]
[null,654,"Pertes sur créances irrécouvrables"]
[null,655,"Quotes-parts de résultat sur opérations faites en commun"]
[null,657,"Subventions"]
[null,658,"Charges diverses de gestion courante"]
[]
[null,"CHARGES FINANCIERES"]
[null,66,"Charges financières"]
[]
[null,"CHARGES EXCEPTIONNELLES"]
[null,671,"Charges exceptionnelles sur opérations de gestion"]
[null,673,"Titres annulés (sur exercices antérieurs) (ESSMS publics)"]
[null,675,"Valeurs comptables des éléments d'actif cédés (ESSMS publics)"]
[null,678,"Autres charges exceptionnelles"]
[]
[null,"DOTATIONS AUX AMORTISSEMENTS, AUX DEPRECIATIONS, AUX PROVISIONS ET ENGAGEMENTS"]
[null,6811,"Dotations aux amortissements des immobilisations incorporelles et corporelles"]
[null,6812,"Dotations aux amortissements des charges d'exploitation à répartir"]
[null,6815,"Dotations aux provisions des charges d'exploitation"]
[null,6816,"Dotations aux dépréciations des immobilisations incorporelles et corporelles"]
[null,6817,"Dotations aux dépréciations des actifs circulants"]
[null,686,"Dotations aux amortissements, dépréciations et provisions : charges financières"]
[null,6871,"Dotations aux amortissements exceptionnels des immobilisations"]
[null,68725,"Dotations aux amortissements dérogatoires"]
[null,68741,"Dotations aux provisions réglementées destinées à renforcer la couverture du BFR"]
[null,68742,"Dotations aux provisions réglementées pour renouvellement des immobilisations"]
[null,68746,"Dotations aux provisions réglementées : réserves des plus-values nettes d'actif (ESSMS privés)"]
[null,68748,"Autres dotations aux provisions réglementées"]
[null,6875,"Dotations aux provisions exceptionnelles"]
[null,6876,"Dotations aux dépréciations exceptionnelles"]
[null,689,"Reports en fonds dédiés (sauf c/6892 et c/6895) (ESSMS privés)"]
[null,68921,"Reports en fonds dédiés à l'investissement sur concours publics des entités gestionnaires d'ESSMS (ESSMS privés)"]
[null,68922,"Reports en fonds dédiés à l'exploitation sur concours publics des entités gestionnaires d'ESSMS (ESSMS privés)"]
[null,6895,"Reports en fonds dédiés sur contribution financière d'autres organismes (ESSMS privés)"]
[]
[null,null,"TOTAL GROUPE III",{"$f":"SUM(D58:D68)+SUM(D71:D77)+D80+SUM(D83:D86)+SUM(D89:D106)","v":{"v":0,"d":"0.00 €"}},{"$f":"SUM(E58:E68)+SUM(E71:E77)+E80+SUM(E83:E86)+SUM(E89:E106)","v":{"v":0,"d":"0.00 €"}},{"$f":"SUM(F58:F68)+SUM(F71:F77)+F80+SUM(F83:F86)+SUM(F89:F106)","v":{"v":0,"d":"0.00 €"}}]
[]
[null,null,"TOTAL DES CHARGES (GROUPE I + GROUPE II + GROUPE III)",{"$f":"D34+D51+D108","v":{"v":0,"d":"0.00 €"}},{"$f":"E34+E51+E108","v":{"v":0,"d":"0.00 €"}},{"$f":"F34+F51+F108","v":{"v":0,"d":"0.00 €"}}]
[]
[null,"002","Déficit antérieur du CRP reporté"]
[null,"005","Amortissements comptables excédentaires différés"]
[]
[null,null,"TOTAL GENERAL",{"$f":"D110+D112+D113","v":{"v":0,"d":"0.00 €"}},{"$f":"E110+E112+E113","v":{"v":0,"d":"0.00 €"}},{"$f":"F110+F112+F113","v":{"v":0,"d":"0.00 €"}}]
[]
[null,"Présentation des produits :"]
[{"$nulls":3},{"$f":"IF(CREPASIDEN___ANNEEREF___ANN0\\_________=\"\",\"Réel N-2\",\"Réel \"&(CREPASIDEN___ANNEEREF___ANN0\\_________-2))","v":"Réel N-2"},{"$f":"IF(CREPASIDEN___ANNEEREF___ANN0\\_________=\"\",\"Anticipé ou réel N-1\",\"Anticipé ou réel \"&(CREPASIDEN___ANNEEREF___ANN0\\_________-1))","v":"Anticipé ou réel N-1"},{"$f":"IF(CREPASIDEN___ANNEEREF___ANN0\\_________=\"\",\"Exercice N\",\"Exercice \"&CREPASIDEN___ANNEEREF___ANN0\\_________)","v":"Exercice N"}]
[null,null,"GROUPE I : PRODUITS DE LA TARIFICATION"]
[]
[null,731,"Produits à la charge de l’assurance maladie (hors EHPAD) (autres que c/731224 et c/7312132)"]
[null,"731224 / 7312132"," Prise en charge au titre des dispositions de l'article L.242-4 du CASF"]
[null,732,"Produits à la charge de l’Etat"]
[null,733,"Produits à la charge du département (hors EHPAD) (autres que c/733222)"]
[null,733222,"Prise en charge au titre des dispositions de l'article L.242-4 du CASF"]
[null,734,"Produits à la charge de l’usager (hors EHPAD)"]
[null,738,"Produits à la charge d’autres financeurs"]
[]
[null,null,"TOTAL GROUPE I",{"$f":"SUM(D121:D127)","v":{"v":0,"d":"0.00 €"}},{"$f":"SUM(E121:E127)","v":{"v":0,"d":"0.00 €"}},{"$f":"SUM(F121:F127)","v":{"v":0,"d":"0.00 €"}}]
[]
[null,null,"GROUPE II : AUTRES PRODUITS RELATIFS A L'EXPLOITATION",{"$f":"IF(CREPASIDEN___ANNEEREF___ANN0\\_________=\"\",\"Réel N-2\",\"Réel \"&(CREPASIDEN___ANNEEREF___ANN0\\_________-2))","v":"Réel N-2"},{"$f":"IF(CREPASIDEN___ANNEEREF___ANN0\\_________=\"\",\"Anticipé ou réel N-1\",\"Anticipé ou réel \"&(CREPASIDEN___ANNEEREF___ANN0\\_________-1))","v":"Anticipé ou réel N-1"},{"$f":"IF(CREPASIDEN___ANNEEREF___ANN0\\_________=\"\",\"Exercice N\",\"Exercice \"&CREPASIDEN___ANNEEREF___ANN0\\_________)","v":"Exercice N"}]
[]
[]
[null,70,"Produits (autres que forfaits journaliers et participations ci-dessous:  c/70821, 70822 et 70823)"]
[null,70821,"Forfaits journaliers"]
[null,70822,"Participations des personnes handicapées prévues au 4° alinéa de l'article L. 242-4 du CASF"]
[null,70823,"Participations aux frais de repas et de transport dans les ESAT"]
[null,71,"Production stockée"]
[null,72,"Production immobilisée"]
[null,74,"Subventions et participations (sauf c/747)"]
[null,747,"Quotes-parts des subventions d’investissement virées au résultat de l’exercice "]
[null,75,"Autres produits de gestion courante (sauf c/757)"]
[null,757,"Produits des cessions d'immobilisations incorporelles et corporelles"]
[null,603,"Variation des stocks (en recettes)"]
[null,609,"Rabais, remises et ristournes obtenus sur achats "]
[null,619,"Rabais, remises et ristournes obtenus sur services extérieurs"]
[null,629,"Rabais, remises et ristournes obtenus sur autres services extérieurs"]
[null,6419,"Remboursements sur rémunérations du personnel non médical"]
[null,6429,"Remboursements sur rémunérations du personnel médical"]
[null,6439,"Remboursements sur rémunérations des personnes handicapées"]
[null,"6459/ 69/79","Remboursements sur charges de sécurité sociale et de prévoyance et sur autres charges sociales"]
[null,6489,"Fonds de compensation des cessations anticipées d'activité"]
[null,6611,"Intérêts des emprunts et dettes - en recettes - (hors ESSMS publics)"]
[]
[null,null,"TOTAL GROUPE II",{"$f":"SUM(D134:D153)","v":{"v":0,"d":"0.00 €"}},{"$f":"SUM(E134:E153)","v":{"v":0,"d":"0.00 €"}},{"$f":"SUM(F134:F153)","v":{"v":0,"d":"0.00 €"}}]
[]
[null,null,"GROUPE III : PRODUITS FINANCIERS, PRODUITS EXCEPTIONNELS ET PRODUITS NON ENCAISSABLES ",{"$f":"IF(CREPASIDEN___ANNEEREF___ANN0\\_________=\"\",\"Réel N-2\",\"Réel \"&(CREPASIDEN___ANNEEREF___ANN0\\_________-2))","v":"Réel N-2"},{"$f":"IF(CREPASIDEN___ANNEEREF___ANN0\\_________=\"\",\"Anticipé ou réel N-1\",\"Anticipé ou réel \"&(CREPASIDEN___ANNEEREF___ANN0\\_________-1))","v":"Anticipé ou réel N-1"},{"$f":"IF(CREPASIDEN___ANNEEREF___ANN0\\_________=\"\",\"Exercice N\",\"Exercice \"&CREPASIDEN___ANNEEREF___ANN0\\_________)","v":"Exercice N"}]
[]
[]
[null,76,"Produits financiers"]
[]
[null,"PRODUITS EXCEPTIONNELS "]
[null,771,"Produits exceptionnels sur opérations de gestion"]
[null,773,"Mandats annulés (sur exercices antérieurs) ou atteints par la déchéance quadriennale (ESSMS publics)"]
[null,775,"Produits des cessions d'éléments d'actif (ESSMS publics)"]
[null,777,"Quote-part des subventions d'investissement virée au résultat de l'exercice (ESSMS publics)"]
[null,778,"Autres produits exceptionnels"]
[]
[]
[null,"AUTRES PRODUITS"]
[null,7811,"Reprises sur amortissements des immobilisations incorporelles et corporelles"]
[null,7815,"Reprises sur provisions d'exploitation"]
[null,7816,"Reprises sur dépréciations des immobilisations incorporelles et corporelles"]
[null,7817,"Reprises sur dépréciations des actifs circulants"]
[null,786,"Reprises sur dépréciations et provisions (à inscrire dans les produits financiers)"]
[null,78725,"Reprises sur amortissements dérogatoires"]
[null,78741,"Reprises sur provisions réglementées destinées à renforcer la couverture du besoin en fonds de roulement"]
[null,78742,"Reprises sur provisions réglementées pour renouvellement des immobilisations"]
[null,78746,"Reprises sur provisions réglementées : réserves des plus-values nettes d'actif (ESSMS privés)"]
[null,78748,"Autres reprises sur provisions réglementées"]
[null,"7875/7876","Reprises sur provisions et dépréciations exceptionnelles"]
[null,789,"Utilisation de fonds dédiés et de fonds reportés (sauf c/78921, 78922, 7895) (ESSMS privés)"]
[null,78921,"Reports en fonds dédiés à l'investissement sur concours publics des entités gestionnaires d'ESSMS (ESSMS privés)"]
[null,78922,"Utilisation des fonds dédiés à l'exploitation sur concours publics des entités gestionnaires d'ESSMS (ESSMS privés)"]
[null,7895,"Utilisation des fonds dédiés sur ressources financières d'autres financeurs (ESSMS privés)"]
[null,79,"Transferts de charges"]
[]
[null,null,"TOTAL GROUPE III",{"$f":"D160+SUM(D163:D168)+SUM(D171:D186)","v":{"v":0,"d":"0.00 €"}},{"$f":"E160+SUM(E163:E168)+SUM(E171:E186)","v":{"v":0,"d":"0.00 €"}},{"$f":"F160+SUM(F163:F168)+SUM(F171:F186)","v":{"v":0,"d":"0.00 €"}}]
[]
[null,null,"TOTAL DES PRODUITS (GROUPE I + GROUPE II + GROUPE III)",{"$f":"D129+D155+D188","v":{"v":0,"d":"0.00 €"}},{"$f":"E129+E155+E188","v":{"v":0,"d":"0.00 €"}},{"$f":"F129+F155+F188","v":{"v":0,"d":"0.00 €"}}]
[]
[null,"002","Excédent antérieur du CRP reporté"]
[null,"005","Amortissements comptables excédentaires différés"]
[]
[null,null,"TOTAL GENERAL",{"$f":"D190+D192+D193","v":{"v":0,"d":"0.00 €"}},{"$f":"E190+E192+E193","v":{"v":0,"d":"0.00 €"}},{"$f":"F190+F192+F193","v":{"v":0,"d":"0.00 €"}}]
[]
[]
[null,null,"Ratios",{"$f":"IF(CREPASIDEN___ANNEEREF___ANN0\\_________=\"\",\"Réel N-2\",\"Réel \"&(CREPASIDEN___ANNEEREF___ANN0\\_________-2))","v":"Réel N-2"},{"$f":"IF(CREPASIDEN___ANNEEREF___ANN0\\_________=\"\",\"Anticipé ou réel N-1\",\"Anticipé ou réel \"&(CREPASIDEN___ANNEEREF___ANN0\\_________-1))","v":"Anticipé ou réel N-1"},{"$f":"IF(CREPASIDEN___ANNEEREF___ANN0\\_________=\"\",\"Exercice N\",\"Exercice \"&CREPASIDEN___ANNEEREF___ANN0\\_________)","v":"Exercice N"}]
[null,null,"Marge brute d'exploitation",{"$f":"D129+D155-D34-D51-SUM(D58:D68)-SUM(D71:D77)-D153","v":{"v":0,"d":"0.00 €"}},{"$f":"E129+E155-E34-E51-SUM(E58:E68)-SUM(E71:E77)-E153","v":{"v":0,"d":"0.00 €"}},{"$f":"F129+F155-F34-F51-SUM(F58:F68)-SUM(F71:F77)-F153","v":{"v":0,"d":"0.00 €"}}]
[null,null,"Produits courants d'exploitation (Comptes 70 à 75 - c/709 et 713)",{"$f":"D129+SUM(D134:D143)-D15-D16","v":{"v":0,"d":"0.00 €"}},{"$f":"E129+SUM(E134:E143)-E15-E16","v":{"v":0,"d":"0.00 €"}},{"$f":"F129+SUM(F134:F143)-F15-F16","v":{"v":0,"d":"0.00 €"}}]
[null,null,"Taux de marge brute",{"$f":"IFERROR(D199/D200,0)","v":{"v":0,"d":"0.00%"}},{"$f":"IFERROR(E199/E200,0)","v":{"v":0,"d":"0.00%"}},{"$f":"IFERROR(F199/F200,0)","v":{"v":0,"d":"0.00%"}}]
[null,null,"Résultat net",{"$f":"D190-D110","v":{"v":0,"d":"0.00 €"}},{"$f":"E190-E110","v":{"v":0,"d":"0.00 €"}},{"$f":"F190-F110","v":{"v":0,"d":"0.00 €"}}]
[null,null,"Produits comptes classe 7 - c/709 et 713",{"$f":"D190-SUM(D15:D16)-SUM(D144:D153)","v":{"v":0,"d":"0.00 €"}},{"$f":"E190-SUM(E15:E16)-SUM(E144:E153)","v":{"v":0,"d":"0.00 €"}},{"$f":"F190-SUM(F15:F16)-SUM(F144:F153)","v":{"v":0,"d":"0.00 €"}}]
[null,null,"Taux de résultat ",{"$f":"IFERROR(D202/D203,0)","v":{"v":0,"d":"0.00%"}},{"$f":"IFERROR(E202/E203,0)","v":{"v":0,"d":"0.00%"}},{"$f":"IFERROR(F202/F203,0)","v":{"v":0,"d":"0.00%"}}]

{"sheet":"CRP_SF","index":11,"n_rows":213,"n_cols":6,"rows_kept":213,"hidden":true,"merged":[[1,1,1,2],[1,3,1,5],[2,1,2,2],[2,3,2,5],[3,1,3,2],[3,3,3,5],[5,1,5,5],[8,3,9,3],[8,4,9,4],[8,5,9,5],[8,8,8,13],[35,3,36,3],[35,4,36,4],[35,5,36,5],[52,3,53,3],[52,4,53,4],[52,5,53,5],[115,3,116,3],[115,4,116,4],[115,5,116,5],[133,2,134,2],[133,3,134,3],[133,4,134,4],[133,5,134,5],[160,3,161,3],[160,4,161,4],[160,5,161,5],[212,1,212,5]]}
[]
[null,"Dénomination du CRP sans FINESS : "]
[null,"N° Identifiant : "]
[null,"FINESS ET de rattachement :"]
[]
[null,"Compte de résultat prévisionnel annexe - CRPA Activité sans FINESS"]
[]
[null,"Présentation des charges :"]
[{"$nulls":3},{"$f":"IF(CREPASIDEN___ANNEEREF___ANN0\\_________=\"\",\"Réel N-2\",\"Réel \"&(CREPASIDEN___ANNEEREF___ANN0\\_________-2))","v":"Réel N-2"},{"$f":"IF(CREPASIDEN___ANNEEREF___ANN0\\_________=\"\",\"Anticipé ou réel N-1 (1)\",\"Anticipé ou réel \"&(CREPASIDEN___ANNEEREF___ANN0\\_________-1)&\" (1)\")","v":"Anticipé ou réel N-1 (1)"},{"$f":"IF(CREPASIDEN___ANNEEREF___ANN0\\_________=\"\",\"Exercice N\",\"Exercice \"&CREPASIDEN___ANNEEREF___ANN0\\_________)","v":"Exercice N"}]
[null,null,"GROUPE I : CHARGES AFFERENTES A L'EXPLOITATION COURANTE"]
[null,"ACHATS"]
[null,"601/602/603","Achats stockés et variation des stocks"]
[null,606,"Achats non stockés de matières et fournitures"]
[null,607,"Achats de marchandises"]
[null,709,"Rabais, remises, ristournes accordés par l'établissement"]
[null,713,"Variation des stocks, en cours de production, produits (en dépenses)"]
[]
[null,"SERVICES EXTERIEURS"]
[null,6111,"Sous-traitance: prestations à caractère médical"]
[null,6112,"Sous-traitance: prestations à caractère médico-social"]
[null,6118,"Sous-traitance: autres prestations de service"]
[null," "," "]
[null,"AUTRES SERVICES EXTERIEURS "]
[null,624,"Transports de biens, d'usagers et transports collectifs du personnel (autres que c/6242)"]
[null,6242,"Transports d'usagers"]
[null,625,"Déplacements, missions et réceptions"]
[null,626,"Frais postaux et frais de télécommunications"]
[null,6281,"Prestations de blanchissage à l'extérieur"]
[null,6282,"Prestations d'alimentation à l'extérieur"]
[null,6283,"Prestations de nettoyage à l'extérieur"]
[null,6284,"Prestations d'informatique à l'extérieur"]
[null,"6287/6288","Divers - Remboursements de frais et autres"]
[]
[null,null,"TOTAL GROUPE I",{"$f":"SUM(D12:D16)+SUM(D19:D21)+SUM(D24:D32)","v":{"v":0,"d":"0.00 €"}},{"$f":"SUM(E12:E16)+SUM(E19:E21)+SUM(E24:E32)","v":{"v":0,"d":"0.00 €"}},{"$f":"SUM(F12:F16)+SUM(F19:F21)+SUM(F24:F32)","v":{"v":0,"d":"0.00 €"}}]
[]
[{"$nulls":3},{"$f":"IF(CREPASIDEN___ANNEEREF___ANN0\\_________=\"\",\"Réel N-2\",\"Réel \"&(CREPASIDEN___ANNEEREF___ANN0\\_________-2))","v":"Réel N-2"},{"$f":"IF(CREPASIDEN___ANNEEREF___ANN0\\_________=\"\",\"Anticipé ou réel N-1\",\"Anticipé ou réel \"&(CREPASIDEN___ANNEEREF___ANN0\\_________-1))","v":"Anticipé ou réel N-1"},{"$f":"IF(CREPASIDEN___ANNEEREF___ANN0\\_________=\"\",\"Exercice N\",\"Exercice \"&CREPASIDEN___ANNEEREF___ANN0\\_________)","v":"Exercice N"}]
[null,null,"GROUPE II : CHARGES AFFERENTES AU PERSONNEL"]
[]
[null,621,"Personnel extérieur à l'établissement"]
[null,622,"Rémunérations d'intermédiaires et honoraires"]
[null,631,"Impôts, taxes et versements assimilés sur rémunérations (administration des impôts)"]
[null,633,"Impôts, taxes et versements assimilés sur rémunérations (autres organismes)"]
[null,641,"Rémunérations du personnel non médical"]
[null,642,"Rémunérations du personnel médical"]
[null,643,"Rémunération du personnel handicapé"]
[null,645,"Cotisations de sécurité sociale et de prévoyance "]
[null,646,"Personnes handicapées"]
[null,647,"Autres charges sociales"]
[null,648,"Autres charges de personnel"]
[]
[null,null,"TOTAL GROUPE II",{"$f":"SUM(D39:D49)","v":{"v":0,"d":"0.00 €"}},{"$f":"SUM(E39:E49)","v":{"v":0,"d":"0.00 €"}},{"$f":"SUM(F39:F49)","v":{"v":0,"d":"0.00 €"}}]
[null,null,"(1): Anticipé pour les EPRD établis avant la clôture de l'exercice N-1."]
[{"$nulls":3},{"$f":"IF(CREPASIDEN___ANNEEREF___ANN0\\_________=\"\",\"Réel N-2\",\"Réel \"&(CREPASIDEN___ANNEEREF___ANN0\\_________-2))","v":"Réel N-2"},{"$f":"IF(CREPASIDEN___ANNEEREF___ANN0\\_________=\"\",\"Anticipé ou réel N-1\",\"Anticipé ou réel \"&(CREPASIDEN___ANNEEREF___ANN0\\_________-1))","v":"Anticipé ou réel N-1"},{"$f":"IF(CREPASIDEN___ANNEEREF___ANN0\\_________=\"\",\"Exercice N\",\"Exercice \"&CREPASIDEN___ANNEEREF___ANN0\\_________)","v":"Exercice N"}]
[null,null,"GROUPE III : CHARGES AFFERENTES A LA STRUCTURE "]
[]
[null,612,"Redevances de crédit-bail"]
[null,613,"Locations"]
[null,614,"Charges locatives et de copropriété"]
[null,615,"Entretien et réparations"]
[null,616,"Primes d'assurances"]
[null,617,"Etudes et recherches"]
[null,618,"Divers"]
[null,623,"Information, publications, relations publiques"]
[null,627,"Services bancaires et assimilés"]
[null,635,"Autres impôts taxes et versements assimilés (administration des impôts) "]
[null,"637/638","Autres impôts, taxes et versements assimilés (autres organismes) et rappel d'impôts (autres qu'impôts sur les bénéfices)"]
[]
[null,"AUTRES CHARGES DE GESTION COURANTE"]
[null,651,"Redevances pour concessions, brevets, licences, procédés, droits et valeurs similaires"]
[null,652,"Valeur comptable des immobilisations incorporelles et corporelles cédées"]
[null,653,"Contribution versée au groupement hospitalier de territoire "]
[null,654,"Pertes sur créances irrécouvrables"]
[null,655,"Quotes-parts de résultat sur opérations faites en commun"]
[null,657,"Subventions"]
[null,658,"Charges diverses de gestion courante"]
[]
[null,"CHARGES FINANCIERES"]
[null,66,"Charges financières"]
[]
[null,"CHARGES EXCEPTIONNELLES"]
[null,671,"Charges exceptionnelles sur opérations de gestion"]
[null,673,"Titres annulés (sur exercices antérieurs) (ESSMS publics)"]
[null,675,"Valeurs comptables des éléments d'actif cédés (ESSMS publics)"]
[null,678,"Autres charges exceptionnelles"]
[]
[null,"DOTATIONS AUX AMORTISSEMENTS, AUX DEPRECIATIONS, AUX PROVISIONS ET ENGAGEMENTS"]
[null,6811,"Dotations aux amortissements des immobilisations incorporelles et corporelles"]
[null,6812,"Dotations aux amortissements des charges d'exploitation à répartir"]
[null,6815,"Dotations aux provisions des charges d'exploitation"]
[null,6816,"Dotations aux dépréciations des immobilisations incorporelles et corporelles"]
[null,6817,"Dotations aux dépréciations des actifs circulants"]
[null,686,"Dotations aux amortissements, dépréciations et provisions : charges financières"]
[null,6871,"Dotations aux amortissements exceptionnels des immobilisations"]
[null,68725,"Dotations aux amortissements dérogatoires"]
[null,68741,"Dotations aux provisions réglementées destinées à renforcer la couverture du BFR"]
[null,68742,"Dotations aux provisions réglementées pour renouvellement des immobilisations"]
[null,68746,"Dotations aux provisions réglementées : réserves des plus-values nettes d'actif (ESSMS privés)"]
[null,68748,"Autres dotations aux provisions réglementées"]
[null,6875,"Dotations aux provisions exceptionnelles"]
[null,6876,"Dotations aux dépréciations exceptionnelles"]
[null,689,"Reports en fonds dédiés (sauf c/6892 et c/6895) (ESSMS privés)"]
[null,68921,"Reports en fonds dédiés à l'investissement sur concours publics des entités gestionnaires d'ESSMS (ESSMS privés)"]
[null,68922,"Reports en fonds dédiés à l'exploitation sur concours publics des entités gestionnaires d'ESSMS (ESSMS privés)"]
[null,6895,"Reports en fonds dédiés sur contribution financière d'autres organismes (ESSMS privés)"]
[]
[null,null,"TOTAL GROUPE III",{"$f":"SUM(D56:D66)+SUM(D69:D75)+D78+SUM(D81:D84)+SUM(D87:D104)","v":{"v":0,"d":"0.00 €"}},{"$f":"SUM(E56:E66)+SUM(E69:E75)+E78+SUM(E81:E84)+SUM(E87:E104)","v":{"v":0,"d":"0.00 €"}},{"$f":"SUM(F56:F66)+SUM(F69:F75)+F78+SUM(F81:F84)+SUM(F87:F104)","v":{"v":0,"d":"0.00 €"}}]
[]
[null,null,"TOTAL DES CHARGES",{"$f":"D34+D51+D106","v":{"v":0,"d":"0.00 €"}},{"$f":"E34+E51+E106","v":{"v":0,"d":"0.00 €"}},{"$f":"F34+F51+F106","v":{"v":0,"d":"0.00 €"}}]
[]
[null,null,"EXCEDENT PREVISIONNEL",{"$f":"IF(D194<D108,0,D194-D108)","v":{"v":0,"d":"0.00 €"}},{"$f":"IF(E194<E108,0,E194-E108)","v":{"v":0,"d":"0.00 €"}},{"$f":"IF(F194<F108,0,F194-F108)","v":{"v":0,"d":"0.00 €"}}]
[]
[null,null,"TOTAL EQUILIBRE DU COMPTE DE RESULTAT PREVISIONNEL PRINCIPAL/ANNEXE",{"$f":"D108+D110","v":{"v":0,"d":"0.00 €"}},{"$f":"E108+E110","v":{"v":0,"d":"0.00 €"}},{"$f":"F108+F110","v":{"v":0,"d":"0.00 €"}}]
[]
[null,"Présentation des produits :"]
[]
[null,null,"GROUPE I : PRODUITS DE LA TARIFICATION",{"$f":"IF(CREPASIDEN___ANNEEREF___ANN0\\_________=\"\",\"Réel N-2\",\"Réel \"&(CREPASIDEN___ANNEEREF___ANN0\\_________-2))","v":"Réel N-2"},{"$f":"IF(CREPASIDEN___ANNEEREF___ANN0\\_________=\"\",\"Anticipé ou réel N-1\",\"Anticipé ou réel \"&(CREPASIDEN___ANNEEREF___ANN0\\_________-1))","v":"Anticipé ou réel N-1"},{"$f":"IF(CREPASIDEN___ANNEEREF___ANN0\\_________=\"\",\"Exercice N\",\"Exercice \"&CREPASIDEN___ANNEEREF___ANN0\\_________)","v":"Exercice N"}]
[]
[]
[null,731,"Produits à la charge de l’assurance maladie (hors EHPAD) (autres que c/731224)"]
[null,731224,"Prise en charge au titre des dispositions de l'article L.242-4 du CASF"]
[null,732,"Produits à la charge de l’Etat"]
[null,733,"Produits à la charge du département (hors EHPAD) (autres que c/733222)"]
[null,733222,"Prise en charge au titre des dispositions de l'article L.242-4 du CASF"]
[null,734,"Produits à la charge de l’usager (hors EHPAD)"]
[null,7351,"Produits des EHPAD à la charge de l'assurance maladie"]
[null,7352,"Produits des EHPAD à la charge du département"]
[null,7353,"Produits des EHPAD à la charge de l'usager"]
[null,7358,"Produits des EHPAD à la charge d'autres financeurs"]
[null,738,"Produits à la charge d’autres financeurs"]
[]
[null,null,"TOTAL GROUPE I",{"$f":"SUM(D119:D129)","v":{"v":0,"d":"0.00 €"}},{"$f":"SUM(E119:E129)","v":{"v":0,"d":"0.00 €"}},{"$f":"SUM(F119:F129)","v":{"v":0,"d":"0.00 €"}}]
[]
[]
[null,null,"GROUPE II : AUTRES PRODUITS RELATIFS A L'EXPLOITATION",{"$f":"IF(CREPASIDEN___ANNEEREF___ANN0\\_________=\"\",\"Réel N-2\",\"Réel \"&(CREPASIDEN___ANNEEREF___ANN0\\_________-2))","v":"Réel N-2"},{"$f":"IF(CREPASIDEN___ANNEEREF___ANN0\\_________=\"\",\"Anticipé ou réel N-1\",\"Anticipé ou réel \"&(CREPASIDEN___ANNEEREF___ANN0\\_________-1))","v":"Anticipé ou réel N-1"},{"$f":"IF(CREPASIDEN___ANNEEREF___ANN0\\_________=\"\",\"Exercice N\",\"Exercice \"&CREPASIDEN___ANNEEREF___ANN0\\_________)","v":"Exercice N"}]
[]
[]
[null,70,"Produits (autres que forfaits journaliers et participations ci-dessous : c/70821, 70822 et 70823)"]
[null,70821,"Forfaits journaliers"]
[null,70822,"Participations des personnes handicapées prévues au 4° alinéa de l'article L. 242-4 du CASF"]
[null,70823,"Participations aux frais de repas et de transport dans les ESAT"]
[null,71,"Production stockée"]
[null,72,"Production immobilisée"]
[null,74,"Subventions et participations (sauf c/747)"]
[null,747,"Quotes-parts des subventions d’investissement virées au résultat de l’exercice "]
[null,75,"Autres produits de gestion courante (sauf c/757)"]
[null,757,"Produits des cessions d'immobilisations incorporelles et corporelles"]
[null,603,"Variation des stocks (en recettes)"]
[null,609,"Rabais, remises et ristournes obtenus sur achats "]
[null,619,"Rabais, remises et ristournes obtenus sur services extérieurs"]
[null,629,"Rabais, remises et ristournes obtenus sur autres services extérieurs"]
[null,6419,"Remboursements sur rémunérations du personnel non médical"]
[null,6429,"Remboursements sur rémunérations du personnel médical"]
[null,6439,"Remboursements sur rémunérations des personnes handicapées"]
[null,"6459/ 69/79","Remboursements sur charges de sécurité sociale et de prévoyance et sur autres charges sociales"]
[null,6489,"Fonds de compensation des cessations anticipées d'activité"]
[null,6611,"Intérêts des emprunts et dettes - en recettes - (hors ESSMS publics)"]
[]
[null,null,"TOTAL GROUPE II",{"$f":"SUM(D137:D156)","v":{"v":0,"d":"0.00 €"}},{"$f":"SUM(E137:E156)","v":{"v":0,"d":"0.00 €"}},{"$f":"SUM(F137:F156)","v":{"v":0,"d":"0.00 €"}}]
[]
[]
[null,null,"GROUPE III : PRODUITS FINANCIERS, PRODUITS EXCEPTIONNELS ET PRODUITS NON ENCAISSABLES ",{"$f":"IF(CREPASIDEN___ANNEEREF___ANN0\\_________=\"\",\"Réel N-2\",\"Réel \"&(CREPASIDEN___ANNEEREF___ANN0\\_________-2))","v":"Réel N-2"},{"$f":"IF(CREPASIDEN___ANNEEREF___ANN0\\_________=\"\",\"Anticipé ou réel N-1\",\"Anticipé ou réel \"&(CREPASIDEN___ANNEEREF___ANN0\\_________-1))","v":"Anticipé ou réel N-1"},{"$f":"IF(CREPASIDEN___ANNEEREF___ANN0\\_________=\"\",\"Exercice N\",\"Exercice \"&CREPASIDEN___ANNEEREF___ANN0\\_________)","v":"Exercice N"}]
[]
[]
[null,76,"Produits financiers"]
[]
[null,"PRODUITS EXCEPTIONNELS "]
[null,771,"Produits exceptionnels sur opérations de gestion"]
[null,773,"Mandats annulés (sur exercices antérieurs) ou atteints par la déchéance quadriennale (ESSMS publics)"]
[null,775,"Produits des cessions d'éléments d'actif (ESSMS publics)"]
[null,777,"Quote-part des subventions d'investissement virée au résultat de l'exercice (ESSMS publics)"]
[null,778,"Autres produits exceptionnels"]
[]
[]
[null,"AUTRES PRODUITS"]
[null,7811,"Reprises sur amortissements des immobilisations incorporelles et corporelles"]
[null,7815,"Reprises sur provisions d'exploitation"]
[null,7816,"Reprises sur dépréciations des immobilisations incorporelles et corporelles"]
[null,7817,"Reprises sur dépréciations des actifs circulants"]
[null,786,"Reprises sur dépréciations et provisions (à inscrire dans les produits financiers)"]
[null,78725,"Reprises sur amortissements dérogatoires"]
[null,78741,"Reprises sur provisions réglementées destinées à renforcer la couverture du besoin en fonds de roulement"]
[null,78742,"Reprises sur provisions réglementées pour renouvellement des immobilisations"]
[null,78746,"Reprises sur provisions réglementées : réserves des plus-values nettes d'actif (ESSMS privés)"]
[null,78748,"Autres reprises sur provisions réglementées"]
[null,"7875/7876","Reprises sur provisions et dépréciations exceptionnelles"]
[null,789,"Utilisation de fonds dédiés et de fonds reportés (sauf c/78921, 78922, 7895) (ESSMS privés)"]
[null,78921,"Reports en fonds dédiés à l'investissement sur concours publics des entités gestionnaires d'ESSMS (ESSMS privés)"]
[null,78922,"Utilisation des fonds dédiés à l'exploitation sur concours publics des entités gestionnaires d'ESSMS (ESSMS privés)"]
[null,7895," Utilisation des fonds dédiés sur ressources financières d'autres financeurs (ESSMS privés)"]
[null,79,"Transferts de charges"]
[]
[null,null,"TOTAL GROUPE III",{"$f":"D164+SUM(D167:D172)+SUM(D175:D190)","v":{"v":0,"d":"0.00 €"}},{"$f":"E164+SUM(E167:E172)+SUM(E175:E190)","v":{"v":0,"d":"0.00 €"}},{"$f":"F164+SUM(F167:F172)+SUM(F175:F190)","v":{"v":0,"d":"0.00 €"}}]
[]
[null,null,"TOTAL DES PRODUITS",{"$f":"D131+D158+D192","v":{"v":0,"d":"0.00 €"}},{"$f":"E131+E158+E192","v":{"v":0,"d":"0.00 €"}},{"$f":"F131+F158+F192","v":{"v":0,"d":"0.00 €"}}]
[]
[null,null,"DEFICIT PREVISIONNEL",{"$f":"IF(D194>D108,0,D108-D194)","v":{"v":0,"d":"0.00 €"}},{"$f":"IF(E194>E108,0,E108-E194)","v":{"v":0,"d":"0.00 €"}},{"$f":"IF(F194>F108,0,F108-F194)","v":{"v":0,"d":"0.00 €"}}]
[]
[null,null,"TOTAL EQUILIBRE DU COMPTE DE RESULTAT PREVISIONNEL PRINCIPAL/ANNEXE",{"$f":"D194+D196","v":{"v":0,"d":"0.00 €"}},{"$f":"E194+E196","v":{"v":0,"d":"0.00 €"}},{"$f":"F194+F196","v":{"v":0,"d":"0.00 €"}}]
[]
[null,null,"Résultats antérieurs repris dans le cadre de la tarification (déficits)"]
[null,null,"Résultats antérieurs repris dans le cadre de la tarification (excédents)"]
[]
[]
[null,null,"Ratios",{"$f":"IF(CREPASIDEN___ANNEEREF___ANN0\\_________=\"\",\"Réel N-2\",\"Réel \"&(CREPASIDEN___ANNEEREF___ANN0\\_________-2))","v":"Réel N-2"},{"$f":"IF(CREPASIDEN___ANNEEREF___ANN0\\_________=\"\",\"Anticipé ou réel N-1\",\"Anticipé ou réel \"&(CREPASIDEN___ANNEEREF___ANN0\\_________-1))","v":"Anticipé ou réel N-1"},{"$f":"IF(CREPASIDEN___ANNEEREF___ANN0\\_________=\"\",\"Exercice N\",\"Exercice \"&CREPASIDEN___ANNEEREF___ANN0\\_________)","v":"Exercice N"}]
[null,null,"Marge brute d'exploitation",{"$f":"D131+D158-D34-D51-SUM(D56:D66)-SUM(D69:D75)-D156","v":{"v":0,"d":"0.00 €"}},{"$f":"E131+E158-E34-E51-SUM(E56:E66)-SUM(E69:E75)-E156","v":{"v":0,"d":"0.00 €"}},{"$f":"F131+F158-F34-F51-SUM(F56:F66)-SUM(F69:F75)-F156","v":{"v":0,"d":"0.00 €"}}]
[null,null,"Produits courants d'exploitation (Comptes 70 à 75 - c/709 et 713)",{"$f":"D131+SUM(D137:D146)-D15-D16","v":{"v":0,"d":"0.00 €"}},{"$f":"E131+SUM(E137:E146)-E15-E16","v":{"v":0,"d":"0.00 €"}},{"$f":"F131+SUM(F137:F146)-F15-F16","v":{"v":0,"d":"0.00 €"}}]
[null,null,"Taux de marge brute",{"$f":"IFERROR(D205/D206,0)","v":{"v":0,"d":"0.00%"}},{"$f":"IFERROR(E205/E206,0)","v":{"v":0,"d":"0.00%"}},{"$f":"IFERROR(F205/F206,0)","v":{"v":0,"d":"0.00%"}}]
[null,null,"Résultat net",{"$f":"D110-D196","v":{"v":0,"d":"0.00 €"}},{"$f":"E110-E196","v":{"v":0,"d":"0.00 €"}},{"$f":"F110-F196","v":{"v":0,"d":"0.00 €"}}]
[null,null,"Produits comptes classe 7 - c/709 et 713",{"$f":"D194-SUM(D15:D16)-SUM(D147:D156)","v":{"v":0,"d":"0.00 €"}},{"$f":"E194-SUM(E15:E16)-SUM(E147:E156)","v":{"v":0,"d":"0.00 €"}},{"$f":"F194-SUM(F15:F16)-SUM(F147:F156)","v":{"v":0,"d":"0.00 €"}}]
[null,null,"Taux de résultat ",{"$f":"IFERROR(D208/D209,0)","v":{"v":0,"d":"0.00%"}},{"$f":"IFERROR(E208/E209,0)","v":{"v":0,"d":"0.00%"}},{"$f":"IFERROR(F208/F209,0)","v":{"v":0,"d":"0.00%"}}]
[]
[]
[null,"Nota : Les CRPA relevant de l'article R. 314-74 du CASF (dotations non affectées et services industriels et commerciaux des établissements publics sociaux et médico-sociaux autonomes) ne peuvent être présentés qu'en équilibre ou en excédent."]

{"sheet":"Synthèse_CRP","index":12,"n_rows":55,"n_cols":5,"rows_kept":55,"hidden":true,"merged":[[1,1,1,4],[3,2,3,4],[4,2,4,4],[5,1,5,4],[6,1,6,4],[15,1,15,4],[17,1,17,4],[28,2,28,4],[29,2,29,4],[31,2,31,4],[32,2,32,4],[33,2,33,4],[35,1,35,4],[44,1,44,4],[46,1,46,4]]}
[]
[null,"Synthèse des CRP"]
[]
[null,"FINESS ET",{"$f":"+'CRPP NON SOUMIS EQUIL'!$D$3&'CRPP SOUMIS EQUILIBRE'!$D$3","v":""}]
[null,"Raison sociale",{"$f":"+'CRPP NON SOUMIS EQUIL'!$D$2&'CRPP SOUMIS EQUILIBRE'!$D$2","v":""}]
[]
[null,{"$f":"IF(CREPASIDEN___ANNEEREF___ANN0\\_________=\"\",\"COMPTE DE RESULTAT PREVISIONNEL PRINCIPAL NON SOUMIS A EQUILIBRE STRICT (PREVISIONS EXERCICE N\",\"COMPTE DE RESULTAT PREVISIONNEL PRINCIPAL NON SOUMIS A EQUILIBRE STRICT (PREVISIONS EXERCICE \"&CREPASIDEN___ANNEEREF___ANN0\\_________&\")\")","v":"COMPTE DE RESULTAT PREVISIONNEL PRINCIPAL NON SOUMIS A EQUILIBRE STRICT (PREVISIONS EXERCICE N"}]
[null,null,"CHARGES","PRODUITS"]
[null,"Groupe I : charges afférentes à l'exploitation courante",{"$f":"'CRPP NON SOUMIS EQUIL'!$F$34","v":{"v":0,"d":"0.00 €"}},{"$f":"'CRPP NON SOUMIS EQUIL'!$F$131","v":{"v":0,"d":"0.00 €"}},"Groupe I : produits de la tarification"]
[null,"Groupe II : charges afférentes au personnel",{"$f":"'CRPP NON SOUMIS EQUIL'!$F$51","v":{"v":0,"d":"0.00 €"}},{"$f":"'CRPP NON SOUMIS EQUIL'!$F$158","v":{"v":0,"d":"0.00 €"}},"Groupe II : autres produits relatifs à l'exploitation"]
[null,"Groupe III : charges afférentes à la structure",{"$f":"'CRPP NON SOUMIS EQUIL'!$F$106","v":{"v":0,"d":"0.00 €"}},{"$f":"'CRPP NON SOUMIS EQUIL'!$F$192","v":{"v":0,"d":"0.00 €"}},"Groupe III : produits financiers, produits exceptionnels et produits non encaissables"]
[null,"TOTAL DES CHARGES",{"$f":"SUM(C9:C11)","v":{"v":0,"d":"0.00 €"}},{"$f":"SUM(D9:D11)","v":{"v":0,"d":"0.00 €"}},"TOTAL DES PRODUITS"]
[null,"RESULTAT COMPTABLE PREVISIONNEL EXCEDENTAIRE",{"$f":"IF(D12<C12,0,D12-C12)","v":{"v":0,"d":"0.00 €"}},{"$f":"IF(D12>C12,0,C12-D12)","v":{"v":0,"d":"0.00 €"}},"RESULTAT COMPTABLE PREVISIONNEL DEFICITAIRE"]
[null,"TOTAL EQUILIBRE DU COMPTE DE RESULTAT PREVISIONNEL",{"$f":"C13+C12","v":{"v":0,"d":"0.00 €"}},{"$f":"D13+D12","v":{"v":0,"d":"0.00 €"}},"TOTAL EQUILIBRE DU COMPTE DE RESULTAT PREVISIONNEL"]
[]
[null,"OU"]
[]
[null,{"$f":"IF(CREPASIDEN___ANNEEREF___ANN0\\_________=\"\",\"COMPTE DE RESULTAT PREVISIONNEL PRINCIPAL SOUMIS A OBLIGATION D'EQUILIBRE STRICT (PREVISIONS EXERCICE N\",\"COMPTE DE RESULTAT PREVISIONNEL PRINCIPAL SOUMIS A OBLIGATION D'EQUILIBRE STRICT (PREVISIONS EXERCICE \"&CREPASIDEN___ANNEEREF___ANN0\\_________&\")\")","v":"COMPTE DE RESULTAT PREVISIONNEL PRINCIPAL SOUMIS A OBLIGATION D'EQUILIBRE STRICT (PREVISIONS EXERCICE N"}]
[null,null,"CHARGES","PRODUITS"]
[null,"Groupe I : charges afférentes à l'exploitation courante",{"$f":"'CRPP SOUMIS EQUILIBRE'!$F$34","v":{"v":0,"d":"0.00 €"}},{"$f":"'CRPP SOUMIS EQUILIBRE'!$F$129","v":{"v":0,"d":"0.00 €"}},"Groupe I : produits de la tarification"]
[null,"Groupe II : charges afférentes au personnel",{"$f":"'CRPP SOUMIS EQUILIBRE'!$F$51","v":{"v":0,"d":"0.00 €"}},{"$f":"'CRPP SOUMIS EQUILIBRE'!$F$155","v":{"v":0,"d":"0.00 €"}},"Groupe II : autres produits relatifs à l'exploitation"]
[null,"Groupe III : charges afférentes à la structure",{"$f":"'CRPP SOUMIS EQUILIBRE'!$F$108","v":{"v":0,"d":"0.00 €"}},{"$f":"'CRPP SOUMIS EQUILIBRE'!$F$188","v":{"v":0,"d":"0.00 €"}},"Groupe III : produits financiers, produits exceptionnels et produits non encaissables"]
[null,"TOTAL DES CHARGES",{"$f":"SUM(C20:C22)","v":{"v":0,"d":"0.00 €"}},{"$f":"SUM(D20:D22)","v":{"v":0,"d":"0.00 €"}},"TOTAL DES PRODUITS"]
[null,"Déficit antérieur du CRP reporté (002)",{"$f":"'CRPP SOUMIS EQUILIBRE'!$F$112","v":{"v":0,"d":"0.00 €"}},{"$f":"'CRPP SOUMIS EQUILIBRE'!$F$192","v":{"v":0,"d":"0.00 €"}},"Excédent antérieur du CRP reporté (002)"]
[null,"Amortissements comptables excédentaires différés (005)",{"$f":"'CRPP SOUMIS EQUILIBRE'!$F$113","v":{"v":0,"d":"0.00 €"}},{"$f":"'CRPP SOUMIS EQUILIBRE'!$F$193","v":{"v":0,"d":"0.00 €"}},"Amortissements comptables excédentaires différés (005)"]
[null,"TOTAL GENERAL",{"$f":"SUM(C23:C25)","v":{"v":0,"d":"0.00 €"}},{"$f":"SUM(D23:D25)","v":{"v":0,"d":"0.00 €"}},"TOTAL GENERAL"]
[]
[]
[null,"FINESS ET",{"$f":"+'CRPP NON SOUMIS EQUIL'!$D$3&'CRPP SOUMIS EQUILIBRE'!$D$3","v":""}]
[null,"Raison sociale",{"$f":"+'CRPP NON SOUMIS EQUIL'!$D$2&'CRPP SOUMIS EQUILIBRE'!$D$2","v":""}]
[]
[null,"N° Identifiant : ",{"$f":"+CRP_SF!$D$3&\"\"","v":""}]
[null,"Dénomination du CR sans Finess :",{"$f":"CRP_SF!$D$2&\"\"","v":""}]
[null,"FINESS de rattachement :",{"$f":"CRP_SF!$D$4&\"\"","v":""}]
[]
[null,{"$f":"IF(CREPASIDEN___ANNEEREF___ANN0\\_________=\"\",\"COMPTE DE RESULTAT PREVISIONNEL ANNEXE - ESMS NON SOUMIS A EQUILIBRE STRICT (PREVISIONS EXERCICE N\",\"COMPTE DE RESULTAT PREVISIONNEL ANNEXE - ESMS NON SOUMIS A EQUILIBRE STRICT (PREVISIONS EXERCICE \"&CREPASIDEN___ANNEEREF___ANN0\\_________&\")\")","v":"COMPTE DE RESULTAT PREVISIONNEL ANNEXE - ESMS NON SOUMIS A EQUILIBRE STRICT (PREVISIONS EXERCICE N"}]
[null,null,"CHARGES","PRODUITS"]
[null,"Groupe I : charges afférentes à l'exploitation courante",{"$f":"'CRPP NON SOUMIS EQUIL'!$F$34+CRP_SF!$F$34","v":{"v":0,"d":"0.00 €"}},{"$f":"'CRPP NON SOUMIS EQUIL'!$F$131+CRP_SF!$F$131","v":{"v":0,"d":"0.00 €"}},"Groupe I : produits de la tarification"]
[null,"Groupe II : charges afférentes au personnel",{"$f":"'CRPP NON SOUMIS EQUIL'!$F$51+CRP_SF!$F$51","v":{"v":0,"d":"0.00 €"}},{"$f":"'CRPP NON SOUMIS EQUIL'!$F$158+CRP_SF!$F$158","v":{"v":0,"d":"0.00 €"}},"Groupe II : autres produits relatifs à l'exploitation"]
[null,"Groupe III : charges afférentes à la structure",{"$f":"'CRPP NON SOUMIS EQUIL'!$F$106+CRP_SF!$F$106","v":{"v":0,"d":"0.00 €"}},{"$f":"'CRPP NON SOUMIS EQUIL'!$F$192+CRP_SF!$F$192","v":{"v":0,"d":"0.00 €"}},"Groupe III : produits financiers, produits exceptionnels et produits non encaissables"]
[null,"TOTAL DES CHARGES",{"$f":"SUM(C38:C40)","v":{"v":0,"d":"0.00 €"}},{"$f":"SUM(D38:D40)","v":{"v":0,"d":"0.00 €"}},"TOTAL DES PRODUITS"]
[null,"RESULTAT COMPTABLE PREVISIONNEL EXCEDENTAIRE",{"$f":"IF(D41<C41,0,D41-C41)","v":{"v":0,"d":"0.00 €"}},{"$f":"IF(D41>C41,0,C41-D41)","v":{"v":0,"d":"0.00 €"}},"RESULTAT COMPTABLE PREVISIONNEL DEFICITAIRE"]
[null,"TOTAL EQUILIBRE DU COMPTE DE RESULTAT PREVISIONNEL",{"$f":"C42+C41","v":{"v":0,"d":"0.00 €"}},{"$f":"D42+D41","v":{"v":0,"d":"0.00 €"}},"TOTAL EQUILIBRE DU COMPTE DE RESULTAT PREVISIONNEL"]
[]
[null,"OU"]
[]
[null,{"$f":"IF(CREPASIDEN___ANNEEREF___ANN0\\_________=\"\",\"COMPTE DE RESULTAT PREVISIONNEL ANNEXE - ESMS SOUMIS A OBLIGATION D'EQUILIBRE STRICT (PREVISIONS EXERCICE N)\",\"COMPTE DE RESULTAT PREVISIONNEL ANNEXE - ESMS SOUMIS A OBLIGATION D'EQUILIBRE STRICT (PREVISIONS EXERCICE \"&CREPASIDEN___ANNEEREF___ANN0\\_________&\")\")","v":"COMPTE DE RESULTAT PREVISIONNEL ANNEXE - ESMS SOUMIS A OBLIGATION D'EQUILIBRE STRICT (PREVISIONS EXERCICE N)"}]
[null,null,"CHARGES","PRODUITS"]
[null,"Groupe I : charges afférentes à l'exploitation courante",{"$f":"'CRPP SOUMIS EQUILIBRE'!$F$34","v":{"v":0,"d":"0.00 €"}},{"$f":"'CRPP SOUMIS EQUILIBRE'!$F$129","v":{"v":0,"d":"0.00 €"}},"Groupe I : produits de la tarification"]
[null,"Groupe II : charges afférentes au personnel",{"$f":"'CRPP SOUMIS EQUILIBRE'!$F$51","v":{"v":0,"d":"0.00 €"}},{"$f":"'CRPP SOUMIS EQUILIBRE'!$F$155","v":{"v":0,"d":"0.00 €"}},"Groupe II : autres produits relatifs à l'exploitation"]
[null,"Groupe III : charges afférentes à la structure",{"$f":"'CRPP SOUMIS EQUILIBRE'!$F$108","v":{"v":0,"d":"0.00 €"}},{"$f":"'CRPP SOUMIS EQUILIBRE'!$F$188","v":{"v":0,"d":"0.00 €"}},"Groupe III : produits financiers, produits exceptionnels et produits non encaissables"]
[null,"TOTAL DES CHARGES",{"$f":"SUM(C49:C51)","v":{"v":0,"d":"0.00 €"}},{"$f":"SUM(D49:D51)","v":{"v":0,"d":"0.00 €"}},"TOTAL DES PRODUITS"]
[null,"Déficit antérieur du CRP reporté (002)",{"$f":"'CRPP SOUMIS EQUILIBRE'!$F$112","v":{"v":0,"d":"0.00 €"}},{"$f":"'CRPP SOUMIS EQUILIBRE'!$F$192","v":{"v":0,"d":"0.00 €"}},"Excédent antérieur du CRP reporté (002)"]
[null,"Amortissements comptables excédentaires différés (005)",{"$f":"'CRPP SOUMIS EQUILIBRE'!$F$113","v":{"v":0,"d":"0.00 €"}},{"$f":"'CRPP SOUMIS EQUILIBRE'!$F$193","v":{"v":0,"d":"0.00 €"}},"Amortissements comptables excédentaires différés (005)"]
[null,"TOTAL GENERAL",{"$f":"SUM(C52:C54)","v":{"v":0,"d":"0.00 €"}},{"$f":"SUM(D52:D54)","v":{"v":0,"d":"0.00 €"}},"TOTAL GENERAL"]

{"sheet":"EPRD synthétique","index":13,"n_rows":67,"n_cols":5,"rows_kept":67,"hidden":true,"merged":[[1,1,1,4],[3,1,3,4],[61,3,61,4]]}
[]
[null,"Cadre EPRD synthétique"]
[]
[null,{"$f":"IF(CREPASIDEN___ANNEEREF___ANN0\\_________=\"\",\"COMPTES DE RESULTAT CONSOLIDES (CRPP + CRPA) - EXERCICE N\",\"COMPTES DE RESULTAT CONSOLIDES (CRPP + CRPA) - EXERCICE \"&CREPASIDEN___ANNEEREF___ANN0\\_________)","v":"COMPTES DE RESULTAT CONSOLIDES (CRPP + CRPA) - EXERCICE N"}]
[]
[null,null,"CHARGES","PRODUITS"]
[null,"Groupe I : charges afférentes à l'exploitation courante",{"$f":"Conso!B3","v":{"v":0,"d":"0.00 €"}},{"$f":"Conso!B47","v":{"v":0,"d":"0.00 €"}},"Groupe I : produits de la tarification"]
[null,"Groupe II : charges afférentes au personnel",{"$f":"Conso!B4","v":{"v":0,"d":"0.00 €"}},{"$f":"Conso!B48","v":{"v":0,"d":"0.00 €"}},"Groupe II : autres produits relatifs à l'exploitation"]
[null,"Groupe III : charges afférentes à la structure",{"$f":"Conso!B5","v":{"v":0,"d":"0.00 €"}},{"$f":"Conso!B49","v":{"v":0,"d":"0.00 €"}},"Groupe III : produits financiers, produits exceptionnels et produits non encaissables"]
[null,"TOTAL DES CHARGES",{"$f":"SUM(C7:C9)","v":{"v":0,"d":"0.00 €"}},{"$f":"SUM(D7:D9)","v":{"v":0,"d":"0.00 €"}},"TOTAL DES PRODUITS"]
[null,"RESULTAT COMPTABLE PREVISIONNEL EXCEDENTAIRE (1)",{"$f":"IF(D10<C10,0,D10-C10)","v":{"v":0,"d":"0.00 €"}},{"$f":"IF(D10>C10,0,C10-D10)","v":{"v":0,"d":"0.00 €"}},"RESULTAT COMPTABLE PREVISIONNEL DEFICITAIRE (1)"]
[null,"TOTAL EQUILIBRE DU COMPTE DE RESULTAT PREVISIONNEL",{"$f":"C11+C10","v":{"v":0,"d":"0.00 €"}},{"$f":"D11+D10","v":{"v":0,"d":"0.00 €"}},"TOTAL EQUILIBRE DU COMPTE DE RESULTAT PREVISIONNEL"]
[]
[null,{"$f":"IF(CREPASIDEN___ANNEEREF___ANN0\\_________=\"\",\"TABLEAU DE PASSAGE DU RESULTAT PREVISIONNEL A LA CAF PREVISIONNELLE - EXERCICE N\",\"TABLEAU DE PASSAGE DU RESULTAT PREVISIONNEL A LA CAF PREVISIONNELLE - EXERCICE \"&CREPASIDEN___ANNEEREF___ANN0\\_________)","v":"TABLEAU DE PASSAGE DU RESULTAT PREVISIONNEL A LA CAF PREVISIONNELLE - EXERCICE N"}]
[]
[null,"RESULTAT COMPTABLE PREVISIONNEL (EXCEDENT) (1)",{"$f":"C11","v":{"v":0,"d":"0.00 €"}},{"$f":"D11","v":{"v":0,"d":"0.00 €"}},"RESULTAT COMPTABLE PREVISIONNEL (DEFICIT) (1)"]
[null,"Valeurs comptables des immobilisations incorporelles et corporelles cédées",{"$f":"Conso!B13","v":{"v":0,"d":"0.00 €"}},{"$f":"Conso!B57","v":{"v":0,"d":"0.00 €"}},"Produits des cessions d'immobilisations incorporelles et corporelles"]
[null,"Dotations aux amortissements, aux dépréciations et aux provisions",{"$f":"Conso!B14","v":{"v":0,"d":"0.00 €"}},{"$f":"Conso!B58","v":{"v":0,"d":"0.00 €"}},"Quote-part des subventions d'investissement virée au résultat"]
[null,"Reports en fonds dédiés (ESSMS privés)",{"$f":"Conso!B15","v":{"v":0,"d":"0.00 €"}},{"$f":"Conso!B59","v":{"v":0,"d":"0.00 €"}},"Reprise sur amortissements, dépréciations et provisions"]
[{"$nulls":3},{"$f":"Conso!B60","v":{"v":0,"d":"0.00 €"}},"Utilisation de fonds dédiés et de fonds reportés (ESSMS privés)"]
[null,"SOUS-TOTAL 1",{"$f":"SUM(C16:C20)","v":{"v":0,"d":"0.00 €"}},{"$f":"SUM(D16:D20)","v":{"v":0,"d":"0.00 €"}},"SOUS-TOTAL 2"]
[null,"CAPACITE D'AUTOFINANCEMENT (si 1-2>0)",{"$f":"IF(C21<D21,0,-(D21-C21))","v":{"v":0,"d":"0.00 €"}},{"$f":"IF(D21<C21,0,-(C21-D21))","v":{"v":0,"d":"0.00 €"}},"INSUFFISANCE D'AUTOFINANCEMENT (si 1-2<0)"]
[null,"Taux de CAF en pourcentage des produits",{"$f":"IF(D10=0,0,C22/D10)","v":{"v":0,"d":"0.00%"}},{"$f":"IF(D10=0,0,D22/D10)","v":{"v":0,"d":"0.00%"}},"Taux d'IAF en pourcentage des produits"]
[]
[null,{"$f":"IF(CREPASIDEN___ANNEEREF___ANN0\\_________=\"\",\"TABLEAU DE FINANCEMENT PREVISIONNEL - EXERCICE N\",\"TABLEAU DE FINANCEMENT PREVISIONNEL - EXERCICE \"&CREPASIDEN___ANNEEREF___ANN0\\_________)","v":"TABLEAU DE FINANCEMENT PREVISIONNEL - EXERCICE N"}]
[]
[null,"INSUFFISANCE D'AUTOFINANCEMENT PREVISIONNELLE",{"$f":"D22","v":{"v":0,"d":"0.00 €"}},{"$f":"C22","v":{"v":0,"d":"0.00 €"}},"CAPACITE D'AUTOFINANCEMENT PREVISIONNELLE"]
[null,"Remboursement des dettes financières",{"$f":"+TFP!$F$29+TFP!$F$31+TFP!$F$30","v":{"v":0,"d":"0.00 €"}},{"$f":"+TFP!$F$11+TFP!$F$12","v":{"v":0,"d":"0.00 €"}},"Emprunts à plus d'un an et dettes assimilées"]
[null,"Immobilisations (2)",{"$f":"+TFP!$F$34+TFP!$F$35+TFP!$F$41+TFP!$F$42+TFP!$F$43","v":{"v":0,"d":"0.00 €"}},{"$f":"+TFP!$F$8+TFP!$F$9","v":{"v":0,"d":"0.00 €"}},"Apports, dotations, réserves, fonds propres (sauf 106 Réserves) et subventions d'investissement"]
[null,"Autres emplois",{"$f":"+TFP!$F$27+TFP!$F$32+TFP!$F$45+TFP!$F$46","v":{"v":0,"d":"0.00 €"}},{"$f":"+TFP!$F$13+TFP!$F$15+TFP!$F$16+TFP!$F$17+TFP!$F$18","v":{"v":0,"d":"0.00 €"}},"Autres ressources (dont produits des cessions d'éléments d'actif)"]
[null,"TOTAL DES EMPLOIS",{"$f":"SUM(C27:C30)","v":{"v":0,"d":"0.00 €"}},{"$f":"SUM(D27:D30)","v":{"v":0,"d":"0.00 €"}},"TOTAL DES RESSOURCES"]
[null,"APPORT AU FONDS DE ROULEMENT",{"$f":"IF(C31>D31,0,D31-C31)","v":{"v":0,"d":"0.00 €"}},{"$f":"IF(D31>C31,0,C31-D31)","v":{"v":0,"d":"0.00 €"}},"PRELEVEMENT SUR LE FONDS DE ROULEMENT"]
[null,"TOTAL EQUILIBRE DU TABLEAU DE FINANCEMENT ",{"$f":"SUM(C31:C32)","v":{"v":0,"d":"0.00 €"}},{"$f":"SUM(D31:D32)","v":{"v":0,"d":"0.00 €"}},"TOTAL EQUILIBRE DU TABLEAU DE FINANCEMENT "]
[]
[null,{"$f":"IF(CREPASIDEN___ANNEEREF___ANN0\\_________=\"\",\"MOUVEMENTS DE L'EXERCICE SUR LES COMPTES DE LIAISON STABLES DE TRESORERIE - EXERCICE N (3)\",\"MOUVEMENTS DE L'EXERCICE SUR LES COMPTES DE LIAISON STABLES DE TRESORERIE - EXERCICE \"&CREPASIDEN___ANNEEREF___ANN0\\_________&\" (3)\")","v":"MOUVEMENTS DE L'EXERCICE SUR LES COMPTES DE LIAISON STABLES DE TRESORERIE - EXERCICE N (3)"}]
[]
[null,"Compte de liaison stable de trésorerie (en emploi)",{"$f":"ABS(IF(PGFP!E82-PGFP!E88<0,PGFP!E82-PGFP!E88,0))","v":{"v":0,"d":"0.00 €"}},{"$f":"ABS(IF(PGFP!E82-PGFP!E88>0,PGFP!E82-PGFP!E88,0))","v":{"v":0,"d":"0.00 €"}},"Compte de liaison stable de trésorerie (en ressource)"]
[]
[null,"Cadre EPRD synthétique (suite)"]
[]
[null,{"$f":"IF(CREPASIDEN___ANNEEREF___ANN0\\_________=\"\",\"FONDS DE ROULEMENT NET GLOBAL PREVISIONNEL (FRNG) - EXERCICE N\",\"FONDS DE ROULEMENT NET GLOBAL PREVISIONNEL (FRNG) - EXERCICE \"&CREPASIDEN___ANNEEREF___ANN0\\_________)","v":"FONDS DE ROULEMENT NET GLOBAL PREVISIONNEL (FRNG) - EXERCICE N"}]
[]
[null,{"$f":"IF(CREPASIDEN___ANNEEREF___ANN0\\_________=\"\",\"FRNG estimé au 1er janvier N\",\"FRNG estimé au 1er janvier \"&CREPASIDEN___ANNEEREF___ANN0\\_________)","v":"FRNG estimé au 1er janvier N"},{"$f":"'Bilan Financier'!$M$40-'Bilan Financier'!$G$40","v":{"v":0,"d":"0.00 €"}}]
[null,"Variation du fonds de roulement : Apport ou (Prélèvement) calculé à partir du TFP, corrigé, pour les ESSMS privés, des mouvements de l’exercice sur les comptes de liaison stables de trésorerie",{"$f":"C32-D32+D37-C37","v":{"v":0,"d":"0.00 €"}}]
[null,{"$f":"IF(CREPASIDEN___ANNEEREF___ANN0\\_________=\"\",\"FRNG prévisionnel au 31 décembre N\",\"FRNG prévisionnel au 31 décembre \"&CREPASIDEN___ANNEEREF___ANN0\\_________)","v":"FRNG prévisionnel au 31 décembre N"},{"$f":"C43+C44","v":{"v":0,"d":"0.00 €"}}]
[]
[null,{"$f":"IF(CREPASIDEN___ANNEEREF___ANN0\\_________=\"\",\"BESOIN EN FONDS DE ROULEMENT (BFR) PREVISIONNEL - EXERCICE N\",\"BESOIN EN FONDS DE ROULEMENT (BFR) PREVISIONNEL - EXERCICE \"&CREPASIDEN___ANNEEREF___ANN0\\_________)","v":"BESOIN EN FONDS DE ROULEMENT (BFR) PREVISIONNEL - EXERCICE N"}]
[]
[null,{"$f":"IF(CREPASIDEN___ANNEEREF___ANN0\\_________=\"\",\"BFR estimé au 1er janvier N\",\"BFR estimé au 1er janvier \"&CREPASIDEN___ANNEEREF___ANN0\\_________)","v":"BFR estimé au 1er janvier N"},{"$f":"'Bilan Financier'!$G$53-'Bilan Financier'!$M$53","v":{"v":0,"d":"0.00 €"}}]
[null,"Augmentation du besoin en fonds de roulement de la période",{"$f":"PGFP!$E$99","v":{"v":0,"d":"0.00 €"}}]
[null,"Diminution du besoin en fonds de roulement de la période",{"$f":"PGFP!$E$104","v":{"v":0,"d":"0.00 €"}}]
[null,{"$f":"IF(CREPASIDEN___ANNEEREF___ANN0\\_________=\"\",\"BFR (ou EFE signe\"\"\"&\"-\"\"\"&\") prévisionnel au 31 décembre N\",\"BFR (ou EFE signe \"\"\"&\"-\"\"\"&\") prévisionnel au 31 décembre \"&CREPASIDEN___ANNEEREF___ANN0\\_________)","v":"BFR (ou EFE signe\"-\") prévisionnel au 31 décembre N"},{"$f":"C49+C50-C51","v":{"v":0,"d":"0.00 €"}}]
[]
[null,{"$f":"IF(CREPASIDEN___ANNEEREF___ANN0\\_________=\"\",\"TRESORERIE PREVISIONNELLE - EXERCICE N\",\"TRESORERIE PREVISIONNELLE - EXERCICE \"&CREPASIDEN___ANNEEREF___ANN0\\_________)","v":"TRESORERIE PREVISIONNELLE - EXERCICE N"}]
[]
[null,{"$f":"IF(CREPASIDEN___ANNEEREF___ANN0\\_________=\"\",\"Trésorerie au 1er janvier N\",\"Trésorerie au 1er janvier \"&CREPASIDEN___ANNEEREF___ANN0\\_________)","v":"Trésorerie au 1er janvier N"},{"$f":"'Bilan Financier'!$G$63-'Bilan Financier'!$M$63","v":{"v":0,"d":"0.00 €"}}]
[null,"Variation prévisionnelle de trésorerie de la période",{"$f":"PGFP!$E$112","v":{"v":0,"d":"0.00 €"}}]
[null,{"$f":"IF(CREPASIDEN___ANNEEREF___ANN0\\_________=\"\",\"Trésorerie au 31 décembre N\",\"Trésorerie au 31 décembre \"&CREPASIDEN___ANNEEREF___ANN0\\_________)","v":"Trésorerie au 31 décembre N"},{"$f":"C56+C57","v":{"v":0,"d":"0.00 €"}}]
[]
[]
[]
[null,"Contrôle de la variation de trésorerie entre EPRD synthétique et PGFP",{"$f":"IF(ROUND(C44-(C50-C51)-PGFP!$E$112,0)=0,\"Ok\",\"Ecart de \"&ROUND(C44-(C50-C51)-PGFP!$E$112,0))","v":"Ok"}]
[]
[]
[null,"(1) Hors report à nouveau (ligne 002) et ligne d'équilibre des amortissements comptables excédentaires différés (ligne 005)"]
[null,"(2) Y compris participations et créances rattachées à des participations"]
[null,"(3) ESSMS privés seulement"]

{"sheet":"CAF_détaillée","index":14,"n_rows":33,"n_cols":5,"rows_kept":33,"hidden":true,"merged":[[1,1,1,4],[4,1,4,2],[5,1,5,2],[6,1,9,1],[11,1,15,1],[16,1,16,2],[17,1,21,1],[23,1,27,1],[28,1,28,2]]}
[]
[null,"Tableau de détermination et d'affectation de la capacité d'autofinancement (CAF)"]
[]
[{"$nulls":3},"Comptes",{"$f":"IF(CREPASIDEN___ANNEEREF___ANN0\\_________=\"\",\"Montant année N\",\"Montant année \"&CREPASIDEN___ANNEEREF___ANN0\\_________)","v":"Montant année N"}]
[null,"RESULTAT COMPTABLE (EXCEDENT ou DEFICIT) (1)",null,null,{"$f":"'EPRD synthétique'!$C$11-'EPRD synthétique'!$D$11","v":{"v":0,"d":"0.00 €"}}]
[null,"+ Flux internes (charges)",null,null,{"$f":"SUM(E7:E16)","v":{"v":0,"d":"0.00 €"}}]
[null,"FRI","+ Valeur comptable des immobilisations incorporelles et corporelles cédées","c/652 ou c/675",{"$f":"Conso!B78","v":{"v":0,"d":"0.00 €"}}]
[null,null,"+ Dotations aux amortissements des immobilisations incorporelles et corporelles","c/6811",{"$f":"Conso!B79","v":{"v":0,"d":"0.00 €"}}]
[null,null,"+ Dotations aux provisions pour renouvellement des immobilisations et dotations aux amortissements dérogatoires","c/68742, c/68725",{"$f":"Conso!B80","v":{"v":0,"d":"0.00 €"}}]
[null,null,"+ Autres dotations aux amortissements, dépréciations et provisions impactant le FRI","c/6812, c/6816,  c/6871, c/68746, c/68748",{"$f":"Conso!B81","v":{"v":0,"d":"0.00 €"}}]
[null,null,"+ Reports en fonds dédiés à l'investissement sur concours publics des entités gestionnaires d'ESSMS (ESSMS privés)","c/68921",{"$f":"Conso!B82","v":{"v":0,"d":"0.00 €"}}]
[null,"FRE","+ Dotations aux provisions d'exploitation","c/6815",{"$f":"Conso!B83","v":{"v":0,"d":"0.00 €"}}]
[null,null,"+ Dotations aux provisions de couverture du BFR","c/68741",{"$f":"Conso!B84","v":{"v":0,"d":"0.00 €"}}]
[null,null,"+ Dotations aux dépréciations des actifs circulants: créances, stocks et en-cours","c/6817",{"$f":"Conso!B85","v":{"v":0,"d":"0.00 €"}}]
[null,null,"+ Autres dotations aux amortissements, dépréciations et provisions","c/686, c/6875, c/6876",{"$f":"Conso!B86","v":{"v":0,"d":"0.00 €"}}]
[null,null,"+ Reports en fonds dédiés (ESSMS privés), sauf c/68921","c/689 (hors c/68921)",{"$f":"Conso!B87","v":{"v":0,"d":"0.00 €"}}]
[null,"- Flux internes (produits)",null,null,{"$f":"SUM(E18:E28)","v":{"v":0,"d":"0.00 €"}}]
[null,"FRI","- Produits des cessions d'immobilisations incorporelles et corporelles","c/757 ou c/775",{"$f":"Conso!B89","v":{"v":0,"d":"0.00 €"}}]
[null,null,"- Quote-part des subventions d'investissement virée au résultat de l'exercice","c/747 ou c/777",{"$f":"Conso!B90","v":{"v":0,"d":"0.00 €"}}]
[null,null,"- Reprises sur provisions pour renouvellement des immobilisations et reprises sur amortissements dérogatoires","c/78742, c/78725",{"$f":"Conso!B91","v":{"v":0,"d":"0.00 €"}}]
[null,null,"- Autres reprises sur amortissements, dépréciations et provisions impactant le FRI","c/7811, c/7816, c/78746\", c/78748",{"$f":"Conso!B92","v":{"v":0,"d":"0.00 €"}}]
[null,null,"- Quote-part d'éléments du fonds associatif virée au compte de résultat (ESSMS privés)","c/7781",{"$f":"Conso!B93","v":{"v":0,"d":"0.00 €"}}]
[null,null,"- Utilisation des fonds dédiés à l'investissement sur concours publics des entités gestionnaires d'ESSMS (ESSMS privés)","c/78921",{"$f":"Conso!B94","v":{"v":0,"d":"0.00 €"}}]
[null,"FRE","- Reprises sur provisions d'exploitation","c/7815",{"$f":"Conso!B95","v":{"v":0,"d":"0.00 €"}}]
[null,null,"- Reprises sur provisions de couverture du BFR","c/78741",{"$f":"Conso!B96","v":{"v":0,"d":"0.00 €"}}]
[null,null,"- Reprises sur dépréciations des actifs circulants: créances, stocks et en-cours","c/7817",{"$f":"Conso!B97","v":{"v":0,"d":"0.00 €"}}]
[null,null,"- Autres reprises sur dépréciations et provisions","c/786, c/7875, c/7876",{"$f":"Conso!B98","v":{"v":0,"d":"0.00 €"}}]
[null,null,"- Utilisations de fonds reportés et de fonds dédiés (ESSMS privés), sauf c/78921","c/789 (hors c/78921)",{"$f":"Conso!B99","v":{"v":0,"d":"0.00 €"}}]
[null,"CAPACITE OU INSUFFISANCE D'AUTOFINANCEMENT (CAF ou IAF)",null,null,{"$f":"E5+E6-E17","v":{"v":0,"d":"0.00 €"}}]
[null,null,"Dont montant affectant le FRI",null,{"$f":"E7+E8+E9+E10+E11-E18-E19-E20-E21-E22-E23","v":{"v":0,"d":"0.00 €"}}]
[null,null,"Dont montant affectant le FRE",null,{"$f":"E5+E12+E13+E14+E15+E16-E24-E25-E26-E27-E28","v":{"v":0,"d":"0.00 €"}}]
[]
[null,"(1) : Montant précédé du signe \"-\" pour un déficit "]

{"sheet":"TFP","index":15,"n_rows":52,"n_cols":6,"rows_kept":52,"hidden":true,"merged":[[1,1,1,5],[3,1,3,2],[23,1,23,2]]}
[]
[null,"Tableau de financement prévisionnel"]
[]
[null,"Ressources",null,{"$f":"IF(CREPASIDEN___ANNEEREF___ANN0\\_________=\"\",\"Réel N-2\",\"Réel \"&(CREPASIDEN___ANNEEREF___ANN0\\_________-2))","v":"Réel N-2"},{"$f":"IF(CREPASIDEN___ANNEEREF___ANN0\\_________=\"\",\"Anticipé ou réel N-1 (1)\",\"Anticipé ou réel \"&(CREPASIDEN___ANNEEREF___ANN0\\_________-1)&\" (1)\")","v":"Anticipé ou réel N-1 (1)"},{"$f":"IF(CREPASIDEN___ANNEEREF___ANN0\\_________=\"\",\"Exercice N\",\"Exercice \"&CREPASIDEN___ANNEEREF___ANN0\\_________)","v":"Exercice N"}]
[null,"N° de comptes","Libellés"]
[null,null,"Capacité d'autofinancement",{"$f":"IF(Ratios_financiers!I7<=0,0,Ratios_financiers!I7)","v":{"v":0,"d":"0.00 €"}},{"$f":"IF(PGFP!D44<=0,0,PGFP!D44)","v":{"v":0,"d":"0.00 €"}},{"$f":"IF(CAF_détaillée!E29<=0,0,CAF_détaillée!E29)","v":{"v":0,"d":"0.00 €"}}]
[null,null,"Titre 1 : Augmentation des capitaux propres :"]
[null,10,"Fonds associatifs, Apports, dotations et réserves (ESSMS publics) / Fonds propres et réserves (ESSMS privés) - (sauf compte 106)"]
[null,13,"Subventions d'investissement (sauf 139)"]
[null,null,"Titre 2: Augmentation des dettes financières :"]
[null,16,"Emprunts et dettes assimilées (sauf 165 (2))"]
[null,165,"Dépots et cautionnements reçus (2)"]
[null,18,"Comptes de liaison affectés à l'investissement (ressources) (2)"]
[null,null,"Titre 3 : Autres ressources :"]
[null,17,"Dettes rattachées à des participations (2)"]
[null,27,"Autres immobilisations financières (sauf 271, 272, 273 et 2768)"]
[null,"757/775","Produits des cessions d'éléments d'actif",null,null,{"$f":"CAF_détaillée!E18","v":{"v":0,"d":"0.00 €"}}]
[null,"070","Annulations de mandats sur exercices clos (3)"]
[null,null,"TOTAL DES RESSOURCES",{"$f":"D6+D8+D9+D11+D12+D13+D15+D16+D17+D18","v":{"v":0,"d":"0.00 €"}},{"$f":"E6+E8+E9+E11+E12+E13+E15+E16+E17+E18","v":{"v":0,"d":"0.00 €"}},{"$f":"F6+F8+F9+F11+F12+F13+F15+F16+F17+F18","v":{"v":0,"d":"0.00 €"}}]
[null,null,"PRELEVEMENT SUR LE FONDS DE ROULEMENT",{"$f":"IF((D19-D47)>0,0,D47-D19)","v":{"v":0,"d":"0.00 €"}},{"$f":"IF((E19-E47)>0,0,E47-E19)","v":{"v":0,"d":"0.00 €"}},{"$f":"IF((F19-F47)>0,0,F47-F19)","v":{"v":0,"d":"0.00 €"}}]
[null,null,"TOTAL EQUILIBRE DU TABLEAU DE FINANCEMENT",{"$f":"D19+D20","v":{"v":0,"d":"0.00 €"}},{"$f":"E19+E20","v":{"v":0,"d":"0.00 €"}},{"$f":"F19+F20","v":{"v":0,"d":"0.00 €"}}]
[]
[]
[null,"Emplois",null,{"$f":"IF(CREPASIDEN___ANNEEREF___ANN0\\_________=\"\",\"Réel N-2\",\"Réel \"&(CREPASIDEN___ANNEEREF___ANN0\\_________-2))","v":"Réel N-2"},{"$f":"IF(CREPASIDEN___ANNEEREF___ANN0\\_________=\"\",\"Anticipé ou réel N-1 (1)\",\"Anticipé ou réel \"&(CREPASIDEN___ANNEEREF___ANN0\\_________-1)&\" (1)\")","v":"Anticipé ou réel N-1 (1)"},{"$f":"IF(CREPASIDEN___ANNEEREF___ANN0\\_________=\"\",\"Exercice N\",\"Exercice \"&CREPASIDEN___ANNEEREF___ANN0\\_________)","v":"Exercice N"}]
[null,"N° de comptes","Libellés"]
[null,null,"Insuffisance d'autofinancement",{"$f":"IF(Ratios_financiers!I7>0,0,-Ratios_financiers!I7)","v":{"v":0,"d":"0.00 €"}},{"$f":"IF(PGFP!D44>0,0,-PGFP!D44)","v":{"v":0,"d":"0.00 €"}},{"$f":"IF(CAF_détaillée!E29>0,0,-CAF_détaillée!E29)","v":{"v":0,"d":"0.00 €"}}]
[null,10,"Fonds propres et réserves - Réduction (sauf 106) (2)"]
[null,null,"Titre 1 : Remboursement des dettes financières :"]
[null,16,"Emprunts et dettes assimilées (sauf 165(2))"]
[null,165,"Dépôts et cautionnements reçus (remboursements aux usagers) (2)"]
[null,17,"Dettes rattachées à des participations (2)"]
[null,18,"Comptes de liaison affectés à l'investissement (emplois) (2)"]
[null,null,"Titre 2 : Acquisition d'éléments de l'actif immobilisé :"]
[null,20,"Immobilisations incorporelles"]
[null,21,"Immobilisations corporelles",{"$f":"SUM(D36:D40)","v":{"v":0,"d":"0.00 €"}},{"$f":"SUM(E36:E40)","v":{"v":0,"d":"0.00 €"}},{"$f":"SUM(F36:F40)","v":{"v":0,"d":"0.00 €"}}]
[null,null,"- dont terrains"]
[null,null,"- dont agencements de terrains"]
[null,null,"- dont constructions"]
[null,null,"- dont installations techniques, matériel et outillage"]
[null,null,"- dont autres immobilisations corporelles"]
[null,23,"Immobilisations en cours"]
[null,26,"Participations et créances rattachées à des participations"]
[null,27,"Autres immobilisations financières (sauf 2768)"]
[null,null,"Titres 3 : Autres emplois :"]
[null,481,"Charges à répartir sur plusieurs exercices (augmentation)"]
[null,"071","Annulation de titres sur exercices clos (3)"]
[null,null,"TOTAL DES EMPLOIS",{"$f":"D26+D27+D29+D30+D31+D32+D34+D35+D41+D42+D43+D45+D46","v":{"v":0,"d":"0.00 €"}},{"$f":"E26+E27+E29+E30+E31+E32+E34+E35+E41+E42+E43+E45+E46","v":{"v":0,"d":"0.00 €"}},{"$f":"F26+F27+F29+F30+F31+F32+F34+F35+F41+F42+F43+F45+F46","v":{"v":0,"d":"0.00 €"}}]
[null,null,"APPORT AU FONDS DE ROULEMENT",{"$f":"IF((D47-D19)>0,0,D19-D47)","v":{"v":0,"d":"0.00 €"}},{"$f":"IF((E47-E19)>0,0,E19-E47)","v":{"v":0,"d":"0.00 €"}},{"$f":"IF((F47-F19)>0,0,F19-F47)","v":{"v":0,"d":"0.00 €"}}]
[null,null,"TOTAL EQUILIBRE DU TABLEAU DE FINANCEMENT",{"$f":"D47+D48","v":{"v":0,"d":"0.00 €"}},{"$f":"E47+E48","v":{"v":0,"d":"0.00 €"}},{"$f":"F47+F48","v":{"v":0,"d":"0.00 €"}}]
[null,null,"(1): Anticipé pour les EPRD établis au 31 octobre N-1"]
[null,null,"(2) : ESSMS privés seulement"]
[null,null,"(3) : ESSMS publics seulement"]

{"sheet":"CRP_PGFP","index":16,"n_rows":157,"n_cols":11,"rows_kept":157,"hidden":true,"merged":[[1,1,1,10],[3,3,3,5],[4,3,4,5]]}
[]
[null,"Modèle de compte de résultat prévisionnel du plan global de financement pluriannuel (1 CRP par ESSMS)"]
[]
[null,null,"FINESS ET"]
[null,null,"Raison sociale"]
[]
[]
[null,null,"Postes",{"$f":"IF(CREPASIDEN___ANNEEREF___ANN0\\_________=\"\",\"N-1\",CREPASIDEN___ANNEEREF___ANN0\\_________-1)","v":"N-1"},{"$f":"IF(CREPASIDEN___ANNEEREF___ANN0\\_________=\"\",\"N\",CREPASIDEN___ANNEEREF___ANN0\\_________)","v":"N"},{"$f":"IF(CREPASIDEN___ANNEEREF___ANN0\\_________=\"\",\"N+1\",CREPASIDEN___ANNEEREF___ANN0\\_________+1)","v":"N+1"},{"$f":"IF(CREPASIDEN___ANNEEREF___ANN0\\_________=\"\",\"N+2\",CREPASIDEN___ANNEEREF___ANN0\\_________+2)","v":"N+2"},{"$f":"IF(CREPASIDEN___ANNEEREF___ANN0\\_________=\"\",\"N+3\",CREPASIDEN___ANNEEREF___ANN0\\_________+3)","v":"N+3"},{"$f":"IF(CREPASIDEN___ANNEEREF___ANN0\\_________=\"\",\"N+4\",CREPASIDEN___ANNEEREF___ANN0\\_________+4)","v":"N+4"},{"$f":"IF(CREPASIDEN___ANNEEREF___ANN0\\_________=\"\",\"N+5\",CREPASIDEN___ANNEEREF___ANN0\\_________+5)","v":"N+5"},{"$f":"IF(CREPASIDEN___ANNEEREF___ANN0\\_________=\"\",\"N+6\",CREPASIDEN___ANNEEREF___ANN0\\_________+6)","v":"N+6"}]
[null,null,"GROUPE I   Charges afférentes à l'exploitation courante",{"$f":"'CRPP NON SOUMIS EQUIL'!$E$34+'CRPP SOUMIS EQUILIBRE'!$E$34","v":{"v":0,"d":"0.00 €"}},{"$f":"'CRPP NON SOUMIS EQUIL'!$F$34+'CRPP SOUMIS EQUILIBRE'!$F$34","v":{"v":0,"d":"0.00 €"}},{"$f":"E9+F10","v":{"v":0,"d":"0.00 €"}},{"v":0,"d":"0.00 €"},{"v":0,"d":"0.00 €"},{"v":0,"d":"0.00 €"},{"v":0,"d":"0.00 €"},{"v":0,"d":"0.00 €"}]
[null,null,"Variations annuelles des charges du groupe 1 (plusieurs lignes si nécessaire)",null,null,{"$f":"SUM(F11:F12)","v":{"v":0,"d":"0.00 €"}},{"v":0,"d":"0.00 €"},{"v":0,"d":"0.00 €"},{"v":0,"d":"0.00 €"},{"v":0,"d":"0.00 €"},{"v":0,"d":"0.00 €"}]
[]
[]
[null,null,"GROUPE II  Charges afférentes au personnel",{"$f":"'CRPP NON SOUMIS EQUIL'!$E$51+'CRPP SOUMIS EQUILIBRE'!$E$51","v":{"v":0,"d":"0.00 €"}},{"$f":"'CRPP NON SOUMIS EQUIL'!$F$51+'CRPP SOUMIS EQUILIBRE'!$F$51","v":{"v":0,"d":"0.00 €"}},{"$f":"E13+F14+F15","v":{"v":0,"d":"0.00 €"}},{"v":0,"d":"0.00 €"},{"v":0,"d":"0.00 €"},{"v":0,"d":"0.00 €"},{"v":0,"d":"0.00 €"},{"v":0,"d":"0.00 €"}]
[null,null,"Variations annuelles des charges du groupe 2 (comptes 621 et 622)"]
[null,null,"Recrutements et autres variations de charges de personnel (plusieurs lignes si nécessaire)",null,null,{"$f":"SUM(F16:F17)","v":{"v":0,"d":"0.00 €"}},{"v":0,"d":"0.00 €"},{"v":0,"d":"0.00 €"},{"v":0,"d":"0.00 €"},{"v":0,"d":"0.00 €"},{"v":0,"d":"0.00 €"}]
[]
[]
[null,null,"GROUPE III Charges afférentes à la structure                                      ",{"$f":"'CRPP NON SOUMIS EQUIL'!$E$106+'CRPP SOUMIS EQUILIBRE'!$E$108","v":{"v":0,"d":"0.00 €"}},{"$f":"'CRPP NON SOUMIS EQUIL'!$F$106+'CRPP SOUMIS EQUILIBRE'!$F$108","v":{"v":0,"d":"0.00 €"}},{"$f":"SUM(F19,F21:F39)","v":{"v":0,"d":"0.00 €"}},{"v":0,"d":"0.00 €"},{"v":0,"d":"0.00 €"},{"v":0,"d":"0.00 €"},{"v":0,"d":"0.00 €"},{"v":0,"d":"0.00 €"}]
[null,null,"Charges du groupe 3 - c/61 et c/62 (1) (hors c/615 ci-après)",{"$f":"'CRPP NON SOUMIS EQUIL'!$E$56+'CRPP NON SOUMIS EQUIL'!$E$57+'CRPP NON SOUMIS EQUIL'!$E$58+'CRPP NON SOUMIS EQUIL'!$E$60+'CRPP NON SOUMIS EQUIL'!$E$61+'CRPP NON SOUMIS EQUIL'!$E$62+'CRPP NON SOUMIS EQUIL'!$E$63+'CRPP NON SOUMIS EQUIL'!$E$64+'CRPP SOUMIS EQUILIBRE'!$E$58+'CRPP SOUMIS EQUILIBRE'!$E$59+'CRPP SOUMIS EQUILIBRE'!$E$60+'CRPP SOUMIS EQUILIBRE'!$E$62+'CRPP SOUMIS EQUILIBRE'!$E$63+'CRPP SOUMIS EQUILIBRE'!$E$64+'CRPP SOUMIS EQUILIBRE'!$E$65+'CRPP SOUMIS EQUILIBRE'!$E$66","v":{"v":0,"d":"0.00 €"}},{"$f":"'CRPP NON SOUMIS EQUIL'!$F$56+'CRPP NON SOUMIS EQUIL'!$F$57+'CRPP NON SOUMIS EQUIL'!$F$58+'CRPP NON SOUMIS EQUIL'!$F$60+'CRPP NON SOUMIS EQUIL'!$F$61+'CRPP NON SOUMIS EQUIL'!$F$62+'CRPP NON SOUMIS EQUIL'!$F$63+'CRPP NON SOUMIS EQUIL'!$F$64+'CRPP SOUMIS EQUILIBRE'!$F$58+'CRPP SOUMIS EQUILIBRE'!$F$59+'CRPP SOUMIS EQUILIBRE'!$F$60+'CRPP SOUMIS EQUILIBRE'!$F$62+'CRPP SOUMIS EQUILIBRE'!$F$63+'CRPP SOUMIS EQUILIBRE'!$F$64+'CRPP SOUMIS EQUILIBRE'!$F$65+'CRPP SOUMIS EQUILIBRE'!$F$66","v":{"v":0,"d":"0.00 €"}}]
[]
[null,null,"Charges du groupe 3 - c/63 (1)",{"$f":"'CRPP NON SOUMIS EQUIL'!$E$65+'CRPP NON SOUMIS EQUIL'!$E$66+'CRPP SOUMIS EQUILIBRE'!$E$67+'CRPP SOUMIS EQUILIBRE'!$E$68","v":{"v":0,"d":"0.00 €"}},{"$f":"'CRPP NON SOUMIS EQUIL'!$F$65+'CRPP NON SOUMIS EQUIL'!$F$66+'CRPP SOUMIS EQUILIBRE'!$F$67+'CRPP SOUMIS EQUILIBRE'!$F$68","v":{"v":0,"d":"0.00 €"}}]
[null,null,"Charges du groupe 3 - c/65 (1) (hors c/652)",{"$f":"'CRPP NON SOUMIS EQUIL'!$E$69+'CRPP NON SOUMIS EQUIL'!$E$71+'CRPP NON SOUMIS EQUIL'!$E$72+'CRPP NON SOUMIS EQUIL'!$E$73+'CRPP NON SOUMIS EQUIL'!$E$74+'CRPP NON SOUMIS EQUIL'!$E$75+'CRPP SOUMIS EQUILIBRE'!$E$71+'CRPP SOUMIS EQUILIBRE'!$E$73+'CRPP SOUMIS EQUILIBRE'!$E$74+'CRPP SOUMIS EQUILIBRE'!$E$75+'CRPP SOUMIS EQUILIBRE'!$E$76+'CRPP SOUMIS EQUILIBRE'!$E$77","v":{"v":0,"d":"0.00 €"}},{"$f":" 'CRPP NON SOUMIS EQUIL'!$F$69+'CRPP NON SOUMIS EQUIL'!$F$71+'CRPP NON SOUMIS EQUIL'!$F$72+'CRPP NON SOUMIS EQUIL'!$F$73+'CRPP NON SOUMIS EQUIL'!$F$74+'CRPP NON SOUMIS EQUIL'!$F$75+'CRPP SOUMIS EQUILIBRE'!$F$71+'CRPP SOUMIS EQUILIBRE'!$F$73+'CRPP SOUMIS EQUILIBRE'!$F$74+'CRPP SOUMIS EQUILIBRE'!$F$75+'CRPP SOUMIS EQUILIBRE'!$F$76+'CRPP SOUMIS EQUILIBRE'!$F$77","v":{"v":0,"d":"0.00 €"}}]
[null,null,"Charges d'entretien réparation (1)",{"$f":"'CRPP NON SOUMIS EQUIL'!$E$59+'CRPP SOUMIS EQUILIBRE'!$E$61","v":{"v":0,"d":"0.00 €"}},{"$f":"'CRPP NON SOUMIS EQUIL'!$F$59+'CRPP SOUMIS EQUILIBRE'!$F$61","v":{"v":0,"d":"0.00 €"}}]
[null,null,"Charges exceptionnelles décaissables"]
[null,"FRI","Valeurs comptables des immobilisations incorporelles et corporelles cédées",{"$f":"'CRPP NON SOUMIS EQUIL'!$E$70+'CRPP NON SOUMIS EQUIL'!$E$83+'CRPP SOUMIS EQUILIBRE'!$E$72+'CRPP SOUMIS EQUILIBRE'!$E$85","v":{"v":0,"d":"0.00 €"}},{"$f":"'CRPP NON SOUMIS EQUIL'!$F$70+'CRPP NON SOUMIS EQUIL'!$F$83+'CRPP SOUMIS EQUILIBRE'!$F$72+'CRPP SOUMIS EQUILIBRE'!$F$85","v":{"v":0,"d":"0.00 €"}}]
[null,"FRI","Dotations aux amortissements des immobilisations acquises avant le 1/1/N",{"$f":"'CRPP NON SOUMIS EQUIL'!$E$87+'CRPP SOUMIS EQUILIBRE'!$E$89","v":{"v":0,"d":"0.00 €"}},{"$f":"'CRPP NON SOUMIS EQUIL'!$F$87+'CRPP SOUMIS EQUILIBRE'!$F$89","v":{"v":0,"d":"0.00 €"}}]
[null,"FRI","Dotations aux amortissements des immobilisations sur acquisitions nouvelles"]
[null,"FRI","Dotations aux amortissements des charges d'exploitation à répartir",{"$f":"'CRPP NON SOUMIS EQUIL'!$E$88+'CRPP SOUMIS EQUILIBRE'!$E$90","v":{"v":0,"d":"0.00 €"}},{"$f":"'CRPP NON SOUMIS EQUIL'!$F$88+'CRPP SOUMIS EQUILIBRE'!$F$90","v":{"v":0,"d":"0.00 €"}}]
[null,"FRI","Dotations aux amortissements dérogatoires, amortissements exceptionnels et dépréciations des immobilisations",{"$f":"'CRPP NON SOUMIS EQUIL'!$E$90+'CRPP NON SOUMIS EQUIL'!$E$93+'CRPP NON SOUMIS EQUIL'!$E$94+'CRPP SOUMIS EQUILIBRE'!$E$92+'CRPP SOUMIS EQUILIBRE'!$E$95+'CRPP SOUMIS EQUILIBRE'!$E$96","v":{"v":0,"d":"0.00 €"}},{"$f":"'CRPP NON SOUMIS EQUIL'!$F$90+'CRPP NON SOUMIS EQUIL'!$F$93+'CRPP NON SOUMIS EQUIL'!$F$94+'CRPP SOUMIS EQUILIBRE'!$F$92+'CRPP SOUMIS EQUILIBRE'!$F$95+'CRPP SOUMIS EQUILIBRE'!$F$96","v":{"v":0,"d":"0.00 €"}}]
[null,"FRI","Dotations aux provisions réglementées pour renouvellement des immobilisations",{"$f":"'CRPP NON SOUMIS EQUIL'!$E$96+'CRPP SOUMIS EQUILIBRE'!$E$98","v":{"v":0,"d":"0.00 €"}},{"$f":"'CRPP NON SOUMIS EQUIL'!$F$96+'CRPP SOUMIS EQUILIBRE'!$F$98","v":{"v":0,"d":"0.00 €"}}]
[null,"FRI","Dotations aux provisions réglementées : réserves des plus-values nettes d'actif (ESSMS privés)",{"$f":"'CRPP NON SOUMIS EQUIL'!$E$97+'CRPP SOUMIS EQUILIBRE'!$E$99","v":{"v":0,"d":"0.00 €"}},{"$f":"'CRPP NON SOUMIS EQUIL'!$F$97+'CRPP SOUMIS EQUILIBRE'!$F$99","v":{"v":0,"d":"0.00 €"}}]
[null,"FRI","Dotations aux autres provisions réglementées / Autres (c/68748)",{"$f":"'CRPP NON SOUMIS EQUIL'!$E$98+'CRPP SOUMIS EQUILIBRE'!$E$100","v":{"v":0,"d":"0.00 €"}},{"$f":"'CRPP NON SOUMIS EQUIL'!$F$98+'CRPP SOUMIS EQUILIBRE'!$F$100","v":{"v":0,"d":"0.00 €"}}]
[null,"FRI","Reports en fonds dédiés à l'investissement sur concours publics des entités gestionnaires d'ESSMS (c/68921) - ESSMS privés",{"$f":"'CRPP NON SOUMIS EQUIL'!$E$102+'CRPP SOUMIS EQUILIBRE'!$E$104","v":{"v":0,"d":"0.00 €"}},{"$f":"'CRPP NON SOUMIS EQUIL'!$F$102+'CRPP SOUMIS EQUILIBRE'!$F$104","v":{"v":0,"d":"0.00 €"}}]
[null,"FRE","Dotations aux provisions réglementées destinées à renforcer la couverture du BFR",{"$f":"'CRPP NON SOUMIS EQUIL'!$E$95+'CRPP SOUMIS EQUILIBRE'!$E$97","v":{"v":0,"d":"0.00 €"}},{"$f":"'CRPP NON SOUMIS EQUIL'!$F$95+'CRPP SOUMIS EQUILIBRE'!$F$97","v":{"v":0,"d":"0.00 €"}}]
[null,"FRE","Dotations aux provisions des charges d'exploitation",{"$f":"'CRPP NON SOUMIS EQUIL'!$E$89+'CRPP SOUMIS EQUILIBRE'!$E$91","v":{"v":0,"d":"0.00 €"}},{"$f":"'CRPP NON SOUMIS EQUIL'!$F$89+'CRPP SOUMIS EQUILIBRE'!$F$91","v":{"v":0,"d":"0.00 €"}}]
[null,"FRE","Dotations aux autres amortissements, provisions et dépréciations",{"$f":"'CRPP NON SOUMIS EQUIL'!$E$91+'CRPP NON SOUMIS EQUIL'!$E$92+'CRPP NON SOUMIS EQUIL'!$E$99+'CRPP NON SOUMIS EQUIL'!$E$100+'CRPP SOUMIS EQUILIBRE'!$E$93+'CRPP SOUMIS EQUILIBRE'!$E$94+'CRPP SOUMIS EQUILIBRE'!$E$101+'CRPP SOUMIS EQUILIBRE'!$E$102","v":{"v":0,"d":"0.00 €"}},{"$f":"'CRPP NON SOUMIS EQUIL'!$F$91+'CRPP NON SOUMIS EQUIL'!$F$92+'CRPP NON SOUMIS EQUIL'!$F$99+'CRPP NON SOUMIS EQUIL'!$F$100+'CRPP SOUMIS EQUILIBRE'!$F$93+'CRPP SOUMIS EQUILIBRE'!$F$94+'CRPP SOUMIS EQUILIBRE'!$F$101+'CRPP SOUMIS EQUILIBRE'!$F$102","v":{"v":0,"d":"0.00 €"}}]
[null,"FRE","Reports en fonds dédiés (sauf c/68921) - ESSMS privés",{"$f":"'CRPP NON SOUMIS EQUIL'!$E$101+'CRPP NON SOUMIS EQUIL'!$E$103+'CRPP NON SOUMIS EQUIL'!$E$104+'CRPP SOUMIS EQUILIBRE'!$E$103+'CRPP SOUMIS EQUILIBRE'!$E$105+'CRPP SOUMIS EQUILIBRE'!$E$106","v":{"v":0,"d":"0.00 €"}},{"$f":"'CRPP NON SOUMIS EQUIL'!$F$101+'CRPP NON SOUMIS EQUIL'!$F$103+'CRPP NON SOUMIS EQUIL'!$F$104+'CRPP SOUMIS EQUILIBRE'!$F$103+'CRPP SOUMIS EQUILIBRE'!$F$105+'CRPP SOUMIS EQUILIBRE'!$F$106","v":{"v":0,"d":"0.00 €"}}]
[null,null,"Frais financiers des emprunts antérieurs à l'année N",{"$f":"'CRPP NON SOUMIS EQUIL'!$E$78+'CRPP SOUMIS EQUILIBRE'!$E$80","v":{"v":0,"d":"0.00 €"}},{"$f":"'CRPP NON SOUMIS EQUIL'!$F$78+'CRPP SOUMIS EQUILIBRE'!$F$80","v":{"v":0,"d":"0.00 €"}}]
[null,null,"Frais financiers des emprunts nouveaux"]
[null,null,"A- Total des charges de l'exercice",{"$f":"'CRPP NON SOUMIS EQUIL'!$E$108+'CRPP SOUMIS EQUILIBRE'!$E$110","v":{"v":0,"d":"0.00 €"}},{"$f":"'CRPP NON SOUMIS EQUIL'!$F$108+'CRPP SOUMIS EQUILIBRE'!$F$110","v":{"v":0,"d":"0.00 €"}},{"$f":"F9+F13+F18","v":{"v":0,"d":"0.00 €"}},{"v":0,"d":"0.00 €"},{"v":0,"d":"0.00 €"},{"v":0,"d":"0.00 €"},{"v":0,"d":"0.00 €"},{"v":0,"d":"0.00 €"}]
[null,null,"RESULTAT PREVISIONNEL EXCEDENTAIRE (B - A)",{"$f":"IF('CRPP SOUMIS EQUILIBRE'!$E$190<'CRPP SOUMIS EQUILIBRE'!$E$110,'CRPP NON SOUMIS EQUIL'!$E$110,'CRPP NON SOUMIS EQUIL'!$E$110+'CRPP SOUMIS EQUILIBRE'!$E$190 -'CRPP SOUMIS EQUILIBRE'!$E$110)","v":{"v":0,"d":"0.00 €"}},{"$f":"IF('CRPP SOUMIS EQUILIBRE'!$F$190<'CRPP SOUMIS EQUILIBRE'!$F$110,'CRPP NON SOUMIS EQUIL'!$F$110,'CRPP NON SOUMIS EQUIL'!$F$110+'CRPP SOUMIS EQUILIBRE'!$F$190 -'CRPP SOUMIS EQUILIBRE'!$F$110)","v":{"v":0,"d":"0.00 €"}},{"$f":"IF(F77-F40<0,0,F77-F40)","v":{"v":0,"d":"0.00 €"}},{"v":0,"d":"0.00 €"},{"v":0,"d":"0.00 €"},{"v":0,"d":"0.00 €"},{"v":0,"d":"0.00 €"},{"v":0,"d":"0.00 €"}]
[null,null,"Reprise de déficits antérieurs et reports au titre des amortissements comptables excédentaires différés",{"$f":"'CRPP NON SOUMIS EQUIL'!$E$200+'CRPP SOUMIS EQUILIBRE'!$E$112+'CRPP SOUMIS EQUILIBRE'!$E$113","v":{"v":0,"d":"0.00 €"}},{"$f":"'CRPP NON SOUMIS EQUIL'!$F$200+'CRPP SOUMIS EQUILIBRE'!$F$112+'CRPP SOUMIS EQUILIBRE'!$F$113","v":{"v":0,"d":"0.00 €"}}]
[null,null,"TOTAL EQUILIBRE GENERAL",{"$f":"+'CRPP NON SOUMIS EQUIL'!$E$112+'CRPP SOUMIS EQUILIBRE'!$E$115","v":{"v":0,"d":"0.00 €"}},{"$f":"+'CRPP NON SOUMIS EQUIL'!$F$112+'CRPP SOUMIS EQUILIBRE'!$F$115","v":{"v":0,"d":"0.00 €"}},{"$f":"IF((F41-F42-F78+F79+F80)=0,F40+F42,F40+F41)","v":{"v":0,"d":"0.00 €"}},{"v":0,"d":"0.00 €"},{"v":0,"d":"0.00 €"},{"v":0,"d":"0.00 €"},{"v":0,"d":"0.00 €"},{"v":0,"d":"0.00 €"}]
[]
[null,null,"(1): A retenir pour le calcul de la marge brute"]
[null,null,"Postes",{"$f":"IF(CREPASIDEN___ANNEEREF___ANN0\\_________=\"\",\"N-1\",CREPASIDEN___ANNEEREF___ANN0\\_________-1)","v":"N-1"},{"$f":"IF(CREPASIDEN___ANNEEREF___ANN0\\_________=\"\",\"N\",CREPASIDEN___ANNEEREF___ANN0\\_________)","v":"N"},{"$f":"IF(CREPASIDEN___ANNEEREF___ANN0\\_________=\"\",\"N+1\",CREPASIDEN___ANNEEREF___ANN0\\_________+1)","v":"N+1"},{"$f":"IF(CREPASIDEN___ANNEEREF___ANN0\\_________=\"\",\"N+2\",CREPASIDEN___ANNEEREF___ANN0\\_________+2)","v":"N+2"},{"$f":"IF(CREPASIDEN___ANNEEREF___ANN0\\_________=\"\",\"N+3\",CREPASIDEN___ANNEEREF___ANN0\\_________+3)","v":"N+3"},{"$f":"IF(CREPASIDEN___ANNEEREF___ANN0\\_________=\"\",\"N+4\",CREPASIDEN___ANNEEREF___ANN0\\_________+4)","v":"N+4"},{"$f":"IF(CREPASIDEN___ANNEEREF___ANN0\\_________=\"\",\"N+5\",CREPASIDEN___ANNEEREF___ANN0\\_________+5)","v":"N+5"},{"$f":"IF(CREPASIDEN___ANNEEREF___ANN0\\_________=\"\",\"N+6\",CREPASIDEN___ANNEEREF___ANN0\\_________+6)","v":"N+6"}]
[null,null,"GROUPE I Produits de la tarification",{"$f":"'CRPP NON SOUMIS EQUIL'!$E$131+'CRPP SOUMIS EQUILIBRE'!$E$129","v":{"v":0,"d":"0.00 €"}},{"$f":"'CRPP NON SOUMIS EQUIL'!$F$131+'CRPP SOUMIS EQUILIBRE'!$F$129","v":{"v":0,"d":"0.00 €"}},{"$f":"SUM(F48:F52)","v":{"v":0,"d":"0.00 €"}},{"v":0,"d":"0.00 €"},{"v":0,"d":"0.00 €"},{"v":0,"d":"0.00 €"},{"v":0,"d":"0.00 €"},{"v":0,"d":"0.00 €"}]
[null,null,"Produits à la charge de l'Etat",{"$f":"'CRPP NON SOUMIS EQUIL'!$E$121+'CRPP SOUMIS EQUILIBRE'!$E$123","v":{"v":0,"d":"0.00 €"}},{"$f":"'CRPP NON SOUMIS EQUIL'!$F$121+'CRPP SOUMIS EQUILIBRE'!$F$123","v":{"v":0,"d":"0.00 €"}}]
[null,null,"Produits à la charge de l'assurance maladie",{"$f":"'CRPP NON SOUMIS EQUIL'!$E$119+'CRPP NON SOUMIS EQUIL'!$E$120+'CRPP NON SOUMIS EQUIL'!$E$125+'CRPP SOUMIS EQUILIBRE'!$E$121+'CRPP SOUMIS EQUILIBRE'!$E$122","v":{"v":0,"d":"0.00 €"}},{"$f":"'CRPP NON SOUMIS EQUIL'!$F$119+'CRPP NON SOUMIS EQUIL'!$F$120+'CRPP NON SOUMIS EQUIL'!$F$125+'CRPP SOUMIS EQUILIBRE'!$F$121+'CRPP SOUMIS EQUILIBRE'!$F$122","v":{"v":0,"d":"0.00 €"}}]
[null,null,"Produits à la charge du département",{"$f":"'CRPP NON SOUMIS EQUIL'!$E$122+'CRPP NON SOUMIS EQUIL'!$E$123+'CRPP NON SOUMIS EQUIL'!$E$126+'CRPP SOUMIS EQUILIBRE'!$E$124+'CRPP SOUMIS EQUILIBRE'!$E$125","v":{"v":0,"d":"0.00 €"}},{"$f":"'CRPP NON SOUMIS EQUIL'!$F$122+'CRPP NON SOUMIS EQUIL'!$F$123+'CRPP NON SOUMIS EQUIL'!$F$126+'CRPP SOUMIS EQUILIBRE'!$F$124+'CRPP SOUMIS EQUILIBRE'!$F$125","v":{"v":0,"d":"0.00 €"}}]
[null,null,"Produits à la charge de l'usager",{"$f":"'CRPP NON SOUMIS EQUIL'!$E$124+'CRPP NON SOUMIS EQUIL'!$E$127+'CRPP SOUMIS EQUILIBRE'!$E$126","v":{"v":0,"d":"0.00 €"}},{"$f":"'CRPP NON SOUMIS EQUIL'!$F$124+'CRPP NON SOUMIS EQUIL'!$F$127+'CRPP SOUMIS EQUILIBRE'!$F$126","v":{"v":0,"d":"0.00 €"}}]
[null,null,"Produits à la charge d'autres financeurs",{"$f":"'CRPP NON SOUMIS EQUIL'!$E$128+'CRPP NON SOUMIS EQUIL'!$E$129+'CRPP SOUMIS EQUILIBRE'!$E$127","v":{"v":0,"d":"0.00 €"}},{"$f":"'CRPP NON SOUMIS EQUIL'!$F$128+'CRPP NON SOUMIS EQUIL'!$F$129+'CRPP SOUMIS EQUILIBRE'!$F$127","v":{"v":0,"d":"0.00 €"}}]
[null,null,"Dont aides ponctuelles par dotations non reconductibles (une ligne par financeur) : ARS"]
[null,null,"Dont aides ponctuelles par dotations non reconductibles (une ligne par financeur) : Préfets"]
[null,null,"Dont aides ponctuelles par dotations non reconductibles (une ligne par financeur) : Conseils départementaux"]
[null,null,"GROUPE II Autres produits relatifs à l'exploitation hors c/747 et 757",{"$f":"'CRPP NON SOUMIS EQUIL'!$E$158+'CRPP SOUMIS EQUILIBRE'!$E$155-'CRPP NON SOUMIS EQUIL'!$E$144-'CRPP NON SOUMIS EQUIL'!$E$146-'CRPP SOUMIS EQUILIBRE'!$E$141-'CRPP SOUMIS EQUILIBRE'!$E$143","v":{"v":0,"d":"0.00 €"}},{"$f":"'CRPP NON SOUMIS EQUIL'!$F$158+'CRPP SOUMIS EQUILIBRE'!$F$155-'CRPP NON SOUMIS EQUIL'!$F$144-'CRPP NON SOUMIS EQUIL'!$F$146-'CRPP SOUMIS EQUILIBRE'!$F$141-'CRPP SOUMIS EQUILIBRE'!$F$143","v":{"v":0,"d":"0.00 €"}},{"$f":"E56+F57","v":{"v":0,"d":"0.00 €"}},{"v":0,"d":"0.00 €"},{"v":0,"d":"0.00 €"},{"v":0,"d":"0.00 €"},{"v":0,"d":"0.00 €"},{"v":0,"d":"0.00 €"}]
[null,null,"Variations annuelles des produits du groupe 2 (plusieurs lignes si nécessaire)",null,null,{"$f":"SUM(F58:F59)","v":{"v":0,"d":"0.00 €"}},{"v":0,"d":"0.00 €"},{"v":0,"d":"0.00 €"},{"v":0,"d":"0.00 €"},{"v":0,"d":"0.00 €"},{"v":0,"d":"0.00 €"}]
[]
[]
[null,null,"GROUPE III Produits financiers, produits exceptionnels et produits non encaissables & comptes 747/757",{"$f":"'CRPP NON SOUMIS EQUIL'!$E$192+'CRPP SOUMIS EQUILIBRE'!$E$188+'CRPP NON SOUMIS EQUIL'!$E$144+'CRPP NON SOUMIS EQUIL'!$E$146+'CRPP SOUMIS EQUILIBRE'!$E$141+'CRPP SOUMIS EQUILIBRE'!$E$143","v":{"v":0,"d":"0.00 €"}},{"$f":"'CRPP NON SOUMIS EQUIL'!$F$192+'CRPP SOUMIS EQUILIBRE'!$F$188+'CRPP NON SOUMIS EQUIL'!$F$144+'CRPP NON SOUMIS EQUIL'!$F$146+'CRPP SOUMIS EQUILIBRE'!$F$141+'CRPP SOUMIS EQUILIBRE'!$F$143","v":{"v":0,"d":"0.00 €"}},{"$f":"SUM(F61:F76)","v":{"v":0,"d":"0.00 €"}},{"v":0,"d":"0.00 €"},{"v":0,"d":"0.00 €"},{"v":0,"d":"0.00 €"},{"v":0,"d":"0.00 €"},{"v":0,"d":"0.00 €"}]
[null,null,"Produits du groupe 3 autres que ceux-listés ci-dessous ",{"$f":"'CRPP NON SOUMIS EQUIL'!$E$192-SUM(D62:D76)+'CRPP SOUMIS EQUILIBRE'!$E$188+'CRPP NON SOUMIS EQUIL'!$E$144+'CRPP NON SOUMIS EQUIL'!$E$146+'CRPP SOUMIS EQUILIBRE'!$E$141+'CRPP SOUMIS EQUILIBRE'!$E$143","v":{"v":0,"d":"0.00 €"}},{"$f":"'CRPP NON SOUMIS EQUIL'!$F$192-SUM(E62:E76)+'CRPP SOUMIS EQUILIBRE'!$F$188+'CRPP NON SOUMIS EQUIL'!$F$144+'CRPP NON SOUMIS EQUIL'!$F$146+'CRPP SOUMIS EQUILIBRE'!$F$141+'CRPP SOUMIS EQUILIBRE'!$F$143","v":{"v":0,"d":"0.00 €"}}]
[null,null,"Produits financiers",{"$f":"'CRPP NON SOUMIS EQUIL'!$E$164+'CRPP SOUMIS EQUILIBRE'!$E$160","v":{"v":0,"d":"0.00 €"}},{"$f":"'CRPP NON SOUMIS EQUIL'!$F$164+'CRPP SOUMIS EQUILIBRE'!$F$160","v":{"v":0,"d":"0.00 €"}}]
[null,"FRI","Produits des cessions d'immobilisations incorporelles et corporelles (y compris c/757)",{"$f":"'CRPP NON SOUMIS EQUIL'!$E$146+'CRPP NON SOUMIS EQUIL'!$E$169+'CRPP SOUMIS EQUILIBRE'!$E$143+'CRPP SOUMIS EQUILIBRE'!$E$165","v":{"v":0,"d":"0.00 €"}},{"$f":"'CRPP NON SOUMIS EQUIL'!$F$146+'CRPP NON SOUMIS EQUIL'!$F$169+'CRPP SOUMIS EQUILIBRE'!$F$143+'CRPP SOUMIS EQUILIBRE'!$F$165","v":{"v":0,"d":"0.00 €"}}]
[null,"FRI","Quote-part des subventions d'investissement virée au résultat de l'exercice (y compris c/747)",{"$f":"'CRPP NON SOUMIS EQUIL'!$E$144+'CRPP NON SOUMIS EQUIL'!$E$170+'CRPP SOUMIS EQUILIBRE'!$E$141+'CRPP SOUMIS EQUILIBRE'!$E$166","v":{"v":0,"d":"0.00 €"}},{"$f":"'CRPP NON SOUMIS EQUIL'!$F$144+'CRPP NON SOUMIS EQUIL'!$F$170+'CRPP SOUMIS EQUILIBRE'!$F$141+'CRPP SOUMIS EQUILIBRE'!$F$166","v":{"v":0,"d":"0.00 €"}}]
[null,"FRI",null,{"$f":"'CRPP NON SOUMIS EQUIL'!$E$172+'CRPP SOUMIS EQUILIBRE'!$E$168","v":{"v":0,"d":"0.00 €"}},{"$f":"'CRPP NON SOUMIS EQUIL'!$F$172+'CRPP SOUMIS EQUILIBRE'!$F$168","v":{"v":0,"d":"0.00 €"}}]
[null,"FRI","Reprises sur provisions réglementées pour renouvellement des immobilisations ",{"$f":"'CRPP NON SOUMIS EQUIL'!$E$182+'CRPP SOUMIS EQUILIBRE'!$E$178","v":{"v":0,"d":"0.00 €"}},{"$f":"'CRPP NON SOUMIS EQUIL'!$F$182+'CRPP SOUMIS EQUILIBRE'!$F$178","v":{"v":0,"d":"0.00 €"}}]
[null,"FRI","Reprises sur amortissements dérogatoires",{"$f":"'CRPP NON SOUMIS EQUIL'!$E$180+'CRPP SOUMIS EQUILIBRE'!$E$176","v":{"v":0,"d":"0.00 €"}},{"$f":"'CRPP NON SOUMIS EQUIL'!$F$180+'CRPP SOUMIS EQUILIBRE'!$F$176","v":{"v":0,"d":"0.00 €"}}]
[null,"FRI","Reprises sur provisions réglementées : réserves des plus-values nettes d'actif (ESSMS privés)",{"$f":"'CRPP NON SOUMIS EQUIL'!$E$183+'CRPP SOUMIS EQUILIBRE'!$E$179","v":{"v":0,"d":"0.00 €"}},{"$f":"'CRPP NON SOUMIS EQUIL'!$F$183+'CRPP SOUMIS EQUILIBRE'!$F$179","v":{"v":0,"d":"0.00 €"}}]
[null,"FRI","Reprises sur autres amortissements, autres provisions et dépréciations impactant le FRI",{"$f":"'CRPP NON SOUMIS EQUIL'!$E$175+'CRPP NON SOUMIS EQUIL'!$E$177+'CRPP SOUMIS EQUILIBRE'!$E$171+'CRPP SOUMIS EQUILIBRE'!$E$173","v":{"v":0,"d":"0.00 €"}},{"$f":"'CRPP NON SOUMIS EQUIL'!$F$175+'CRPP NON SOUMIS EQUIL'!$F$177+'CRPP SOUMIS EQUILIBRE'!$F$171+'CRPP SOUMIS EQUILIBRE'!$F$173","v":{"v":0,"d":"0.00 €"}}]
[null,"FRI","Reprises sur autres provisions réglementées / Autres (c/78748)",{"$f":"'CRPP NON SOUMIS EQUIL'!$E$184+'CRPP SOUMIS EQUILIBRE'!$E$180","v":{"v":0,"d":"0.00 €"}},{"$f":"'CRPP NON SOUMIS EQUIL'!$F$184+'CRPP SOUMIS EQUILIBRE'!$F$180","v":{"v":0,"d":"0.00 €"}}]
[null,"FRI","Utilisation des fonds dédiés à l'investissement sur concours publics des entités gestionnaires d'ESSMS (c/78921) - ESSMS privés",{"$f":"'CRPP NON SOUMIS EQUIL'!$E$187+'CRPP SOUMIS EQUILIBRE'!$E$183","v":{"v":0,"d":"0.00 €"}},{"$f":"'CRPP NON SOUMIS EQUIL'!$F$187+'CRPP SOUMIS EQUILIBRE'!$F$183","v":{"v":0,"d":"0.00 €"}}]
[null,"FRE","Reprises sur provisions réglementées destinées à renforcer la couverture du besoin en fonds de roulement",{"$f":"'CRPP NON SOUMIS EQUIL'!$E$181+'CRPP SOUMIS EQUILIBRE'!$E$177","v":{"v":0,"d":"0.00 €"}},{"$f":"'CRPP NON SOUMIS EQUIL'!$F$181+'CRPP SOUMIS EQUILIBRE'!$F$177","v":{"v":0,"d":"0.00 €"}}]
[null,"FRE","Reprises sur provisions d'exploitation",{"$f":"'CRPP NON SOUMIS EQUIL'!$E$176+'CRPP SOUMIS EQUILIBRE'!$E$172","v":{"v":0,"d":"0.00 €"}},{"$f":"'CRPP NON SOUMIS EQUIL'!$F$176+'CRPP SOUMIS EQUILIBRE'!$F$172","v":{"v":0,"d":"0.00 €"}}]
[null,"FRE","Reprises sur autres provisions et dépréciations",{"$f":"'CRPP NON SOUMIS EQUIL'!$E$178+'CRPP NON SOUMIS EQUIL'!$E$179+'CRPP NON SOUMIS EQUIL'!$E$185+'CRPP SOUMIS EQUILIBRE'!$E$174+'CRPP SOUMIS EQUILIBRE'!$E$175+'CRPP SOUMIS EQUILIBRE'!$E$181","v":{"v":0,"d":"0.00 €"}},{"$f":"'CRPP NON SOUMIS EQUIL'!$F$178+'CRPP NON SOUMIS EQUIL'!$F$179+'CRPP NON SOUMIS EQUIL'!$F$185+'CRPP SOUMIS EQUILIBRE'!$F$174+'CRPP SOUMIS EQUILIBRE'!$F$175+'CRPP SOUMIS EQUILIBRE'!$F$181","v":{"v":0,"d":"0.00 €"}}]
[null,"FRE","Utilisation de fonds dédiés et de fonds reportés ((sauf c/78921) - ESSMS privés",{"$f":"'CRPP NON SOUMIS EQUIL'!$E$186+'CRPP NON SOUMIS EQUIL'!$E$188+'CRPP NON SOUMIS EQUIL'!$E$189+'CRPP SOUMIS EQUILIBRE'!$E$182+'CRPP SOUMIS EQUILIBRE'!$E$184+'CRPP SOUMIS EQUILIBRE'!$E$185","v":{"v":0,"d":"0.00 €"}},{"$f":"'CRPP NON SOUMIS EQUIL'!$F$186+'CRPP NON SOUMIS EQUIL'!$F$188+'CRPP NON SOUMIS EQUIL'!$F$189+'CRPP SOUMIS EQUILIBRE'!$F$182+'CRPP SOUMIS EQUILIBRE'!$F$184+'CRPP SOUMIS EQUILIBRE'!$F$185","v":{"v":0,"d":"0.00 €"}}]
[null,"FRE","Transfert de charges",{"$f":"'CRPP NON SOUMIS EQUIL'!$E$190+'CRPP SOUMIS EQUILIBRE'!$E$186","v":{"v":0,"d":"0.00 €"}},{"$f":"'CRPP NON SOUMIS EQUIL'!$F$190+'CRPP SOUMIS EQUILIBRE'!$F$186","v":{"v":0,"d":"0.00 €"}}]
[null,null,"B- Total des produits de l'exercice",{"$f":"'CRPP NON SOUMIS EQUIL'!$E$194+'CRPP SOUMIS EQUILIBRE'!$E$190","v":{"v":0,"d":"0.00 €"}},{"$f":"'CRPP NON SOUMIS EQUIL'!$F$194+'CRPP SOUMIS EQUILIBRE'!$F$190","v":{"v":0,"d":"0.00 €"}},{"$f":"F47+F56+F60","v":{"v":0,"d":"0.00 €"}},{"v":0,"d":"0.00 €"},{"v":0,"d":"0.00 €"},{"v":0,"d":"0.00 €"},{"v":0,"d":"0.00 €"},{"v":0,"d":"0.00 €"}]
[null,null,"RESULTAT PREVISIONNEL DEFICITAIRE (A - B)",{"$f":"IF('CRPP SOUMIS EQUILIBRE'!$E$190>'CRPP SOUMIS EQUILIBRE'!$E$110,'CRPP NON SOUMIS EQUIL'!$E$196,'CRPP NON SOUMIS EQUIL'!$E$196+'CRPP SOUMIS EQUILIBRE'!$E$110 -'CRPP SOUMIS EQUILIBRE'!$E$190)","v":{"v":0,"d":"0.00 €"}},{"$f":"IF('CRPP SOUMIS EQUILIBRE'!$F$190>'CRPP SOUMIS EQUILIBRE'!$F$110,'CRPP NON SOUMIS EQUIL'!$F$196,'CRPP NON SOUMIS EQUIL'!$F$196+'CRPP SOUMIS EQUILIBRE'!$F$110 -'CRPP SOUMIS EQUILIBRE'!$F$190)","v":{"v":0,"d":"0.00 €"}},{"$f":"IF(F77-F40>0,0,F40-F77)","v":{"v":0,"d":"0.00 €"}},{"v":0,"d":"0.00 €"},{"v":0,"d":"0.00 €"},{"v":0,"d":"0.00 €"},{"v":0,"d":"0.00 €"},{"v":0,"d":"0.00 €"}]
[null,null,"Reprise d'excédents antérieurs et amortissements excédentaires différés",{"$f":"'CRPP NON SOUMIS EQUIL'!$E$201+'CRPP SOUMIS EQUILIBRE'!$E$192+'CRPP SOUMIS EQUILIBRE'!$E$193","v":{"v":0,"d":"0.00 €"}},{"$f":"'CRPP NON SOUMIS EQUIL'!$F$201+'CRPP SOUMIS EQUILIBRE'!$F$192+'CRPP SOUMIS EQUILIBRE'!$F$193","v":{"v":0,"d":"0.00 €"}}]
[null,null,"Reprise sur les réserves de compensation des charges d'amortissement"]
[null,null,"TOTAL EQUILIBRE GENERAL",{"$f":"+'CRPP NON SOUMIS EQUIL'!E198+'CRPP SOUMIS EQUILIBRE'!E195","v":{"v":0,"d":"0.00 €"}},{"$f":"+'CRPP NON SOUMIS EQUIL'!F198+'CRPP SOUMIS EQUILIBRE'!F195","v":{"v":0,"d":"0.00 €"}},{"$f":"IF((F41-F42-F78+F79+F80)=0,F77+F79+F80,F77+F78)","v":{"v":0,"d":"0.00 €"}},{"v":0,"d":"0.00 €"},{"v":0,"d":"0.00 €"},{"v":0,"d":"0.00 €"},{"v":0,"d":"0.00 €"},{"v":0,"d":"0.00 €"}]
{"$rows_empty":75}
[null,null,3]

{"sheet":"CRP_PGFP_SF","index":17,"n_rows":157,"n_cols":11,"rows_kept":157,"hidden":true,"merged":[[1,1,1,10],[3,3,3,6],[4,3,4,6],[5,3,5,6]]}
[]
[null,"Modèle de compte de résultat prévisionnel du plan global de financement pluriannuel (1 CRP par ESSMS)"]
[]
[null,null,"Dénomination du CRP sans FINESS : "]
[null,null,"N° Identifiant : "]
[null,null,"FINESS ET de rattachement :"]
[]
[null,null,"Postes",{"$f":"IF(CREPASIDEN___ANNEEREF___ANN0\\_________=\"\",\"N-1\",CREPASIDEN___ANNEEREF___ANN0\\_________-1)","v":"N-1"},{"$f":"IF(CREPASIDEN___ANNEEREF___ANN0\\_________=\"\",\"N\",CREPASIDEN___ANNEEREF___ANN0\\_________)","v":"N"},{"$f":"IF(CREPASIDEN___ANNEEREF___ANN0\\_________=\"\",\"N+1\",CREPASIDEN___ANNEEREF___ANN0\\_________+1)","v":"N+1"},{"$f":"IF(CREPASIDEN___ANNEEREF___ANN0\\_________=\"\",\"N+2\",CREPASIDEN___ANNEEREF___ANN0\\_________+2)","v":"N+2"},{"$f":"IF(CREPASIDEN___ANNEEREF___ANN0\\_________=\"\",\"N+3\",CREPASIDEN___ANNEEREF___ANN0\\_________+3)","v":"N+3"},{"$f":"IF(CREPASIDEN___ANNEEREF___ANN0\\_________=\"\",\"N+4\",CREPASIDEN___ANNEEREF___ANN0\\_________+4)","v":"N+4"},{"$f":"IF(CREPASIDEN___ANNEEREF___ANN0\\_________=\"\",\"N+5\",CREPASIDEN___ANNEEREF___ANN0\\_________+5)","v":"N+5"},{"$f":"IF(CREPASIDEN___ANNEEREF___ANN0\\_________=\"\",\"N+6\",CREPASIDEN___ANNEEREF___ANN0\\_________+6)","v":"N+6"}]
[null,null,"GROUPE I   Charges afférentes à l'exploitation courante",{"$f":"CRP_SF!$E$34","v":{"v":0,"d":"0.00 €"}},{"$f":"CRP_SF!$F$34","v":{"v":0,"d":"0.00 €"}},{"$f":"E9+F10","v":{"v":0,"d":"0.00 €"}},{"v":0,"d":"0.00 €"},{"v":0,"d":"0.00 €"},{"v":0,"d":"0.00 €"},{"v":0,"d":"0.00 €"},{"v":0,"d":"0.00 €"}]
[null,null,"Variations annuelles des charges du groupe 1 (plusieurs lignes si nécessaire)",null,null,{"$f":"SUM(F11:F12)","v":{"v":0,"d":"0.00 €"}},{"v":0,"d":"0.00 €"},{"v":0,"d":"0.00 €"},{"v":0,"d":"0.00 €"},{"v":0,"d":"0.00 €"},{"v":0,"d":"0.00 €"}]
[]
[]
[null,null,"GROUPE II  Charges afférentes au personnel",{"$f":"CRP_SF!$E$51","v":{"v":0,"d":"0.00 €"}},{"$f":"CRP_SF!$F$51","v":{"v":0,"d":"0.00 €"}},{"$f":"E13+F14+F15","v":{"v":0,"d":"0.00 €"}},{"v":0,"d":"0.00 €"},{"v":0,"d":"0.00 €"},{"v":0,"d":"0.00 €"},{"v":0,"d":"0.00 €"},{"v":0,"d":"0.00 €"}]
[null,null,"Variations annuelles des charges du groupe 2 (comptes 621 et 622)"]
[null,null,"Recrutements et autres variations de charges de personnel (plusieurs lignes si nécessaire)",null,null,{"$f":"SUM(F16:F17)","v":{"v":0,"d":"0.00 €"}},{"v":0,"d":"0.00 €"},{"v":0,"d":"0.00 €"},{"v":0,"d":"0.00 €"},{"v":0,"d":"0.00 €"},{"v":0,"d":"0.00 €"}]
[]
[]
[null,null,"GROUPE III Charges afférentes à la structure                                      ",{"$f":"CRP_SF!$E$106","v":{"v":0,"d":"0.00 €"}},{"$f":"CRP_SF!$F$106","v":{"v":0,"d":"0.00 €"}},{"$f":"SUM(F19,F21:F39)","v":{"v":0,"d":"0.00 €"}},{"v":0,"d":"0.00 €"},{"v":0,"d":"0.00 €"},{"v":0,"d":"0.00 €"},{"v":0,"d":"0.00 €"},{"v":0,"d":"0.00 €"}]
[null,null,"Charges du groupe 3 - c/61 et c/62 (1) (hors c/615 ci-après)",{"$f":"CRP_SF!$E$56+CRP_SF!$E$57+CRP_SF!$E$58+CRP_SF!$E$60+CRP_SF!$E$61+CRP_SF!$E$62+CRP_SF!$E$63+CRP_SF!$E$64","v":{"v":0,"d":"0.00 €"}},{"$f":"CRP_SF!$F$56+CRP_SF!$F$57+CRP_SF!$F$58+CRP_SF!$F$60+CRP_SF!$F$61+CRP_SF!$F$62+CRP_SF!$F$63+CRP_SF!$F$64","v":{"v":0,"d":"0.00 €"}}]
[]
[null,null,"Charges du groupe 3 - c/63 (1)",{"$f":"CRP_SF!$E$65+CRP_SF!$E$66","v":{"v":0,"d":"0.00 €"}},{"$f":"CRP_SF!$F$65+CRP_SF!$F$66","v":{"v":0,"d":"0.00 €"}}]
[null,null,"Charges du groupe 3 - c/65 (1) (hors c/652)",{"$f":"CRP_SF!$E$69+CRP_SF!$E$71+CRP_SF!$E$72+CRP_SF!$E$73+CRP_SF!$E$74+CRP_SF!$E$75","v":{"v":0,"d":"0.00 €"}},{"$f":"CRP_SF!$F$69+CRP_SF!$F$71+CRP_SF!$F$72+CRP_SF!$F$73+CRP_SF!$F$74+CRP_SF!$F$75","v":{"v":0,"d":"0.00 €"}}]
[null,null,"Charges d'entretien réparation (1)",{"$f":"CRP_SF!$E$59","v":{"v":0,"d":"0.00 €"}},{"$f":"CRP_SF!$F$59","v":{"v":0,"d":"0.00 €"}}]
[null,null,"Charges exceptionnelles décaissables"]
[null,"FRI","Valeurs comptables des immobilisations incorporelles et corporelles cédées",{"$f":"CRP_SF!$E$70+CRP_SF!$E$83","v":{"v":0,"d":"0.00 €"}},{"$f":"CRP_SF!$F$70+CRP_SF!$F$83","v":{"v":0,"d":"0.00 €"}}]
[null,"FRI","Dotations aux amortissements des immobilisations acquises avant le 1/1/N",{"$f":"CRP_SF!$E$87","v":{"v":0,"d":"0.00 €"}},{"$f":"CRP_SF!$F$87","v":{"v":0,"d":"0.00 €"}}]
[null,"FRI","Dotations aux amortissements des immobilisations sur acquisitions nouvelles"]
[null,"FRI","Dotations aux amortissements des charges d'exploitation à répartir",{"$f":"CRP_SF!$E$88","v":{"v":0,"d":"0.00 €"}},{"$f":"CRP_SF!$F$88","v":{"v":0,"d":"0.00 €"}}]
[null,"FRI","Dotations aux amortissements dérogatoires, amortissements exceptionnels et dépréciations des immobilisations",{"$f":"CRP_SF!$E$90+CRP_SF!$E$93+CRP_SF!$E$94","v":{"v":0,"d":"0.00 €"}},{"$f":"CRP_SF!$F$90+CRP_SF!$F$93+CRP_SF!$F$94","v":{"v":0,"d":"0.00 €"}}]
[null,"FRI","Dotations aux provisions réglementées pour renouvellement des immobilisations",{"$f":"CRP_SF!$E$96","v":{"v":0,"d":"0.00 €"}},{"$f":"CRP_SF!$F$96","v":{"v":0,"d":"0.00 €"}}]
[null,"FRI","Dotations aux provisions réglementées : réserves des plus-values nettes d'actif (ESSMS privés)",{"$f":"CRP_SF!$E$97","v":{"v":0,"d":"0.00 €"}},{"$f":"CRP_SF!$F$97","v":{"v":0,"d":"0.00 €"}}]
[null,"FRI","Dotations aux autres provisions réglementées / Autres (c/68748)",{"$f":"CRP_SF!$E$98","v":{"v":0,"d":"0.00 €"}},{"$f":"CRP_SF!$F$98","v":{"v":0,"d":"0.00 €"}}]
[null,"FRI","Reports en fonds dédiés à l'investissement sur concours publics des entités gestionnaires d'ESSMS (c/68921) - ESSMS privés",{"$f":"CRP_SF!$E$102","v":{"v":0,"d":"0.00 €"}},{"$f":"CRP_SF!$F$102","v":{"v":0,"d":"0.00 €"}}]
[null,"FRE","Dotations aux provisions réglementées destinées à renforcer la couverture du BFR",{"$f":"CRP_SF!$E$95","v":{"v":0,"d":"0.00 €"}},{"$f":"CRP_SF!$F$95","v":{"v":0,"d":"0.00 €"}}]
[null,"FRE","Dotations aux provisions des charges d'exploitation",{"$f":"CRP_SF!$E$89","v":{"v":0,"d":"0.00 €"}},{"$f":"CRP_SF!$F$89","v":{"v":0,"d":"0.00 €"}}]
[null,"FRE","Dotations aux autres amortissements, provisions et dépréciations",{"$f":"CRP_SF!$E$91+CRP_SF!$E$92+CRP_SF!$E$99+CRP_SF!$E$100","v":{"v":0,"d":"0.00 €"}},{"$f":"CRP_SF!$F$91+CRP_SF!$F$92+CRP_SF!$F$99+CRP_SF!$F$100","v":{"v":0,"d":"0.00 €"}}]
[null,"FRE","Reports en fonds dédiés (sauf c/68921) - ESSMS privés",{"$f":"CRP_SF!$E$101+CRP_SF!$E$103+CRP_SF!$E$104","v":{"v":0,"d":"0.00 €"}},{"$f":"CRP_SF!$F$101+CRP_SF!$F$103+CRP_SF!$F$104","v":{"v":0,"d":"0.00 €"}}]
[null,null,"Frais financiers des emprunts antérieurs à l'année N",{"$f":"CRP_SF!$E$78","v":{"v":0,"d":"0.00 €"}},{"$f":"CRP_SF!$F$78","v":{"v":0,"d":"0.00 €"}}]
[null,null,"Frais financiers des emprunts nouveaux"]
[null,null,"A- Total des charges de l'exercice",{"$f":"CRP_SF!$E$108","v":{"v":0,"d":"0.00 €"}},{"$f":"CRP_SF!$F$108","v":{"v":0,"d":"0.00 €"}},{"$f":"F9+F13+F18","v":{"v":0,"d":"0.00 €"}},{"v":0,"d":"0.00 €"},{"v":0,"d":"0.00 €"},{"v":0,"d":"0.00 €"},{"v":0,"d":"0.00 €"},{"v":0,"d":"0.00 €"}]
[null,null,"RESULTAT PREVISIONNEL EXCEDENTAIRE (B - A)",{"$f":"CRP_SF!$E$110","v":{"v":0,"d":"0.00 €"}},{"$f":"CRP_SF!$F$110","v":{"v":0,"d":"0.00 €"}},{"$f":"IF(F77-F40<0,0,F77-F40)","v":{"v":0,"d":"0.00 €"}},{"v":0,"d":"0.00 €"},{"v":0,"d":"0.00 €"},{"v":0,"d":"0.00 €"},{"v":0,"d":"0.00 €"},{"v":0,"d":"0.00 €"}]
[null,null,"Reprise de déficits antérieurs et reports au titre des amortissements comptables excédentaires différés",{"$f":"CRP_SF!E200","v":{"v":0,"d":"0.00 €"}},{"$f":"CRP_SF!F200","v":{"v":0,"d":"0.00 €"}}]
[null,null,"TOTAL EQUILIBRE GENERAL",{"$f":"+CRP_SF!E112","v":{"v":0,"d":"0.00 €"}},{"$f":"+CRP_SF!F112","v":{"v":0,"d":"0.00 €"}},{"$f":"IF((F41-F42-F78+F79+F80)=0,F40+F42,F40+F41)","v":{"v":0,"d":"0.00 €"}},{"v":0,"d":"0.00 €"},{"v":0,"d":"0.00 €"},{"v":0,"d":"0.00 €"},{"v":0,"d":"0.00 €"},{"v":0,"d":"0.00 €"}]
[]
[null,null,"(1): A retenir pour le calcul de la marge brute"]
[null,null,"Postes",{"$f":"IF(CREPASIDEN___ANNEEREF___ANN0\\_________=\"\",\"N-1\",CREPASIDEN___ANNEEREF___ANN0\\_________-1)","v":"N-1"},{"$f":"IF(CREPASIDEN___ANNEEREF___ANN0\\_________=\"\",\"N\",CREPASIDEN___ANNEEREF___ANN0\\_________)","v":"N"},{"$f":"IF(CREPASIDEN___ANNEEREF___ANN0\\_________=\"\",\"N+1\",CREPASIDEN___ANNEEREF___ANN0\\_________+1)","v":"N+1"},{"$f":"IF(CREPASIDEN___ANNEEREF___ANN0\\_________=\"\",\"N+2\",CREPASIDEN___ANNEEREF___ANN0\\_________+2)","v":"N+2"},{"$f":"IF(CREPASIDEN___ANNEEREF___ANN0\\_________=\"\",\"N+3\",CREPASIDEN___ANNEEREF___ANN0\\_________+3)","v":"N+3"},{"$f":"IF(CREPASIDEN___ANNEEREF___ANN0\\_________=\"\",\"N+4\",CREPASIDEN___ANNEEREF___ANN0\\_________+4)","v":"N+4"},{"$f":"IF(CREPASIDEN___ANNEEREF___ANN0\\_________=\"\",\"N+5\",CREPASIDEN___ANNEEREF___ANN0\\_________+5)","v":"N+5"},{"$f":"IF(CREPASIDEN___ANNEEREF___ANN0\\_________=\"\",\"N+6\",CREPASIDEN___ANNEEREF___ANN0\\_________+6)","v":"N+6"}]
[null,null,"GROUPE I Produits de la tarification",{"$f":"CRP_SF!$E$131","v":{"v":0,"d":"0.00 €"}},{"$f":"CRP_SF!$F$131","v":{"v":0,"d":"0.00 €"}},{"$f":"SUM(F48:F52)","v":{"v":0,"d":"0.00 €"}},{"v":0,"d":"0.00 €"},{"v":0,"d":"0.00 €"},{"v":0,"d":"0.00 €"},{"v":0,"d":"0.00 €"},{"v":0,"d":"0.00 €"}]
[null,null,"Produits à la charge de l'Etat",{"$f":"CRP_SF!$E$121","v":{"v":0,"d":"0.00 €"}},{"$f":"CRP_SF!$F$121","v":{"v":0,"d":"0.00 €"}}]
[null,null,"Produits à la charge de l'assurance maladie",{"$f":"CRP_SF!$E$119+CRP_SF!$E$120+CRP_SF!$E$125","v":{"v":0,"d":"0.00 €"}},{"$f":"CRP_SF!$F$119+CRP_SF!$F$120+CRP_SF!$F$125","v":{"v":0,"d":"0.00 €"}}]
[null,null,"Produits à la charge du département",{"$f":"CRP_SF!$E$122+CRP_SF!$E$123+CRP_SF!$E$126","v":{"v":0,"d":"0.00 €"}},{"$f":"CRP_SF!$F$122+CRP_SF!$F$123+CRP_SF!$F$126","v":{"v":0,"d":"0.00 €"}}]
[null,null,"Produits à la charge de l'usager",{"$f":"CRP_SF!$E$124+CRP_SF!$E$127","v":{"v":0,"d":"0.00 €"}},{"$f":"CRP_SF!$F$124+CRP_SF!$F$127","v":{"v":0,"d":"0.00 €"}}]
[null,null,"Produits à la charge d'autres financeurs",{"$f":"CRP_SF!$E$128+CRP_SF!$E$129","v":{"v":0,"d":"0.00 €"}},{"$f":"CRP_SF!$F$128+CRP_SF!$F$129","v":{"v":0,"d":"0.00 €"}}]
[null,null,"Dont aides ponctuelles par dotations non reconductibles (une ligne par financeur) : ARS"]
[null,null,"Dont aides ponctuelles par dotations non reconductibles (une ligne par financeur) : Préfets"]
[null,null,"Dont aides ponctuelles par dotations non reconductibles (une ligne par financeur) : Conseils départementaux"]
[null,null,"GROUPE II Autres produits relatifs à l'exploitation hors c/747 et 757",{"$f":"CRP_SF!$E$158-CRP_SF!$E$144-CRP_SF!$E$146","v":{"v":0,"d":"0.00 €"}},{"$f":"CRP_SF!$F$158-CRP_SF!$F$144-CRP_SF!$F$146","v":{"v":0,"d":"0.00 €"}},{"$f":"E56+F57","v":{"v":0,"d":"0.00 €"}},{"v":0,"d":"0.00 €"},{"v":0,"d":"0.00 €"},{"v":0,"d":"0.00 €"},{"v":0,"d":"0.00 €"},{"v":0,"d":"0.00 €"}]
[null,null,"Variations annuelles des produits du groupe 2 (plusieurs lignes si nécessaire)",null,null,{"$f":"SUM(F58:F59)","v":{"v":0,"d":"0.00 €"}},{"v":0,"d":"0.00 €"},{"v":0,"d":"0.00 €"},{"v":0,"d":"0.00 €"},{"v":0,"d":"0.00 €"},{"v":0,"d":"0.00 €"}]
[]
[]
[null,null,"GROUPE III Produits financiers, produits exceptionnels et produits non encaissables & comptes 747/757         ",{"$f":"CRP_SF!$E$192+CRP_SF!$E$144+CRP_SF!$E$146","v":{"v":0,"d":"0.00 €"}},{"$f":"CRP_SF!$F$192+CRP_SF!$F$144+CRP_SF!$F$146","v":{"v":0,"d":"0.00 €"}},{"$f":"SUM(F61:F76)","v":{"v":0,"d":"0.00 €"}},{"v":0,"d":"0.00 €"},{"v":0,"d":"0.00 €"},{"v":0,"d":"0.00 €"},{"v":0,"d":"0.00 €"},{"v":0,"d":"0.00 €"}]
[null,null,"Produits du groupe 3 autres que ceux-listés ci-dessous ",{"$f":"-SUM(D62:D76)+CRP_SF!$E$192+CRP_SF!$E$144+CRP_SF!$E$146","v":{"v":0,"d":"0.00 €"}},{"$f":"-SUM(E62:E76)+CRP_SF!$F$192+CRP_SF!$F$144+CRP_SF!$F$146","v":{"v":0,"d":"0.00 €"}}]
[null,null,"Produits financiers",{"$f":"CRP_SF!$E$164","v":{"v":0,"d":"0.00 €"}},{"$f":"CRP_SF!$F$164","v":{"v":0,"d":"0.00 €"}}]
[null,"FRI","Produits des cessions d'immobilisations incorporelles et corporelles (y compris c/757)",{"$f":"CRP_SF!$E$146+CRP_SF!$E$169","v":{"v":0,"d":"0.00 €"}},{"$f":"CRP_SF!$F$146+CRP_SF!$F$169","v":{"v":0,"d":"0.00 €"}}]
[null,"FRI","Quote-part des subventions d'investissement virée au résultat de l'exercice (y compris c/747)",{"$f":"CRP_SF!$E$144+CRP_SF!$E$170","v":{"v":0,"d":"0.00 €"}},{"$f":"CRP_SF!$F$144+CRP_SF!$F$170","v":{"v":0,"d":"0.00 €"}}]
[null,"FRI",null,{"$f":"CRP_SF!$E$172","v":{"v":0,"d":"0.00 €"}},{"$f":"CRP_SF!$F$172","v":{"v":0,"d":"0.00 €"}}]
[null,"FRI","Reprises sur provisions réglementées pour renouvellement des immobilisations ",{"$f":"CRP_SF!$E$182","v":{"v":0,"d":"0.00 €"}},{"$f":"CRP_SF!$F$182","v":{"v":0,"d":"0.00 €"}}]
[null,"FRI","Reprises sur amortissements dérogatoires",{"$f":"CRP_SF!$E$180","v":{"v":0,"d":"0.00 €"}},{"$f":"CRP_SF!$F$180","v":{"v":0,"d":"0.00 €"}}]
[null,"FRI","Reprises sur provisions réglementées : réserves des plus-values nettes d'actif (ESSMS privés)",{"$f":"CRP_SF!$E$183","v":{"v":0,"d":"0.00 €"}},{"$f":"CRP_SF!$F$183","v":{"v":0,"d":"0.00 €"}}]
[null,"FRI","Reprises sur autres amortissements, autres provisions et dépréciations impactant le FRI",{"$f":"CRP_SF!$E$175+CRP_SF!$E$177","v":{"v":0,"d":"0.00 €"}},{"$f":"CRP_SF!$F$175+CRP_SF!$F$177","v":{"v":0,"d":"0.00 €"}}]
[null,"FRI","Reprises sur autres provisions réglementées / Autres (c/78748)",{"$f":"CRP_SF!$E$184","v":{"v":0,"d":"0.00 €"}},{"$f":"CRP_SF!$F$184","v":{"v":0,"d":"0.00 €"}}]
[null,"FRI","Utilisation des fonds dédiés à l'investissement sur concours publics des entités gestionnaires d'ESSMS (c/78921) - ESSMS privés",{"$f":"CRP_SF!$E$187","v":{"v":0,"d":"0.00 €"}},{"$f":"CRP_SF!$F$187","v":{"v":0,"d":"0.00 €"}}]
[null,"FRE","Reprises sur provisions réglementées destinées à renforcer la couverture du besoin en fonds de roulement",{"$f":"CRP_SF!$E$181","v":{"v":0,"d":"0.00 €"}},{"$f":"CRP_SF!$F$181","v":{"v":0,"d":"0.00 €"}}]
[null,"FRE","Reprises sur provisions d'exploitation",{"$f":"CRP_SF!$E$176","v":{"v":0,"d":"0.00 €"}},{"$f":"CRP_SF!$F$176","v":{"v":0,"d":"0.00 €"}}]
[null,"FRE","Reprises sur autres provisions et dépréciations",{"$f":"CRP_SF!$E$178+CRP_SF!$E$179+CRP_SF!$E$185","v":{"v":0,"d":"0.00 €"}},{"$f":"CRP_SF!$F$178+CRP_SF!$F$179+CRP_SF!$F$185","v":{"v":0,"d":"0.00 €"}}]
[null,"FRE","Utilisation de fonds dédiés et de fonds reportés ((sauf c/78921) - ESSMS privés",{"$f":"CRP_SF!$E$186+CRP_SF!$E$188+CRP_SF!$E$189","v":{"v":0,"d":"0.00 €"}},{"$f":"CRP_SF!$F$186+CRP_SF!$F$188+CRP_SF!$F$189","v":{"v":0,"d":"0.00 €"}}]
[null,"FRE","Transfert de charges",{"$f":"CRP_SF!$E$190","v":{"v":0,"d":"0.00 €"}},{"$f":"CRP_SF!$F$190","v":{"v":0,"d":"0.00 €"}}]
[null,null,"B- Total des produits de l'exercice",{"$f":"CRP_SF!$E$194","v":{"v":0,"d":"0.00 €"}},{"$f":"CRP_SF!$F$194","v":{"v":0,"d":"0.00 €"}},{"$f":"F47+F56+F60","v":{"v":0,"d":"0.00 €"}},{"v":0,"d":"0.00 €"},{"v":0,"d":"0.00 €"},{"v":0,"d":"0.00 €"},{"v":0,"d":"0.00 €"},{"v":0,"d":"0.00 €"}]
[null,null,"RESULTAT PREVISIONNEL DEFICITAIRE (A - B)",{"$f":"CRP_SF!$E$196","v":{"v":0,"d":"0.00 €"}},{"$f":"CRP_SF!$F$196","v":{"v":0,"d":"0.00 €"}},{"$f":"IF(F77-F40>0,0,F40-F77)","v":{"v":0,"d":"0.00 €"}},{"v":0,"d":"0.00 €"},{"v":0,"d":"0.00 €"},{"v":0,"d":"0.00 €"},{"v":0,"d":"0.00 €"},{"v":0,"d":"0.00 €"}]
[null,null,"Reprise d'excédents antérieurs et amortissements excédentaires différés",{"$f":"CRP_SF!E201","v":{"v":0,"d":"0.00 €"}},{"$f":"CRP_SF!F201","v":{"v":0,"d":"0.00 €"}}]
[null,null,"Reprise sur les réserves de compensation des charges d'amortissement"]
[null,null,"TOTAL EQUILIBRE GENERAL",{"$f":"+CRP_SF!E198","v":{"v":0,"d":"0.00 €"}},{"$f":"+CRP_SF!F198","v":{"v":0,"d":"0.00 €"}},{"$f":"IF((F41-F42-F78+F79+F80)=0,F77+F79+F80,F77+F78)","v":{"v":0,"d":"0.00 €"}},{"v":0,"d":"0.00 €"},{"v":0,"d":"0.00 €"},{"v":0,"d":"0.00 €"},{"v":0,"d":"0.00 €"},{"v":0,"d":"0.00 €"}]
{"$rows_empty":75}
[null,null,3]

{"sheet":"PGFP","index":18,"n_rows":145,"n_cols":11,"rows_kept":145,"hidden":true,"merged":[[1,1,1,10],[4,1,23,1],[25,1,45,1],[48,1,77,1],[78,1,91,1],[93,1,95,1],[98,1,110,1],[111,1,115,1],[117,3,117,4],[118,3,118,4],[119,3,119,4],[134,1,141,1],[144,2,145,10],[146,2,146,3]]}
[]
[null,"Plan global de financement pluriannuel (PGFP)"]
[]
[{"$nulls":3},{"$f":"IF(CREPASIDEN___ANNEEREF___ANN0\\_________=\"\",\"N-1\",CREPASIDEN___ANNEEREF___ANN0\\_________-1)","v":"N-1"},{"$f":"IF(CREPASIDEN___ANNEEREF___ANN0\\_________=\"\",\"N\",CREPASIDEN___ANNEEREF___ANN0\\_________)","v":"N"},{"$f":"IF(CREPASIDEN___ANNEEREF___ANN0\\_________=\"\",\"N+1\",CREPASIDEN___ANNEEREF___ANN0\\_________+1)","v":"N+1"},{"$f":"IF(CREPASIDEN___ANNEEREF___ANN0\\_________=\"\",\"N+2\",CREPASIDEN___ANNEEREF___ANN0\\_________+2)","v":"N+2"},{"$f":"IF(CREPASIDEN___ANNEEREF___ANN0\\_________=\"\",\"N+3\",CREPASIDEN___ANNEEREF___ANN0\\_________+3)","v":"N+3"},{"$f":"IF(CREPASIDEN___ANNEEREF___ANN0\\_________=\"\",\"N+4\",CREPASIDEN___ANNEEREF___ANN0\\_________+4)","v":"N+4"},{"$f":"IF(CREPASIDEN___ANNEEREF___ANN0\\_________=\"\",\"N+5\",CREPASIDEN___ANNEEREF___ANN0\\_________+5)","v":"N+5"},{"$f":"IF(CREPASIDEN___ANNEEREF___ANN0\\_________=\"\",\"N+6\",CREPASIDEN___ANNEEREF___ANN0\\_________+6)","v":"N+6"}]
[null,"C R P consolidés","Produits"]
[null,null,"Groupe I : Produits de la tarification",{"$f":"Conso!B162","v":{"v":0,"d":"0.00 €"}},{"$f":"+Conso!B300","v":{"v":0,"d":"0.00 €"}},{"$f":"+Conso!B437","v":{"v":0,"d":"0.00 €"}},{"$f":"+Conso!B574","v":{"v":0,"d":"0.00 €"}},{"$f":"+Conso!B710","v":{"v":0,"d":"0.00 €"}},{"$f":"+Conso!B846","v":{"v":0,"d":"0.00 €"}},{"$f":"+Conso!B982","v":{"v":0,"d":"0.00 €"}},{"$f":"+Conso!B1118","v":{"v":0,"d":"0.00 €"}}]
[null,null,"Dont aides ponctuelles par dotations non reconductibles ",{"$f":"Conso!B163","v":{"v":0,"d":"0.00 €"}},{"$f":"+Conso!B301","v":{"v":0,"d":"0.00 €"}},{"$f":"+Conso!B438","v":{"v":0,"d":"0.00 €"}},{"$f":"+Conso!B575","v":{"v":0,"d":"0.00 €"}},{"$f":"+Conso!B711","v":{"v":0,"d":"0.00 €"}},{"$f":"+Conso!B847","v":{"v":0,"d":"0.00 €"}},{"$f":"+Conso!B983","v":{"v":0,"d":"0.00 €"}},{"$f":"+Conso!B1119","v":{"v":0,"d":"0.00 €"}}]
[null,null,"Groupe II : Autres produits d'exploitation hors c/747 et 757",{"$f":"Conso!B164","v":{"v":0,"d":"0.00 €"}},{"$f":"+Conso!B302","v":{"v":0,"d":"0.00 €"}},{"$f":"+Conso!B439","v":{"v":0,"d":"0.00 €"}},{"$f":"+Conso!B576","v":{"v":0,"d":"0.00 €"}},{"$f":"+Conso!B712","v":{"v":0,"d":"0.00 €"}},{"$f":"+Conso!B848","v":{"v":0,"d":"0.00 €"}},{"$f":"+Conso!B984","v":{"v":0,"d":"0.00 €"}},{"$f":"+Conso!B1120","v":{"v":0,"d":"0.00 €"}}]
[null,null,"(*) Dont produits du compte 70",{"$f":"Conso!B165","v":{"v":0,"d":"0.00 €"}}]
[null,null,"Groupe III : Produits financiers, exceptionnels et non encaissables & comptes 747/757",{"$f":"Conso!B166","v":{"v":0,"d":"0.00 €"}},{"$f":"+Conso!B305","v":{"v":0,"d":"0.00 €"}},{"$f":"+Conso!B442","v":{"v":0,"d":"0.00 €"}},{"$f":"+Conso!B579","v":{"v":0,"d":"0.00 €"}},{"$f":"+Conso!B715","v":{"v":0,"d":"0.00 €"}},{"$f":"+Conso!B851","v":{"v":0,"d":"0.00 €"}},{"$f":"+Conso!B987","v":{"v":0,"d":"0.00 €"}},{"$f":"+Conso!B1123","v":{"v":0,"d":"0.00 €"}}]
[null,null,"Total des produits (1)",{"$f":"Conso!B167","v":{"v":0,"d":"0.00 €"}},{"$f":"E6+E8+E10","v":{"v":0,"d":"0.00 €"}},{"v":0,"d":"0.00 €"},{"v":0,"d":"0.00 €"},{"v":0,"d":"0.00 €"},{"v":0,"d":"0.00 €"},{"v":0,"d":"0.00 €"},{"v":0,"d":"0.00 €"}]
[null,null,"Dont produits (hors c/747, 757, 775, 777 et 78)",{"$f":"Conso!B168","v":{"v":0,"d":"0.00 €"}},{"$f":"+Conso!B307","v":{"v":0,"d":"0.00 €"}},{"$f":"+Conso!B444","v":{"v":0,"d":"0.00 €"}},{"$f":"+Conso!B581","v":{"v":0,"d":"0.00 €"}},{"$f":"+Conso!B717","v":{"v":0,"d":"0.00 €"}},{"$f":"+Conso!B853","v":{"v":0,"d":"0.00 €"}},{"$f":"+Conso!B989","v":{"v":0,"d":"0.00 €"}},{"$f":"+Conso!B1125","v":{"v":0,"d":"0.00 €"}}]
[null,null,"Charges"]
[null,null,"Groupe I : Charges afférentes à l'exploitation courante",{"$f":"Conso!B170","v":{"v":0,"d":"0.00 €"}},{"$f":"+Conso!B309","v":{"v":0,"d":"0.00 €"}},{"$f":"+Conso!B446","v":{"v":0,"d":"0.00 €"}},{"$f":"+Conso!B583","v":{"v":0,"d":"0.00 €"}},{"$f":"+Conso!B719","v":{"v":0,"d":"0.00 €"}},{"$f":"+Conso!B855","v":{"v":0,"d":"0.00 €"}},{"$f":"+Conso!B991","v":{"v":0,"d":"0.00 €"}},{"$f":"+Conso!B1127","v":{"v":0,"d":"0.00 €"}}]
[null,null,"(*) Dont achats stockés et variation des stocks",{"$f":"Conso!B171","v":{"v":0,"d":"0.00 €"}}]
[null,null,"Groupe II : Charges afférentes au personnel",{"$f":"Conso!B172","v":{"v":0,"d":"0.00 €"}},{"$f":"+Conso!B312","v":{"v":0,"d":"0.00 €"}},{"$f":"+Conso!B449","v":{"v":0,"d":"0.00 €"}},{"$f":"+Conso!B586","v":{"v":0,"d":"0.00 €"}},{"$f":"+Conso!B722","v":{"v":0,"d":"0.00 €"}},{"$f":"+Conso!B858","v":{"v":0,"d":"0.00 €"}},{"$f":"+Conso!B994","v":{"v":0,"d":"0.00 €"}},{"$f":"+Conso!B1130","v":{"v":0,"d":"0.00 €"}}]
[null,null,"Groupe III : Charges afférentes à la structure",{"$f":"Conso!B173","v":{"v":0,"d":"0.00 €"}},{"$f":"+Conso!B313","v":{"v":0,"d":"0.00 €"}},{"$f":"+Conso!B450","v":{"v":0,"d":"0.00 €"}},{"$f":"+Conso!B587","v":{"v":0,"d":"0.00 €"}},{"$f":"+Conso!B723","v":{"v":0,"d":"0.00 €"}},{"$f":"+Conso!B859","v":{"v":0,"d":"0.00 €"}},{"$f":"+Conso!B995","v":{"v":0,"d":"0.00 €"}},{"$f":"+Conso!B1131","v":{"v":0,"d":"0.00 €"}}]
[null,null,"(*) Dont charges non décaissables",{"$f":"Conso!B174","v":{"v":0,"d":"0.00 €"}}]
[null,null,"Dont charges des comptes 61 et 62 du groupe 3",{"$f":"Conso!B175","v":{"v":0,"d":"0.00 €"}},{"$f":"+Conso!B315","v":{"v":0,"d":"0.00 €"}},{"$f":"+Conso!B452","v":{"v":0,"d":"0.00 €"}},{"$f":"+Conso!B589","v":{"v":0,"d":"0.00 €"}},{"$f":"+Conso!B725","v":{"v":0,"d":"0.00 €"}},{"$f":"+Conso!B861","v":{"v":0,"d":"0.00 €"}},{"$f":"+Conso!B997","v":{"v":0,"d":"0.00 €"}},{"$f":"+Conso!B1133","v":{"v":0,"d":"0.00 €"}}]
[null,null,"Dont charges des comptes 63 à 65 du Groupe 3 des dépenses (hors c/652)",{"$f":"Conso!B176","v":{"v":0,"d":"0.00 €"}},{"$f":"+Conso!B316","v":{"v":0,"d":"0.00 €"}},{"$f":"+Conso!B453","v":{"v":0,"d":"0.00 €"}},{"$f":"+Conso!B590","v":{"v":0,"d":"0.00 €"}},{"$f":"+Conso!B726","v":{"v":0,"d":"0.00 €"}},{"$f":"+Conso!B862","v":{"v":0,"d":"0.00 €"}},{"$f":"+Conso!B998","v":{"v":0,"d":"0.00 €"}},{"$f":"+Conso!B1134","v":{"v":0,"d":"0.00 €"}}]
[null,null,"Total des charges (2)",{"$f":"Conso!B177","v":{"v":0,"d":"0.00 €"}},{"$f":"E14+E16+E17","v":{"v":0,"d":"0.00 €"}},{"v":0,"d":"0.00 €"},{"v":0,"d":"0.00 €"},{"v":0,"d":"0.00 €"},{"v":0,"d":"0.00 €"},{"v":0,"d":"0.00 €"},{"v":0,"d":"0.00 €"}]
[null,null,"(*) Dont charges des comptes 60 à 62",{"$f":"Conso!B178","v":{"v":0,"d":"0.00 €"}},{"$f":"+Conso!B318","v":{"v":0,"d":"0.00 €"}},{"$f":"+Conso!B455","v":{"v":0,"d":"0.00 €"}},{"$f":"+Conso!B592","v":{"v":0,"d":"0.00 €"}},{"$f":"+Conso!B728","v":{"v":0,"d":"0.00 €"}},{"$f":"+Conso!B864","v":{"v":0,"d":"0.00 €"}},{"$f":"+Conso!B1000","v":{"v":0,"d":"0.00 €"}},{"$f":"+Conso!B1136","v":{"v":0,"d":"0.00 €"}}]
[null,null,"(*) Dont charges des comptes 63 et 645 à 647",{"$f":"Conso!B179","v":{"v":0,"d":"0.00 €"}},{"$f":"+Conso!B319","v":{"v":0,"d":"0.00 €"}}]
[null,null,"Résultat prévisionnel (1) - (2) ",{"$f":"Conso!B180","v":{"v":0,"d":"0.00 €"}},{"$f":"E11-E21","v":{"v":0,"d":"0.00 €"}},{"v":0,"d":"0.00 €"},{"v":0,"d":"0.00 €"},{"v":0,"d":"0.00 €"},{"v":0,"d":"0.00 €"},{"v":0,"d":"0.00 €"},{"v":0,"d":"0.00 €"}]
[]
[null,"C A F","(FRE) Résultat prévisionnel",{"$f":"Conso!B186","v":{"v":0,"d":"0.00 €"}},{"$f":"E24","v":{"v":0,"d":"0.00 €"}},{"v":0,"d":"0.00 €"},{"v":0,"d":"0.00 €"},{"v":0,"d":"0.00 €"},{"v":0,"d":"0.00 €"},{"v":0,"d":"0.00 €"},{"v":0,"d":"0.00 €"}]
[null,null,"Flux internes (charges) (+)",{"$f":"Conso!B187","v":{"v":0,"d":"0.00 €"}},{"$f":"SUM(E28:E34)","v":{"v":0,"d":"0.00 €"}},{"v":0,"d":"0.00 €"},{"v":0,"d":"0.00 €"},{"v":0,"d":"0.00 €"},{"v":0,"d":"0.00 €"},{"v":0,"d":"0.00 €"},{"v":0,"d":"0.00 €"}]
[null,null,"(FRI) Valeur comptable des immobilisations incorporelles et corporelles cédées",{"$f":"Conso!B188","v":{"v":0,"d":"0.00 €"}},{"$f":"+Conso!B324","v":{"v":0,"d":"0.00 €"}},{"$f":"+Conso!B461","v":{"v":0,"d":"0.00 €"}},{"$f":"+Conso!B598","v":{"v":0,"d":"0.00 €"}},{"$f":"+Conso!B734","v":{"v":0,"d":"0.00 €"}},{"$f":"+Conso!B870","v":{"v":0,"d":"0.00 €"}},{"$f":"+Conso!B1006","v":{"v":0,"d":"0.00 €"}},{"$f":"+Conso!B1142","v":{"v":0,"d":"0.00 €"}}]
[null,null,"(FRI) Dotations aux amortissements des immobilisations incorporelles et corporelles",{"$f":"Conso!B189","v":{"v":0,"d":"0.00 €"}},{"$f":"+Conso!B325","v":{"v":0,"d":"0.00 €"}},{"$f":"+Conso!B462","v":{"v":0,"d":"0.00 €"}},{"$f":"+Conso!B599","v":{"v":0,"d":"0.00 €"}},{"$f":"+Conso!B735","v":{"v":0,"d":"0.00 €"}},{"$f":"+Conso!B871","v":{"v":0,"d":"0.00 €"}},{"$f":"+Conso!B1007","v":{"v":0,"d":"0.00 €"}},{"$f":"+Conso!B1143","v":{"v":0,"d":"0.00 €"}}]
[null,null,"(FRI) Dotations aux provisions réglementées impactant le FRI",{"$f":"Conso!B190","v":{"v":0,"d":"0.00 €"}},{"$f":"+Conso!B326","v":{"v":0,"d":"0.00 €"}},{"$f":"+Conso!B463","v":{"v":0,"d":"0.00 €"}},{"$f":"+Conso!B600","v":{"v":0,"d":"0.00 €"}},{"$f":"+Conso!B736","v":{"v":0,"d":"0.00 €"}},{"$f":"+Conso!B872","v":{"v":0,"d":"0.00 €"}},{"$f":"+Conso!B1008","v":{"v":0,"d":"0.00 €"}},{"$f":"+Conso!B1144","v":{"v":0,"d":"0.00 €"}}]
[null,null,"(FRI) Autres dotations aux amortissements, provisions et dépréciations impactant le FRI (dont c/68748)",{"$f":"Conso!B191","v":{"v":0,"d":"0.00 €"}},{"$f":"+Conso!B327","v":{"v":0,"d":"0.00 €"}},{"$f":"+Conso!B464","v":{"v":0,"d":"0.00 €"}},{"$f":"+Conso!B601","v":{"v":0,"d":"0.00 €"}},{"$f":"+Conso!B737","v":{"v":0,"d":"0.00 €"}},{"$f":"+Conso!B873","v":{"v":0,"d":"0.00 €"}},{"$f":"+Conso!B1009","v":{"v":0,"d":"0.00 €"}},{"$f":"+Conso!B1145","v":{"v":0,"d":"0.00 €"}}]
[null,null,"(FRI) Reports en fonds dédiés à l'investissement sur concours publics des entités gestionnaires d'ESSMS (c/68921) - ESSMS privés",{"$f":"Conso!B192","v":{"v":0,"d":"0.00 €"}},{"$f":"+Conso!B328","v":{"v":0,"d":"0.00 €"}},{"$f":"+Conso!B465","v":{"v":0,"d":"0.00 €"}},{"$f":"+Conso!B602","v":{"v":0,"d":"0.00 €"}},{"$f":"+Conso!B738","v":{"v":0,"d":"0.00 €"}},{"$f":"+Conso!B874","v":{"v":0,"d":"0.00 €"}},{"$f":"+Conso!B1010","v":{"v":0,"d":"0.00 €"}},{"$f":"+Conso!B1146","v":{"v":0,"d":"0.00 €"}}]
[null,null,"(FRE) Autres dotations aux amortissements, provisions et dépréciations",{"$f":"Conso!B193","v":{"v":0,"d":"0.00 €"}},{"$f":"+Conso!B329","v":{"v":0,"d":"0.00 €"}},{"$f":"+Conso!B466","v":{"v":0,"d":"0.00 €"}},{"$f":"+Conso!B603","v":{"v":0,"d":"0.00 €"}},{"$f":"+Conso!B739","v":{"v":0,"d":"0.00 €"}},{"$f":"+Conso!B875","v":{"v":0,"d":"0.00 €"}},{"$f":"+Conso!B1011","v":{"v":0,"d":"0.00 €"}},{"$f":"+Conso!B1147","v":{"v":0,"d":"0.00 €"}}]
[null,null,"(FRE) Reports en fonds dédiés (sauf c/68921) - ESSMS privés",{"$f":"Conso!B194","v":{"v":0,"d":"0.00 €"}},{"$f":"+Conso!B330","v":{"v":0,"d":"0.00 €"}},{"$f":"+Conso!B467","v":{"v":0,"d":"0.00 €"}},{"$f":"+Conso!B604","v":{"v":0,"d":"0.00 €"}},{"$f":"+Conso!B740","v":{"v":0,"d":"0.00 €"}},{"$f":"+Conso!B876","v":{"v":0,"d":"0.00 €"}},{"$f":"+Conso!B1012","v":{"v":0,"d":"0.00 €"}},{"$f":"+Conso!B1148","v":{"v":0,"d":"0.00 €"}}]
[null,null,"Flux internes (produits) (-)",{"$f":"Conso!B195","v":{"v":0,"d":"0.00 €"}},{"$f":"SUM(E36:E43)","v":{"v":0,"d":"0.00 €"}},{"v":0,"d":"0.00 €"},{"v":0,"d":"0.00 €"},{"v":0,"d":"0.00 €"},{"v":0,"d":"0.00 €"},{"v":0,"d":"0.00 €"},{"v":0,"d":"0.00 €"}]
[null,null,"(FRI) Reprises sur provisions réglementées impactant le FRI",{"$f":"Conso!B196","v":{"v":0,"d":"0.00 €"}},{"$f":"+Conso!B332","v":{"v":0,"d":"0.00 €"}},{"$f":"+Conso!B469","v":{"v":0,"d":"0.00 €"}},{"$f":"+Conso!B606","v":{"v":0,"d":"0.00 €"}},{"$f":"+Conso!B742","v":{"v":0,"d":"0.00 €"}},{"$f":"+Conso!B878","v":{"v":0,"d":"0.00 €"}},{"$f":"+Conso!B1014","v":{"v":0,"d":"0.00 €"}},{"$f":"+Conso!B1150","v":{"v":0,"d":"0.00 €"}}]
[null,null,"(FRI) Reprises sur amortissements, autres provisions et dépréciations impactant le FRI (dont c/78748)",{"$f":"Conso!B197","v":{"v":0,"d":"0.00 €"}},{"$f":"+Conso!B333","v":{"v":0,"d":"0.00 €"}},{"$f":"+Conso!B470","v":{"v":0,"d":"0.00 €"}},{"$f":"+Conso!B607","v":{"v":0,"d":"0.00 €"}},{"$f":"+Conso!B743","v":{"v":0,"d":"0.00 €"}},{"$f":"+Conso!B879","v":{"v":0,"d":"0.00 €"}},{"$f":"+Conso!B1015","v":{"v":0,"d":"0.00 €"}},{"$f":"+Conso!B1151","v":{"v":0,"d":"0.00 €"}}]
[null,null,"(FRI) Quote-part des subventions d'investissement virée au résultat de l'exercice",{"$f":"Conso!B199","v":{"v":0,"d":"0.00 €"}},{"$f":"+Conso!B335","v":{"v":0,"d":"0.00 €"}},{"$f":"+Conso!B472","v":{"v":0,"d":"0.00 €"}},{"$f":"+Conso!B609","v":{"v":0,"d":"0.00 €"}},{"$f":"+Conso!B745","v":{"v":0,"d":"0.00 €"}},{"$f":"+Conso!B881","v":{"v":0,"d":"0.00 €"}},{"$f":"+Conso!B1017","v":{"v":0,"d":"0.00 €"}},{"$f":"+Conso!B1153","v":{"v":0,"d":"0.00 €"}}]
[null,null,"(FRI) Quote-part d'éléments du fonds associatif virée au compte de résultat",{"$f":"Conso!B200","v":{"v":0,"d":"0.00 €"}},{"$f":"+Conso!B336","v":{"v":0,"d":"0.00 €"}},{"$f":"+Conso!B473","v":{"v":0,"d":"0.00 €"}},{"$f":"+Conso!B610","v":{"v":0,"d":"0.00 €"}},{"$f":"+Conso!B746","v":{"v":0,"d":"0.00 €"}},{"$f":"+Conso!B882","v":{"v":0,"d":"0.00 €"}},{"$f":"+Conso!B1018","v":{"v":0,"d":"0.00 €"}},{"$f":"+Conso!B1154","v":{"v":0,"d":"0.00 €"}}]
[null,null,"(FRI) Produits des cessions d'immobilisations incorporelles et corporelles",{"$f":"Conso!B201","v":{"v":0,"d":"0.00 €"}},{"$f":"+Conso!B337","v":{"v":0,"d":"0.00 €"}},{"$f":"+Conso!B474","v":{"v":0,"d":"0.00 €"}},{"$f":"+Conso!B611","v":{"v":0,"d":"0.00 €"}},{"$f":"+Conso!B747","v":{"v":0,"d":"0.00 €"}},{"$f":"+Conso!B883","v":{"v":0,"d":"0.00 €"}},{"$f":"+Conso!B1019","v":{"v":0,"d":"0.00 €"}},{"$f":"+Conso!B1155","v":{"v":0,"d":"0.00 €"}}]
[null,null,"(FRI) Utilisation des fonds dédiés à l'investissement sur concours publics des entités gestionnaires d'ESSMS (c/78921) - ESSMS privés",{"$f":"Conso!B202","v":{"v":0,"d":"0.00 €"}},{"$f":"+Conso!B338","v":{"v":0,"d":"0.00 €"}},{"$f":"+Conso!B475","v":{"v":0,"d":"0.00 €"}},{"$f":"+Conso!B612","v":{"v":0,"d":"0.00 €"}},{"$f":"+Conso!B748","v":{"v":0,"d":"0.00 €"}},{"$f":"+Conso!B884","v":{"v":0,"d":"0.00 €"}},{"$f":"+Conso!B1020","v":{"v":0,"d":"0.00 €"}},{"$f":"+Conso!B1156","v":{"v":0,"d":"0.00 €"}}]
[null,null,"(FRE) Reprises sur autres provisions et dépréciations",{"$f":"Conso!B198","v":{"v":0,"d":"0.00 €"}},{"$f":"+Conso!B334","v":{"v":0,"d":"0.00 €"}},{"$f":"+Conso!B471","v":{"v":0,"d":"0.00 €"}},{"$f":"+Conso!B608","v":{"v":0,"d":"0.00 €"}},{"$f":"+Conso!B744","v":{"v":0,"d":"0.00 €"}},{"$f":"+Conso!B880","v":{"v":0,"d":"0.00 €"}},{"$f":"+Conso!B1016","v":{"v":0,"d":"0.00 €"}},{"$f":"+Conso!B1152","v":{"v":0,"d":"0.00 €"}}]
[null,null,"(FRE) Utilisation de fonds dédiés et de fonds reportés (sauf c/78921) - ESSMS privés",{"$f":"Conso!B203","v":{"v":0,"d":"0.00 €"}},{"$f":"+Conso!B339","v":{"v":0,"d":"0.00 €"}},{"$f":"+Conso!B476","v":{"v":0,"d":"0.00 €"}},{"$f":"+Conso!B613","v":{"v":0,"d":"0.00 €"}},{"$f":"+Conso!B749","v":{"v":0,"d":"0.00 €"}},{"$f":"+Conso!B885","v":{"v":0,"d":"0.00 €"}},{"$f":"+Conso!B1021","v":{"v":0,"d":"0.00 €"}},{"$f":"+Conso!B1157","v":{"v":0,"d":"0.00 €"}}]
[null,null,"Capacité (+) / Insuffisance (-) d'autofinancement prévisionnelle",{"$f":"Conso!B204","v":{"v":0,"d":"0.00 €"}},{"$f":"E24+E27-E35","v":{"v":0,"d":"0.00 €"}},{"v":0,"d":"0.00 €"},{"v":0,"d":"0.00 €"},{"v":0,"d":"0.00 €"},{"v":0,"d":"0.00 €"},{"v":0,"d":"0.00 €"},{"v":0,"d":"0.00 €"}]
[null,null,"Dont part affectant le fonds de roulement d'investissement FRI = (3)",{"$f":"Conso!B205","v":{"v":0,"d":"0.00 €"}},{"$f":"E28+E29+E30+E31+E32-E36-E37-E38-E39-E40-E41","v":{"v":0,"d":"0.00 €"}},{"v":0,"d":"0.00 €"},{"v":0,"d":"0.00 €"},{"v":0,"d":"0.00 €"},{"v":0,"d":"0.00 €"},{"v":0,"d":"0.00 €"},{"v":0,"d":"0.00 €"}]
[null,null,"Dont part affectant le fonds de roulement d'exploitation FRE = (4)",{"$f":"Conso!B206","v":{"v":0,"d":"0.00 €"}},{"$f":"E26+E33+E34-E42-E43","v":{"v":0,"d":"0.00 €"}},{"v":0,"d":"0.00 €"},{"v":0,"d":"0.00 €"},{"v":0,"d":"0.00 €"},{"v":0,"d":"0.00 €"},{"v":0,"d":"0.00 €"},{"v":0,"d":"0.00 €"}]
[null,null,"(*) : Les lignes précédées d'un astérisque, qui servent à collecter des données intermédiaires nécessaires au calcul d'indicateurs pour l'année N-1 uniquement, peuvent être masquées. "]
[{"$nulls":3},{"$f":"IF(CREPASIDEN___ANNEEREF___ANN0\\_________=\"\",\"N-1\",CREPASIDEN___ANNEEREF___ANN0\\_________-1)","v":"N-1"},{"$f":"IF(CREPASIDEN___ANNEEREF___ANN0\\_________=\"\",\"N\",CREPASIDEN___ANNEEREF___ANN0\\_________)","v":"N"},{"$f":"IF(CREPASIDEN___ANNEEREF___ANN0\\_________=\"\",\"N+1\",CREPASIDEN___ANNEEREF___ANN0\\_________+1)","v":"N+1"},{"$f":"IF(CREPASIDEN___ANNEEREF___ANN0\\_________=\"\",\"N+2\",CREPASIDEN___ANNEEREF___ANN0\\_________+2)","v":"N+2"},{"$f":"IF(CREPASIDEN___ANNEEREF___ANN0\\_________=\"\",\"N+3\",CREPASIDEN___ANNEEREF___ANN0\\_________+3)","v":"N+3"},{"$f":"IF(CREPASIDEN___ANNEEREF___ANN0\\_________=\"\",\"N+4\",CREPASIDEN___ANNEEREF___ANN0\\_________+4)","v":"N+4"},{"$f":"IF(CREPASIDEN___ANNEEREF___ANN0\\_________=\"\",\"N+5\",CREPASIDEN___ANNEEREF___ANN0\\_________+5)","v":"N+5"},{"$f":"IF(CREPASIDEN___ANNEEREF___ANN0\\_________=\"\",\"N+6\",CREPASIDEN___ANNEEREF___ANN0\\_________+6)","v":"N+6"}]
[null,"F R I","Augmentation des financements stables d'investissement de la période = (5)",{"$f":"SUM(D50:D58)","v":{"v":0,"d":"0.00 €"}},{"v":0,"d":"0.00 €"},{"v":0,"d":"0.00 €"},{"v":0,"d":"0.00 €"},{"v":0,"d":"0.00 €"},{"v":0,"d":"0.00 €"},{"v":0,"d":"0.00 €"},{"v":0,"d":"0.00 €"}]
[null,null,"CAF ou IAF (signe -) prévisionnelle affectée au FRI = (3)",{"$f":"D45","v":{"v":0,"d":"0.00 €"}},{"$f":"E45","v":{"v":0,"d":"0.00 €"}},{"v":0,"d":"0.00 €"},{"v":0,"d":"0.00 €"},{"v":0,"d":"0.00 €"},{"v":0,"d":"0.00 €"},{"v":0,"d":"0.00 €"},{"v":0,"d":"0.00 €"}]
[null,null,"Réserves et excédents affectés à l'investissement (ESSMS pub.: 10682 / ESSMS priv.: 106852)",{"$f":"IF('Bilan Financier'!$M$8-'Bilan Financier'!$L$8>0,'Bilan Financier'!$M$8-'Bilan Financier'!$L$8,0)","v":{"v":0,"d":"0.00 €"}},{"$f":"PGFP!E$85+PGFP!E$86","v":{"v":0,"d":"0.00 €"}},{"$f":"PGFP!F$85+PGFP!F$86","v":{"v":0,"d":"0.00 €"}},{"$f":"PGFP!G$85+PGFP!G$86","v":{"v":0,"d":"0.00 €"}},{"$f":"PGFP!H$85+PGFP!H$86","v":{"v":0,"d":"0.00 €"}},{"$f":"PGFP!I$85+PGFP!I$86","v":{"v":0,"d":"0.00 €"}},{"$f":"PGFP!J$85+PGFP!J$86","v":{"v":0,"d":"0.00 €"}},{"$f":"PGFP!K$85+PGFP!K$86","v":{"v":0,"d":"0.00 €"}}]
[null,null,"Affectation des résultats à la réserve de compensation des charges d'amortissement (ESSMS pub.: 10687/ ESSMS priv.: 106857)",{"$f":"PGFP!D$87","v":{"v":0,"d":"0.00 €"}},{"$f":"PGFP!E$87","v":{"v":0,"d":"0.00 €"}},{"$f":"PGFP!F$87","v":{"v":0,"d":"0.00 €"}},{"$f":"PGFP!G$87","v":{"v":0,"d":"0.00 €"}},{"$f":"PGFP!H$87","v":{"v":0,"d":"0.00 €"}},{"$f":"PGFP!I$87","v":{"v":0,"d":"0.00 €"}},{"$f":"PGFP!J$87","v":{"v":0,"d":"0.00 €"}},{"$f":"PGFP!K$87","v":{"v":0,"d":"0.00 €"}}]
[null,null,"Apports, dotations, réserves, fonds propres (sauf 106 Réserves)",{"$f":"TFP!$E$8","v":{"v":0,"d":"0.00 €"}},{"$f":"TFP!$F$8","v":{"v":0,"d":"0.00 €"}}]
[null,null,"Subventions d'investissement (comptes 13)",{"$f":"TFP!$E$9","v":{"v":0,"d":"0.00 €"}},{"$f":"TFP!$F$9","v":{"v":0,"d":"0.00 €"}}]
[null,null,"Emprunts et dettes assimilées (comptes 16) à plus d'un an",{"$f":"TFP!E11","v":{"v":0,"d":"0.00 €"}},{"$f":"TFP!F11","v":{"v":0,"d":"0.00 €"}}]
[null,null,"Produits des cessions d'immobilisations incorporelles et corporelles",{"$f":"D40","v":{"v":0,"d":"0.00 €"}},{"$f":"E40","v":{"v":0,"d":"0.00 €"}},{"v":0,"d":"0.00 €"},{"v":0,"d":"0.00 €"},{"v":0,"d":"0.00 €"},{"v":0,"d":"0.00 €"},{"v":0,"d":"0.00 €"},{"v":0,"d":"0.00 €"}]
[null,null,"Comptes de liaison investissement (établissements privés)",{"$f":"TFP!$E$13","v":{"v":0,"d":"0.00 €"}},{"$f":"TFP!$F$13","v":{"v":0,"d":"0.00 €"}}]
[null,null,"Autres"]
[null,null,"Diminution des financements stables d'investissement de la période =(6)",{"$f":"D60+D61+D72+D74+D75+D62+D73+D63","v":{"v":0,"d":"0.00 €"}},{"$f":"E60+E61+E72+E74+E75+E62+E73+E63","v":{"v":0,"d":"0.00 €"}},{"v":0,"d":"0.00 €"},{"v":0,"d":"0.00 €"},{"v":0,"d":"0.00 €"},{"v":0,"d":"0.00 €"},{"v":0,"d":"0.00 €"},{"v":0,"d":"0.00 €"}]
[null,null,"Fonds propres et réserves (ESSMS privés) – Réduction - (sauf compte 106) ",{"$f":"TFP!$E$27","v":{"v":0,"d":"0.00 €"}},{"$f":"TFP!$F$27","v":{"v":0,"d":"0.00 €"}}]
[null,null,"Remboursements des emprunts antérieurs à plus d'un an (part capital)"]
[null,null,"Remboursements des emprunts prévus au plan à plus d'un an (part capital)"]
[null,null,"Acquisition d'immobilisations :",{"$f":"SUM(D64:D71)","v":{"v":0,"d":"0.00 €"}},{"$f":"SUM(E64:E71)","v":{"v":0,"d":"0.00 €"}},{"v":0,"d":"0.00 €"},{"v":0,"d":"0.00 €"},{"v":0,"d":"0.00 €"},{"v":0,"d":"0.00 €"},{"v":0,"d":"0.00 €"},{"v":0,"d":"0.00 €"}]
[null,null,"Immobilisations incorporelles",{"$f":"TFP!E$34","v":{"v":0,"d":"0.00 €"}},{"$f":"TFP!F$34","v":{"v":0,"d":"0.00 €"}}]
[null,null,"Terrains",{"$f":"TFP!E36","v":{"v":0,"d":"0.00 €"}},{"$f":"TFP!F36","v":{"v":0,"d":"0.00 €"}}]
[null,null,"Agencements de terrains",{"$f":"TFP!E37","v":{"v":0,"d":"0.00 €"}},{"$f":"TFP!F37","v":{"v":0,"d":"0.00 €"}}]
[null,null,"Constructions",{"$f":"TFP!E38","v":{"v":0,"d":"0.00 €"}},{"$f":"TFP!F38","v":{"v":0,"d":"0.00 €"}}]
[null,null,"Installations techniques matériel et outillage",{"$f":"TFP!E39","v":{"v":0,"d":"0.00 €"}},{"$f":"TFP!F39","v":{"v":0,"d":"0.00 €"}}]
[null,null,"Autres immobilisations corporelles",{"$f":"TFP!E40","v":{"v":0,"d":"0.00 €"}},{"$f":"TFP!F40","v":{"v":0,"d":"0.00 €"}}]
[null,null,"Immobilisations en cours",{"$f":"TFP!E41","v":{"v":0,"d":"0.00 €"}},{"$f":"TFP!F41","v":{"v":0,"d":"0.00 €"}}]
[null,null,"Immobilisations financières",{"$f":"TFP!E42+TFP!E43","v":{"v":0,"d":"0.00 €"}},{"$f":"TFP!F42+TFP!F43","v":{"v":0,"d":"0.00 €"}}]
[null,null,"Reprise sur les réserves de compensation des charges d'amortissement",{"$f":"D81","v":{"v":0,"d":"0.00 €"}},{"$f":"E81","v":{"v":0,"d":"0.00 €"}},{"v":0,"d":"0.00 €"},{"v":0,"d":"0.00 €"},{"v":0,"d":"0.00 €"},{"v":0,"d":"0.00 €"},{"v":0,"d":"0.00 €"},{"v":0,"d":"0.00 €"}]
[null,null,"Charges à répartir sur plusieurs exercices (augmentation)",{"$f":"TFP!E45","v":{"v":0,"d":"0.00 €"}},{"$f":"TFP!F45","v":{"v":0,"d":"0.00 €"}}]
[null,null,"Autres "]
[null,null,"Comptes de liaison investissement (établissements privés)",{"$f":"TFP!E32","v":{"v":0,"d":"0.00 €"}},{"$f":"TFP!F32","v":{"v":0,"d":"0.00 €"}}]
[null,null,"Variations du FRI (5) - (6) = (7)",{"$f":"D49-D59","v":{"v":0,"d":"0.00 €"}},{"v":0,"d":"0.00 €"},{"v":0,"d":"0.00 €"},{"v":0,"d":"0.00 €"},{"v":0,"d":"0.00 €"},{"v":0,"d":"0.00 €"},{"v":0,"d":"0.00 €"},{"v":0,"d":"0.00 €"}]
[null,null,"FRI initial (8)",{"$f":"'Bilan Financier'!L27-'Bilan Financier'!F27","v":{"v":0,"d":"0.00 €"}},{"$f":"D78","v":{"v":0,"d":"0.00 €"}},{"$f":"E78","v":{"v":0,"d":"0.00 €"}},{"v":0,"d":"0.00 €"},{"v":0,"d":"0.00 €"},{"v":0,"d":"0.00 €"},{"v":0,"d":"0.00 €"},{"v":0,"d":"0.00 €"}]
[null,null,"FRI cumulé de fin de période = (7) + (8) = (9)",{"$f":"D76+D77","v":{"v":0,"d":"0.00 €"}},{"$f":"E76+E77","v":{"v":0,"d":"0.00 €"}},{"v":0,"d":"0.00 €"},{"v":0,"d":"0.00 €"},{"v":0,"d":"0.00 €"},{"v":0,"d":"0.00 €"},{"v":0,"d":"0.00 €"},{"v":0,"d":"0.00 €"}]
[null,"F R E","Augmentation des financements stables d'exploitation de la période = (10)",{"$f":"SUM(D80:D83)","v":{"v":0,"d":"0.00 €"}},{"$f":"SUM(E80:E83)","v":{"v":0,"d":"0.00 €"}},{"v":0,"d":"0.00 €"},{"v":0,"d":"0.00 €"},{"v":0,"d":"0.00 €"},{"v":0,"d":"0.00 €"},{"v":0,"d":"0.00 €"},{"v":0,"d":"0.00 €"}]
[null,null,"CAF  ou IAF (signe -) prévisionnelle affectée au FRE =(4)",{"$f":"D46","v":{"v":0,"d":"0.00 €"}},{"v":0,"d":"0.00 €"},{"v":0,"d":"0.00 €"},{"v":0,"d":"0.00 €"},{"v":0,"d":"0.00 €"},{"v":0,"d":"0.00 €"},{"v":0,"d":"0.00 €"},{"v":0,"d":"0.00 €"}]
[null,null,"Reprise sur les réserves de compensation des charges d'amortissement",{"$f":"Conso!B238","v":{"v":0,"d":"0.00 €"}},{"$f":"+Conso!B374","v":{"v":0,"d":"0.00 €"}},{"$f":"+Conso!B511","v":{"v":0,"d":"0.00 €"}},{"$f":"+Conso!B648","v":{"v":0,"d":"0.00 €"}},{"$f":"+Conso!B784","v":{"v":0,"d":"0.00 €"}},{"$f":"+Conso!B920","v":{"v":0,"d":"0.00 €"}},{"$f":"+Conso!B1056","v":{"v":0,"d":"0.00 €"}},{"$f":"+Conso!B1192","v":{"v":0,"d":"0.00 €"}}]
[null,null,"Comptes de liaison trésorerie (stable) (établissements privés)",{"$f":"IF(('Bilan Financier'!$M$37-'Bilan Financier'!$G$37-'Bilan Financier'!$L$37+'Bilan Financier'!$F$37)>0,'Bilan Financier'!$M$37-'Bilan Financier'!$G$37-'Bilan Financier'!$L$37+'Bilan Financier'!$F$37,0)","v":{"v":0,"d":"0.00 €"}}]
[null,null,"Autres"]
[null,null,"Diminution des financements stables d'exploitation de la période = (11)",{"$f":"SUM(D85:D89)","v":{"v":0,"d":"0.00 €"}},{"$f":"SUM(E85:E89)","v":{"v":0,"d":"0.00 €"}},{"v":0,"d":"0.00 €"},{"v":0,"d":"0.00 €"},{"v":0,"d":"0.00 €"},{"v":0,"d":"0.00 €"},{"v":0,"d":"0.00 €"},{"v":0,"d":"0.00 €"}]
[null,null,"Reprise à l'investissement des réserves de couverture du BFR"]
[null,null,"Affectation des résultats à l'investissement"]
[null,null,"Affectation des résultats à la réserve de compensation des charges d'amortissement (ESSMS pub.: 10687 / ESSMS priv.: 106857)"]
[null,null,"Comptes de liaison trésorerie (stable) (établissements privés)",{"$f":"IF(('Bilan Financier'!$M$37-'Bilan Financier'!$G$37-'Bilan Financier'!$L$37+'Bilan Financier'!$F$37)<0,-('Bilan Financier'!$M$37-'Bilan Financier'!$G$37-'Bilan Financier'!$L$37+'Bilan Financier'!$F$37),0)","v":{"v":0,"d":"0.00 €"}}]
[null,null,"Autres"]
[null,null,"Variations du FRE (10) - (11) = (12)",{"$f":"D79-D84","v":{"v":0,"d":"0.00 €"}},{"v":0,"d":"0.00 €"},{"v":0,"d":"0.00 €"},{"v":0,"d":"0.00 €"},{"v":0,"d":"0.00 €"},{"v":0,"d":"0.00 €"},{"v":0,"d":"0.00 €"},{"v":0,"d":"0.00 €"}]
[null,null,"FRE initial (13)",{"$f":"+'Bilan Financier'!L39-'Bilan Financier'!F39","v":{"v":0,"d":"0.00 €"}},{"$f":"D92","v":{"v":0,"d":"0.00 €"}},{"$f":"E92","v":{"v":0,"d":"0.00 €"}},{"v":0,"d":"0.00 €"},{"v":0,"d":"0.00 €"},{"v":0,"d":"0.00 €"},{"v":0,"d":"0.00 €"},{"v":0,"d":"0.00 €"}]
[null,null,"FRE cumulé de fin de période = (12) + (13) = (14)",{"$f":"D90+D91","v":{"v":0,"d":"0.00 €"}},{"$f":"E90+E91","v":{"v":0,"d":"0.00 €"}},{"v":0,"d":"0.00 €"},{"v":0,"d":"0.00 €"},{"v":0,"d":"0.00 €"},{"v":0,"d":"0.00 €"},{"v":0,"d":"0.00 €"},{"v":0,"d":"0.00 €"}]
[]
[null,"FRNG","Apport ou prélèvement sur le fonds de roulement net global = (7) + (12) = (15)",{"$f":"D76+D90","v":{"v":0,"d":"0.00 €"}},{"v":0,"d":"0.00 €"},{"v":0,"d":"0.00 €"},{"v":0,"d":"0.00 €"},{"v":0,"d":"0.00 €"},{"v":0,"d":"0.00 €"},{"v":0,"d":"0.00 €"},{"v":0,"d":"0.00 €"}]
[null,null,"FRNG initial = (16)",{"$f":"D77+D91","v":{"v":0,"d":"0.00 €"}},{"$f":"D96","v":{"v":0,"d":"0.00 €"}},{"$f":"E96","v":{"v":0,"d":"0.00 €"}},{"v":0,"d":"0.00 €"},{"v":0,"d":"0.00 €"},{"v":0,"d":"0.00 €"},{"v":0,"d":"0.00 €"},{"v":0,"d":"0.00 €"}]
[null,null,"Fonds de Roulement Net Global (FRNG) de fin de période = (15) + (16) = (17)",{"$f":"D94+D95","v":{"v":0,"d":"0.00 €"}},{"v":0,"d":"0.00 €"},{"v":0,"d":"0.00 €"},{"v":0,"d":"0.00 €"},{"v":0,"d":"0.00 €"},{"v":0,"d":"0.00 €"},{"v":0,"d":"0.00 €"},{"v":0,"d":"0.00 €"}]
[]
[{"$nulls":3},{"$f":"IF(CREPASIDEN___ANNEEREF___ANN0\\_________=\"\",\"N-1\",CREPASIDEN___ANNEEREF___ANN0\\_________-1)","v":"N-1"},{"$f":"IF(CREPASIDEN___ANNEEREF___ANN0\\_________=\"\",\"N\",CREPASIDEN___ANNEEREF___ANN0\\_________)","v":"N"},{"$f":"IF(CREPASIDEN___ANNEEREF___ANN0\\_________=\"\",\"N+1\",CREPASIDEN___ANNEEREF___ANN0\\_________+1)","v":"N+1"},{"$f":"IF(CREPASIDEN___ANNEEREF___ANN0\\_________=\"\",\"N+2\",CREPASIDEN___ANNEEREF___ANN0\\_________+2)","v":"N+2"},{"$f":"IF(CREPASIDEN___ANNEEREF___ANN0\\_________=\"\",\"N+3\",CREPASIDEN___ANNEEREF___ANN0\\_________+3)","v":"N+3"},{"$f":"IF(CREPASIDEN___ANNEEREF___ANN0\\_________=\"\",\"N+4\",CREPASIDEN___ANNEEREF___ANN0\\_________+4)","v":"N+4"},{"$f":"IF(CREPASIDEN___ANNEEREF___ANN0\\_________=\"\",\"N+5\",CREPASIDEN___ANNEEREF___ANN0\\_________+5)","v":"N+5"},{"$f":"IF(CREPASIDEN___ANNEEREF___ANN0\\_________=\"\",\"N+6\",CREPASIDEN___ANNEEREF___ANN0\\_________+6)","v":"N+6"}]
[null,"B F R","Augmentation du besoin en fonds de roulement de la période = (18)",{"$f":"SUM(D100:D103)","v":{"v":0,"d":"0.00 €"}},{"$f":"SUM(E100:E103)","v":{"v":0,"d":"0.00 €"}},{"v":0,"d":"0.00 €"},{"v":0,"d":"0.00 €"},{"v":0,"d":"0.00 €"},{"v":0,"d":"0.00 €"},{"v":0,"d":"0.00 €"},{"v":0,"d":"0.00 €"}]
[null,null,"Augmentation des stocks",{"$f":"IF('Bilan Financier'!$G$42-'Bilan Financier'!$F$42>0,'Bilan Financier'!$G$42-'Bilan Financier'!$F$42,0)","v":{"v":0,"d":"0.00 €"}}]
[null,null,"Augmentation des créances (effet volume ou prix)",{"$f":"IF(SUM('Bilan Financier'!$G$44:'Bilan Financier'!$G$46)>SUM('Bilan Financier'!$F$44:'Bilan Financier'!$F$46),SUM('Bilan Financier'!$G$44:'Bilan Financier'!$G$46)-SUM('Bilan Financier'!$F$44:'Bilan Financier'!$F$46),0)","v":{"v":0,"d":"0.00 €"}}]
[null,null,"Diminution des dettes fournisseurs (effet volume ou prix)",{"$f":"IF('Bilan Financier'!M43<'Bilan Financier'!L43,'Bilan Financier'!L43-'Bilan Financier'!M43,0)","v":{"v":0,"d":"0.00 €"}}]
[null,null,"Autres augmentations du BFR",{"$f":"IF((('Bilan Financier'!G43+SUM('Bilan Financier'!G47:G49)+'Bilan Financier'!G51-'Bilan Financier'!M42-SUM('Bilan Financier'!M44:M49)-'Bilan Financier'!M51)-('Bilan Financier'!F43+SUM('Bilan Financier'!F47:F49)+'Bilan Financier'!F51-'Bilan Financier'!L42-SUM('Bilan Financier'!L44:L49)-'Bilan Financier'!L51))>0,(('Bilan Financier'!G43+SUM('Bilan Financier'!G47:G49)+'Bilan Financier'!G51-'Bilan Financier'!M42-SUM('Bilan Financier'!M44:M49)-'Bilan Financier'!M51)-('Bilan Financier'!F43+SUM('Bilan Financier'!F47:F49)+'Bilan Financier'!F51-'Bilan Financier'!L42-SUM('Bilan Financier'!L44:L49)-'Bilan Financier'!L51)),0)","v":{"v":0,"d":"0.00 €"}}]
[null,null,"Diminution du besoin en fonds de roulement de la période = (19)",{"$f":"SUM(D105:D108)","v":{"v":0,"d":"0.00 €"}},{"$f":"SUM(E105:E108)","v":{"v":0,"d":"0.00 €"}},{"v":0,"d":"0.00 €"},{"v":0,"d":"0.00 €"},{"v":0,"d":"0.00 €"},{"v":0,"d":"0.00 €"},{"v":0,"d":"0.00 €"},{"v":0,"d":"0.00 €"}]
[null,null,"Diminution des stocks",{"$f":"IF('Bilan Financier'!$F$42>'Bilan Financier'!$G$42,'Bilan Financier'!$F$42-'Bilan Financier'!$G$42,0)","v":{"v":0,"d":"0.00 €"}}]
[null,null,"Diminution des créances (effet volume ou prix)",{"$f":"IF(SUM('Bilan Financier'!$G$44:'Bilan Financier'!$G$46)<SUM('Bilan Financier'!$F$44:'Bilan Financier'!$F$46),SUM('Bilan Financier'!$F$44:'Bilan Financier'!$F$46)-SUM('Bilan Financier'!$G$44:'Bilan Financier'!$G$46),0)","v":{"v":0,"d":"0.00 €"}}]
[null,null,"Augmentation des dettes fournisseurs",{"$f":"IF('Bilan Financier'!M43>'Bilan Financier'!L43,'Bilan Financier'!M43-'Bilan Financier'!L43,0)","v":{"v":0,"d":"0.00 €"}}]
[null,null,"Autres diminutions du BFR",{"$f":"IF((('Bilan Financier'!G43+SUM('Bilan Financier'!G47:G49)+'Bilan Financier'!G51-'Bilan Financier'!M42-SUM('Bilan Financier'!M44:M49)-'Bilan Financier'!M51)-('Bilan Financier'!F43+SUM('Bilan Financier'!F47:F49)+'Bilan Financier'!F51-'Bilan Financier'!L42-SUM('Bilan Financier'!L44:L49)-'Bilan Financier'!L51))<0,-(('Bilan Financier'!G43+SUM('Bilan Financier'!G47:G49)+'Bilan Financier'!G51-'Bilan Financier'!M42-SUM('Bilan Financier'!M44:M49)-'Bilan Financier'!M51)-('Bilan Financier'!F43+SUM('Bilan Financier'!F47:F49)+'Bilan Financier'!F51-'Bilan Financier'!L42-SUM('Bilan Financier'!L44:L49)-'Bilan Financier'!L51)),0)","v":{"v":0,"d":"0.00 €"}}]
[null,null,"Variations du BFR = (18) - (19) = (20)",{"$f":"D99-D104","v":{"v":0,"d":"0.00 €"}},{"$f":"E99-E104","v":{"v":0,"d":"0.00 €"}},{"v":0,"d":"0.00 €"},{"v":0,"d":"0.00 €"},{"v":0,"d":"0.00 €"},{"v":0,"d":"0.00 €"},{"v":0,"d":"0.00 €"},{"v":0,"d":"0.00 €"}]
[null,null,"BFR initial (21)",{"$f":"+'Bilan Financier'!F53-'Bilan Financier'!L53","v":{"v":0,"d":"0.00 €"}},{"$f":"D111","v":{"v":0,"d":"0.00 €"}},{"$f":"E111","v":{"v":0,"d":"0.00 €"}},{"v":0,"d":"0.00 €"},{"v":0,"d":"0.00 €"},{"v":0,"d":"0.00 €"},{"v":0,"d":"0.00 €"},{"v":0,"d":"0.00 €"}]
[null,null,"BFR cumulé fin de période = (20) + (21) = (22)",{"$f":"D109+D110","v":{"v":0,"d":"0.00 €"}},{"$f":"E109+E110","v":{"v":0,"d":"0.00 €"}},{"v":0,"d":"0.00 €"},{"v":0,"d":"0.00 €"},{"v":0,"d":"0.00 €"},{"v":0,"d":"0.00 €"},{"v":0,"d":"0.00 €"},{"v":0,"d":"0.00 €"}]
[null,"T","Variations de la trésorerie sur la période = (7) + (12) - (20) = (23)",{"$f":"D94-D109","v":{"v":0,"d":"0.00 €"}},{"$f":"E94-E109","v":{"v":0,"d":"0.00 €"}},{"v":0,"d":"0.00 €"},{"v":0,"d":"0.00 €"},{"v":0,"d":"0.00 €"},{"v":0,"d":"0.00 €"},{"v":0,"d":"0.00 €"},{"v":0,"d":"0.00 €"}]
[null,null,"Trésorerie Initiale = (24)",{"$f":"'Bilan Financier'!F63-'Bilan Financier'!L63","v":{"v":0,"d":"0.00 €"}},{"$f":"D114","v":{"v":0,"d":"0.00 €"}},{"$f":"E114","v":{"v":0,"d":"0.00 €"}},{"v":0,"d":"0.00 €"},{"v":0,"d":"0.00 €"},{"v":0,"d":"0.00 €"},{"v":0,"d":"0.00 €"},{"v":0,"d":"0.00 €"}]
[null,null,"Trésorerie de fin de période = (23) + (24) = (25)",{"$f":"D112+D113","v":{"v":0,"d":"0.00 €"}},{"$f":"E112+E113","v":{"v":0,"d":"0.00 €"}},{"v":0,"d":"0.00 €"},{"v":0,"d":"0.00 €"},{"v":0,"d":"0.00 €"},{"v":0,"d":"0.00 €"},{"v":0,"d":"0.00 €"},{"v":0,"d":"0.00 €"}]
[null,null,"Variations des financements à court terme = (26)",{"$f":"SUM('Bilan Financier'!M55:'Bilan Financier'!M61)-SUM('Bilan Financier'!L55:'Bilan Financier'!L61)","v":{"v":0,"d":"0.00 €"}}]
[null,null,"Liquidités de fin de période = Liquidités de début de période + (23) + (26)",{"$f":"'Bilan Financier'!F62+D112+D115","v":{"v":0,"d":"0.00 €"}},{"$f":"D116+E112+E115","v":{"v":0,"d":"0.00 €"}},{"v":0,"d":"0.00 €"},{"v":0,"d":"0.00 €"},{"v":0,"d":"0.00 €"},{"v":0,"d":"0.00 €"},{"v":0,"d":"0.00 €"},{"v":0,"d":"0.00 €"}]
[]
[{"$nulls":3},"Contrôle cohérence                                                 avec l'onglet \"Bilan Financier\" :"]
[null,null,"FRNG (montant inscrit en D96 du PGFP) :",{"$f":"IF(ROUND(+D96-('Bilan Financier'!M40-'Bilan Financier'!G40),0)=0,\"OK\",\"Écart de \"&ROUND((+D96-('Bilan Financier'!M40-'Bilan Financier'!G40)),0)&\" €\")","v":"OK"}]
[null,null,"Trésorerie (montant inscrit en cellule D114 du PGFP):",{"$f":"IF(ROUND(+D114-('Bilan Financier'!G63-'Bilan Financier'!M63),0)=0,\"OK\",\"Écart de \"&ROUND((+D114-('Bilan Financier'!G63-'Bilan Financier'!M63)),0)&\" €\")","v":"OK"}]
[]
[null,null,"Données complémentaires nécessaires au calcul des ratios"]
[null,null,"Montant cumulé des emprunts en fin d'année (compte 16 hors compte 1688) à plus d'un an",null,{"$f":"+D123+E55-E61-E62","v":{"v":0,"d":"0.00 €"}},{"v":0,"d":"0.00 €"},{"v":0,"d":"0.00 €"},{"v":0,"d":"0.00 €"},{"v":0,"d":"0.00 €"},{"v":0,"d":"0.00 €"},{"v":0,"d":"0.00 €"}]
[null,null,"Montant des comptes 165 (ESSMS publics) et 169"]
[null,null,"Montant des remboursements de cautions sur l'année (compte 165) (ESSMS publics)"]
[null,null,"Montant cumulé des financements stables du FRI en fin d'année (hors amortissements)",{"$f":"'Bilan Financier'!M26-'Bilan Financier'!M16-'Bilan Financier'!M21","v":{"v":0,"d":"0.00 €"}},{"$f":"D126+SUM(E51:E55)+SUM(E57:E58)-SUM(E60:E62)-E72-E74-E75+E30+(E31-Conso!B1264-Conso!B1263)+E32-E36-(E37-Conso!B1265)-SUM(E38:E39)-E41","v":{"v":0,"d":"0.00 €"}},{"$f":"E126+SUM(F51:F55)+SUM(F57:F58)-SUM(F60:F62)-F72-F74-F75+F30+(F31-Conso!B1268)+F32-F36-(F37-Conso!B1269)-SUM(F38:F39)-F41","v":{"v":0,"d":"0.00 €"}},{"$f":"F126+SUM(G51:G55)+SUM(G57:G58)-SUM(G60:G62)-G72-G74-G75+G30+(G31-Conso!B1272)+G32-G36-(G37-Conso!B1273)-SUM(G38:G39)-G41","v":{"v":0,"d":"0.00 €"}},{"$f":"G126+SUM(H51:H55)+SUM(H57:H58)-SUM(H60:H62)-H72-H74-H75+H30+(H31-Conso!B1276)+H32-H36-(H37-Conso!B1277)-SUM(H38:H39)-H41","v":{"v":0,"d":"0.00 €"}},{"$f":"H126+SUM(I51:I55)+SUM(I57:I58)-SUM(I60:I62)-I72-I74-I75+I30+(I31-Conso!B1280)+I32-I36-(I37-Conso!B1281)-SUM(I38:I39)-I41","v":{"v":0,"d":"0.00 €"}},{"$f":"I126+SUM(J51:J55)+SUM(J57:J58)-SUM(J60:J62)-J72-J74-J75+J30+(J31-Conso!B1284)+J32-J36-(J37-Conso!B1285)-SUM(J38:J39)-J41","v":{"v":0,"d":"0.00 €"}},{"$f":"J126+SUM(K51:K55)+SUM(K57:K58)-SUM(K60:K62)-K72-K74-K75+K30+(K31-Conso!B1288)+K32-K36-(K37-Conso!B1289)-SUM(K38:K39)-K41","v":{"v":0,"d":"0.00 €"}}]
[null,null,"Montant cumulé de l'actif immobilisé brut en fin d'année (1)",{"$f":"'Bilan Financier'!$G$7+'Bilan Financier'!$G$10+'Bilan Financier'!$G$11+'Bilan Financier'!$G$12+'Bilan Financier'!$G$13+'Bilan Financier'!$G$14+'Bilan Financier'!$G$15","v":{"v":0,"d":"0.00 €"}},{"$f":"D129+E64+E66+E67+E68+E69+E70","v":{"v":0,"d":"0.00 €"}},{"$f":"E129+F64+F66+F67+F68+F69+F70","v":{"v":0,"d":"0.00 €"}},{"v":0,"d":"0.00 €"},{"v":0,"d":"0.00 €"},{"v":0,"d":"0.00 €"},{"v":0,"d":"0.00 €"},{"v":0,"d":"0.00 €"}]
[null,null,"Mesures correctives le cas échéant (sorties d'immobilisations, etc.)"]
[null,null,"Montant cumulé de l'actif immobilisé brut en fin d'année pris en compte pour le calcul du taux de vétusté",{"$f":"D127","v":{"v":0,"d":"0.00 €"}},{"$f":"E127-E128","v":{"v":0,"d":"0.00 €"}},{"v":0,"d":"0.00 €"},{"v":0,"d":"0.00 €"},{"v":0,"d":"0.00 €"},{"v":0,"d":"0.00 €"},{"v":0,"d":"0.00 €"},{"v":0,"d":"0.00 €"}]
[null,null,"Montant cumulé des amortissements en fin d'année (1)",{"$f":"'Bilan Financier'!$M$16+'Bilan Financier'!$M$21","v":{"v":0,"d":"0.00 €"}},{"$f":"D132+E29","v":{"v":0,"d":"0.00 €"}},{"v":0,"d":"0.00 €"},{"v":0,"d":"0.00 €"},{"v":0,"d":"0.00 €"},{"v":0,"d":"0.00 €"},{"v":0,"d":"0.00 €"},{"v":0,"d":"0.00 €"}]
[null,null,"Mesures correctives le cas échéant"]
[null,null,"Montant cumulé des amortissements en fin d'année pris en compte pour le calcul du taux de vétusté",{"$f":"D130","v":{"v":0,"d":"0.00 €"}},{"$f":"E130-E131","v":{"v":0,"d":"0.00 €"}},{"$f":"F130-F131","v":{"v":0,"d":"0.00 €"}},{"v":0,"d":"0.00 €"},{"v":0,"d":"0.00 €"},{"v":0,"d":"0.00 €"},{"v":0,"d":"0.00 €"},{"v":0,"d":"0.00 €"}]
[null,null,"Montant cumulé des valeurs comptables des immobilisations incorporelles et corporelles cédées (compte 652 seulement)",{"$f":"Conso!B296","v":{"v":0,"d":"0.00 €"}},{"$f":"Conso!B432","v":{"v":0,"d":"0.00 €"}}]
[]
[null,"R A T I O S","Taux d'endettement (< 50%)",{"$f":"IF(D126=0,0,(D123-D124)/D126)","v":{"v":0,"d":"0.00%"}},{"v":0,"d":"0.00%"},{"v":0,"d":"0.00%"},{"v":0,"d":"0.00%"},{"v":0,"d":"0.00%"},{"v":0,"d":"0.00%"},{"v":0,"d":"0.00%"},{"v":0,"d":"0.00%"}]
[null,null,"Durée apparente de la dette (< 10 ans)",{"$f":"IF(D44=0,0,(D123-D124)/D44)","v":{"v":0,"d":"0.00"}},{"v":0,"d":"0.00"},{"v":0,"d":"0.00"},{"v":0,"d":"0.00"},{"v":0,"d":"0.00"},{"v":0,"d":"0.00"},{"v":0,"d":"0.00"},{"v":0,"d":"0.00"}]
[null,null,"CAF / Remboursement annuel du capital des emprunts (>1)",{"$f":"IF((D61+D62-D125)=0,0,D44/(D61+D62-D125))","v":{"v":0,"d":"0.00"}},{"v":0,"d":"0.00"},{"v":0,"d":"0.00"},{"v":0,"d":"0.00"},{"v":0,"d":"0.00"},{"v":0,"d":"0.00"},{"v":0,"d":"0.00"},{"v":0,"d":"0.00"}]
[null,null,"Trésorerie en jours",{"$f":"IF(D21-D18=0,0,(D114*365)/(D21-D18))","v":{"v":0,"d":"0.00"}},{"$f":"IF(E21-E18=0,0,(E114*365)/(E21-E18))","v":{"v":0,"d":"0.00"}},{"v":0,"d":"0.00"},{"v":0,"d":"0.00"},{"v":0,"d":"0.00"},{"v":0,"d":"0.00"},{"v":0,"d":"0.00"},{"v":0,"d":"0.00"}]
[null,null,"Taux de CAF en % des produits (hors c/747, 757, 775, 777 et 78)",{"$f":"IF(D12=0,0,D44/D12)","v":{"v":0,"d":"0.00%"}},{"v":0,"d":"0.00%"},{"v":0,"d":"0.00%"},{"v":0,"d":"0.00%"},{"v":0,"d":"0.00%"},{"v":0,"d":"0.00%"},{"v":0,"d":"0.00%"},{"v":0,"d":"0.00%"}]
[null,null,"Taux de vétusté global des immobilisations (1)",{"$f":"IF(('Bilan Financier'!$G$7+'Bilan Financier'!$G$8-'Bilan Financier'!$G$9+'Bilan Financier'!$G$14+'Bilan Financier'!$G$15)=0,0,('Bilan Financier'!$M$16+'Bilan Financier'!$M$21)/('Bilan Financier'!$G$7+'Bilan Financier'!$G$8-'Bilan Financier'!$G$9+'Bilan Financier'!$G$14+'Bilan Financier'!$G$15))","v":{"v":0,"d":"0.00%"}},{"$f":"IF(E129=0,0,E132/E129)","v":{"v":0,"d":"0.00%"}},{"$f":"IF(F129=0,0,F132/F129)","v":{"v":0,"d":"0.00%"}},{"v":0,"d":"0.00%"},{"v":0,"d":"0.00%"},{"v":0,"d":"0.00%"},{"v":0,"d":"0.00%"},{"v":0,"d":"0.00%"}]
[null,null,"Marge brute d'exploitation (hors c/747 et 757)",{"$f":"D6+D8-D14-D16-D19-D20-Ratios_financiers!J12-D133","v":{"v":0,"d":"0.00 €"}},{"$f":"E6+E8-E14-E16-E19-E20-Conso!B431-E133","v":{"v":0,"d":"0.00 €"}},{"$f":"F6+F8-F14-F16-F19-F20-F133","v":{"v":0,"d":"0.00 €"}},{"v":0,"d":"0.00 €"},{"v":0,"d":"0.00 €"},{"v":0,"d":"0.00 €"},{"v":0,"d":"0.00 €"},{"v":0,"d":"0.00 €"}]
[null,null,"Taux de marge brute d'exploitation en % des produits courants (hors c/747 et 757)",{"$f":"IF(Conso!B293=0,0,D141/Conso!B293)","v":{"v":0,"d":"0.00%"}},{"$f":"IF(Conso!B429=0,0,E141/Conso!B429)","v":{"v":0,"d":"0.00%"}},{"$f":"IF((F6+F8)=0,0,F141/(F6+F8))","v":{"v":0,"d":"0.00%"}},{"v":0,"d":"0.00%"},{"v":0,"d":"0.00%"},{"v":0,"d":"0.00%"},{"v":0,"d":"0.00%"},{"v":0,"d":"0.00%"}]
[]
[]
[null,null,"(1) : Le taux de vétusté pour l'année N-1 est calculé à partir des données du tableau \"Bilan financier\". Pour les années qui suivent, les acquisitions nouvelles et les dotations aux amortissements sont intégrées automatiquement à partir des données \"CAF\" et \"FRI\" ci-dessus. Si nécessaire, ces données doivent être corrigées (notamment en cas de sorties d'immobilisations)."]

{"sheet":"Bilan Financier","index":19,"n_rows":75,"n_cols":13,"rows_kept":75,"hidden":true,"merged":[[1,1,1,12],[3,1,3,6],[3,7,3,12],[4,1,4,4],[4,7,4,10],[26,1,26,4],[26,7,26,10],[38,1,38,4],[38,7,38,10],[39,1,39,4],[39,7,39,10],[52,1,52,4],[52,7,52,10],[62,1,62,4],[62,7,62,10],[63,1,63,4],[63,7,63,10],[66,5,66,6]]}
[]
[null,"Bilan financier - Détermination du fonds de roulement au 31 décembre N-1 \n(document à n'établir qu'après la clôture de l'exercice N-1)"]
[]
[]
[null,"BIENS",{"$nulls":3},{"$f":"IF(CREPASIDEN___ANNEEREF___ANN0\\_________=\"\",\"N-2\",CREPASIDEN___ANNEEREF___ANN0\\_________-2)","v":"N-2"},{"$f":"IF(CREPASIDEN___ANNEEREF___ANN0\\_________=\"\",\"Réel  N-1 (1)\",\"Réel \"& CREPASIDEN___ANNEEREF___ANN0\\_________-1 &\" (1)\")","v":"Réel  N-1 (1)"},"FINANCEMENTS",{"$nulls":3},{"$f":"IF(CREPASIDEN___ANNEEREF___ANN0\\_________=\"\",\"N-2\",CREPASIDEN___ANNEEREF___ANN0\\_________-2)","v":"N-2"},{"$f":"IF(CREPASIDEN___ANNEEREF___ANN0\\_________=\"\",\"Réel  N-1 (1)\",\"Réel \"& CREPASIDEN___ANNEEREF___ANN0\\_________-1 &\" (1)\")","v":"Réel  N-1 (1)"}]
[null,null,"Biens stables",{"$nulls":5},"Financements stables"]
[{"$nulls":3},"Immobilisations incorporelles brutes",{"$nulls":5},"Apports, dotations, réserves et fonds propres"]
[{"$nulls":3},"Immobilisations corporelles brutes",null,{"$f":"SUM(F9:F13)","v":{"v":0,"d":"0.00 €"}},{"$f":"SUM(G9:G13)","v":{"v":0,"d":"0.00 €"}},null,null,"Excédents affectés à l'investissement"]
[{"$nulls":4},"- Terrains",{"$nulls":4},"Subventions d'investissement"]
[{"$nulls":4},"- Agencements de terrain",{"$nulls":4},"Réserve de compensation des charges d'amortissement"]
[{"$nulls":4},"- Constructions",{"$nulls":4},"Provisions pour renouvellement des immobilisations"]
[{"$nulls":4},"- Installations techniques, matériel et outillage",{"$nulls":4},"Fonds dédiés à l'investissement (3)"]
[{"$nulls":4},"- Autres immobilisations corporelles",{"$nulls":4},"Provisions réglementées des plus-values nettes d'actif"]
[{"$nulls":3},"Immobilisations corporelles et incorporelles en cours",{"$nulls":5},"Emprunts et dettes assimilées (à plus d'un an à l'origine)"]
[{"$nulls":3},"Immobilisations en cours - Part investissement PPP (2)",{"$nulls":5},"Dépôts et cautionnements reçus"]
[{"$nulls":9},"Amortissements des immobilisations corporelles",null,{"$f":"SUM(L17:L20)","v":{"v":0,"d":"0.00 €"}},{"$f":"SUM(M17:M20)","v":{"v":0,"d":"0.00 €"}}]
[{"$nulls":10},"- Agencements de terrain"]
[{"$nulls":10},"- Constructions"]
[{"$nulls":10},"- Installations techniques, matériel et outillage"]
[{"$nulls":3},"Immobilisations financières",{"$nulls":6},"- Autres immobilisations corporelles"]
[{"$nulls":3},"Amortissements comptables excédentaires différés (3)",{"$nulls":5},"Amortissement des immobilisations incorporelles"]
[{"$nulls":9},"Dépenses refusées par l'autorité de tarification (3) (6) "]
[{"$nulls":3},"Charges à répartir sur plusieurs exercices",{"$nulls":5},"Dépréciation des immobilisations"]
[{"$nulls":3},"Autres",{"$nulls":5},"Autres (7)"]
[{"$nulls":3},"Comptes de liaison investissement (3)",{"$nulls":5},"Compte de liaison investissement (3) (8)"]
[{"$nulls":4},"Total II",{"$f":"F7+F8+F14+F15+F20+F21+F22+F23+F24+F25","v":{"v":0,"d":"0.00 €"}},{"$f":"G7+G8+G14+G15+G20+G21+G22+G23+G24+G25","v":{"v":0,"d":"0.00 €"}},{"$nulls":3},"Total I",{"$f":"L7+L8+L9+L10+L11+L12+L13+L14+L15+L16+L21+L22+L23+L24+L25","v":{"v":0,"d":"0.00 €"}},{"$f":"M7+M8+M9+M10+M11+M12+M13+M14+M15+M16+M21+M22+M23+M24+M25","v":{"v":0,"d":"0.00 €"}}]
[null,"Fonds de roulement d'investissement négatif (I-II)",{"$nulls":3},{"$f":"IF(L26-F26>0,0,F26-L26)","v":{"v":0,"d":"0.00 €"}},{"$f":"IF(M26-G26>0,0,G26-M26)","v":{"v":0,"d":"0.00 €"}},"Fonds de roulement d'investissement positif (I-II)",{"$nulls":3},{"$f":"IF(L26-F26<0,0,L26-F26)","v":{"v":0,"d":"0.00 €"}},{"$f":"IF(M26-G26<0,0,M26-G26)","v":{"v":0,"d":"0.00 €"}}]
[null,null,"Actifs stables d'exploitation",{"$nulls":5},"Financements stables d'exploitation"]
[{"$nulls":3},"Report à nouveau déficitaire (4)",{"$nulls":5},"Réserves et provisions affectées à la couverture du BFR"]
[{"$nulls":3},"Résultat déficitaire (4)",{"$nulls":5},"Réserves de compensation des déficits"]
[{"$nulls":3},"Créances glissantes",{"$nulls":5},"Résultat excédentaire (4)"]
[{"$nulls":3},"Droits acquis par les salariés, non provisionnés (3)",{"$nulls":5},"Report à nouveau excédentaire en attente d'affectation (4)"]
[{"$nulls":9},"Provisions pour risques et charges"]
[{"$nulls":9},"Fonds dédiés à l'exploitation (3)"]
[{"$nulls":9},"Dépréciation des stocks, créances et éléments financiers"]
[{"$nulls":9},"Autres"]
[{"$nulls":3},"Compte de liaison trésorerie (stable)",{"$nulls":5},"Compte de liaison trésorerie (stable)"]
[{"$nulls":4},"Total IV",{"$f":"F29+F30+F31+F32+F37","v":{"v":0,"d":"0.00 €"}},{"$f":"G29+G30+G31+G32+G37","v":{"v":0,"d":"0.00 €"}},{"$nulls":3},"Total III",{"$f":"SUM(L29:L37)","v":{"v":0,"d":"0.00 €"}},{"$f":"SUM(M29:M37)","v":{"v":0,"d":"0.00 €"}}]
[null,"Fonds de roulement d'exploitation négatif (III-IV)",{"$nulls":3},{"$f":"IF(L38-F38>0,0,F38-L38)","v":{"v":0,"d":"0.00 €"}},{"$f":"IF(M38-G38>0,0,G38-M38)","v":{"v":0,"d":"0.00 €"}},"Fonds de roulement d'exploitation positif (III-IV)",{"$nulls":3},{"$f":"IF(L38-F38<0,0,L38-F38)","v":{"v":0,"d":"0.00 €"}},{"$f":"IF(M38-G38<0,0,M38-G38)","v":{"v":0,"d":"0.00 €"}}]
[null,"Fonds de roulement net global négatif",{"$nulls":3},{"$f":"IF(L39+L27-F39-F27>0,0,F39+F27-L39-L27)","v":{"v":0,"d":"0.00 €"}},{"$f":"IF(M39+M27-G39-G27>0,0,G39+G27-M39-M27)","v":{"v":0,"d":"0.00 €"}},"Fonds de roulement net global positif",{"$nulls":3},{"$f":"IF(L39+L27-F39-F27<0,0,L39+L27-F39-F27)","v":{"v":0,"d":"0.00 €"}},{"$f":"IF(M39+M27-G39-G27<0,0,M39+M27-G39-G27)","v":{"v":0,"d":"0.00 €"}}]
[null,null,"Valeurs d'exploitation",{"$nulls":5},"Dettes d'exploitation"]
[{"$nulls":3},"Stocks et en-cours",{"$nulls":5},"Avances reçues"]
[{"$nulls":3},"Avances et acomptes versés",{"$nulls":5},"Fournisseurs"]
[{"$nulls":3},"Créances sur organismes payeurs, usagers et clients",{"$nulls":5},"Dettes sociales et fiscales"]
[{"$nulls":3},"Créances diverses d'exploitation",{"$nulls":5},"Dettes diverses d'exploitation"]
[{"$nulls":3},"Créances irrécouvrables admises en non valeur (5)",{"$nulls":5},"Produits constatés d'avance"]
[{"$nulls":3},"Charges constatées d'avance",{"$nulls":5},"Ressources à reverser à l'aide sociale"]
[{"$nulls":3},"Dépenses pour congés payés",{"$nulls":5},"Fonds déposés par les résidents"]
[{"$nulls":3},"Autres",{"$nulls":5},"Autres"]
[]
[{"$nulls":3},"Compte de liaison d'exploitation",{"$nulls":5},"Compte de liaison d'exploitation"]
[{"$nulls":4},"Total VI",{"$f":"F42+F43+F44+F45+F46+F47+F48+F49+F51","v":{"v":0,"d":"0.00 €"}},{"$f":"G42+G43+G44+G45+G46+G47+G48+G49+G51","v":{"v":0,"d":"0.00 €"}},{"$nulls":3},"Total V",{"$f":"L42+L43+L44+L45+L46+L47+L48+L49+L51","v":{"v":0,"d":"0.00 €"}},{"$f":"M42+M43+M44+M45+M46+M47+M48+M49+M51","v":{"v":0,"d":"0.00 €"}}]
[null,"Besoin en fonds de roulement (VI-V)",{"$nulls":3},{"$f":"IF(L52-F52>0,0,F52-L52)","v":{"v":0,"d":"0.00 €"}},{"$f":"IF(M52-G52>0,0,G52-M52)","v":{"v":0,"d":"0.00 €"}},"Excédent de financement d'exploitation (VI-V)",{"$nulls":3},{"$f":"IF(L52-F52<0,0,L52-F52)","v":{"v":0,"d":"0.00 €"}},{"$f":"IF(M52-G52<0,0,M52-G52)","v":{"v":0,"d":"0.00 €"}}]
[null,null,"Liquidités",{"$nulls":5},"Financements à court terme"]
[{"$nulls":3},"Valeurs mobilières de placement",{"$nulls":5},"Fournisseurs d'immobilisations"]
[{"$nulls":3},"Disponibilités",{"$nulls":5},"Fonds des majeurs protégés"]
[{"$nulls":3},"Autres",{"$nulls":5},"Concours bancaires courants"]
[{"$nulls":9},"Ligne de trésorerie"]
[{"$nulls":9},"Intérêts courus non échus"]
[{"$nulls":9},"Autres (dont emprunts à un an au plus)"]
[{"$nulls":3},"Compte de liaison trésorerie",{"$nulls":5},"Compte de liaison trésorerie"]
[{"$nulls":4},"Total VIII",{"$f":"F55+F56+F57+F61","v":{"v":0,"d":"0.00 €"}},{"$f":"G55+G56+G57+G61","v":{"v":0,"d":"0.00 €"}},{"$nulls":3},"Total VII",{"$f":"L55+L56+L57+L58+L59+L60+L61","v":{"v":0,"d":"0.00 €"}},{"$f":"M55+M56+M57+M58+M59+M60+M61","v":{"v":0,"d":"0.00 €"}}]
[null,"Trésorerie positive (VIII-VII)",{"$nulls":3},{"$f":"IF(L62-F62>0,0,F62-L62)","v":{"v":0,"d":"0.00 €"}},{"$f":"IF(M62-G62>0,0,G62-M62)","v":{"v":0,"d":"0.00 €"}},"Trésorerie négative (VIII-VII)",{"$nulls":3},{"$f":"IF(L62-F62<0,0,L62-F62)","v":{"v":0,"d":"0.00 €"}},{"$f":"IF(M62-G62<0,0,M62-G62)","v":{"v":0,"d":"0.00 €"}}]
[null,"TOTAL DES BIENS (II+IV+VI+VIII)",{"$nulls":3},{"$f":"F26+F38+F52+F62","v":{"v":0,"d":"0.00 €"}},{"$f":"G26+G38+G52+G62","v":{"v":0,"d":"0.00 €"}},"TOTAL DES FINANCEMENTS (I+III+V+VII)",{"$nulls":3},{"$f":"L26+L38+L52+L62","v":{"v":0,"d":"0.00 €"}},{"$f":"M26+M38+M52+M62","v":{"v":0,"d":"0.00 €"}}]
[]
[null,null,"(1) : Pour les EPRD établis au 31 octobre N-1, cette colonne est à compléter après la clôture de l'exercice N-1",{"$nulls":5},"(5) : ESSMS publics seulement"]
[null,null,"(2) : PPP = partenariat public privé",{"$nulls":5},"(6) : Montant précédé du signe \"-\""]
[null,null,"(3): ESSMS privés seulement",{"$nulls":5},"(7) : Dont résultats non contrôlés  par des tiers financeurs"]
[null,null,"(4) : Sous contrôle de tiers financeurs",{"$nulls":5},"(8) Pour les ESSMS publics, ESSMS rattachés à une collectivité territoriale, un CCAS ou un CIAS seulement"]
[]
[]
[{"$nulls":5},{"$f":"IF(CREPASIDEN___ANNEEREF___ANN0\\_________=\"\",\"N-2\",CREPASIDEN___ANNEEREF___ANN0\\_________-2)","v":"N-2"},{"$f":"IF(CREPASIDEN___ANNEEREF___ANN0\\_________=\"\",\"Réel  N-1 (1)\",\"Réel \"& CREPASIDEN___ANNEEREF___ANN0\\_________-1 &\" (1)\")","v":"Réel  N-1 (1)"}]
[{"$nulls":4},"Contrôle entre BIENS et FINANCEMENTS :",{"$f":"IF(ROUND(+'Bilan Financier'!F$64-'Bilan Financier'!L$64,0)=0,\"OK\",\"Ecart de \"&ROUND((+'Bilan Financier'!F$64-'Bilan Financier'!L$64),0)&\" €\")","v":"OK"},{"$f":"IF(ROUND(+'Bilan Financier'!G$64-'Bilan Financier'!M$64,0)=0,\"OK\",\"Ecart de \"&ROUND((+'Bilan Financier'!G$64-'Bilan Financier'!M$64),0)&\" €\")","v":"OK"}]
[]
[{"$nulls":4},"Contrôle du résultat net N-1 entre PGFP et FDR :",null,{"$f":"IF(ROUND(IF(M31=0,PGFP!D24+G30,PGFP!D24-M31),0)=0,\"OK\",\"Ecart de \"&ROUND(IF(M31=0,PGFP!D24+G30,PGFP!D24-M31),0)&\" €\")","v":"OK"}]

{"sheet":"Ratios_financiers","index":20,"n_rows":35,"n_cols":10,"rows_kept":35,"hidden":true,"merged":[[1,1,1,4],[1,7,2,9],[9,2,12,2],[15,2,17,2],[26,2,27,2],[28,1,29,1],[28,2,29,2],[30,1,31,1],[30,2,31,2]]}
[]
[null,"Ratios d'analyse financière",{"$nulls":5},"Informations complémentaires pour le calcul des ratios "]
[]
[null,"Thèmes & intitulés\n(valeurs indicatives)","Mode de calcul",{"$f":"IF(CREPASIDEN___ANNEEREF___ANN0\\_________=\"\",\"Valeur de l'indicateur pour N-2\",\"Valeur de l'indicateur pour \"&CREPASIDEN___ANNEEREF___ANN0\\_________-2)","v":"Valeur de l'indicateur pour N-2"},{"$f":"IF(CREPASIDEN___ANNEEREF___ANN0\\_________=\"\",\"Valeur de l'indicateur pour N-1\",\"Valeur de l'indicateur pour \"&CREPASIDEN___ANNEEREF___ANN0\\_________-1)","v":"Valeur de l'indicateur pour N-1"},{"$nulls":3},{"$f":"IF(CREPASIDEN___ANNEEREF___ANN0\\_________=\"\",\"N-2\",CREPASIDEN___ANNEEREF___ANN0\\_________-2)","v":"N-2"},{"$f":"IF(CREPASIDEN___ANNEEREF___ANN0\\_________=\"\",\"N-1\",CREPASIDEN___ANNEEREF___ANN0\\_________-1)","v":"N-1"}]
[null,"1. Endettement à moyen et long terme"]
[null,"1.1. Indépendance financière (<50%)","Emprunts (comptes 16 hors c/165, c/1688 et c/169) x 100\nFinancements stables du FRI (hors amortissements cumulés)",{"$f":"IF('Bilan Financier'!L26-'Bilan Financier'!L16-CREPASCPTE___FINAN14_REAANM2\\_________=0,0,(CREPASCPTE___FINAN8__REAANM2\\_________-I5)/('Bilan Financier'!L26-'Bilan Financier'!L16-CREPASCPTE___FINAN14_REAANM2\\_________))","v":{"v":0,"d":"0.00%"}},{"$f":"IF(PGFP!D126=0,0,(PGFP!D123-PGFP!D124)/PGFP!D126)","v":{"v":0,"d":"0.00%"}},null,null,"Solde débiteur comptes 41 au 31/12"]
[null,"1.2. Apurement de la dette (>2)","Immobilisations nettes amortissables\nDettes financières à moyen et long terme",{"$f":"IF('Bilan Financier'!L14-I5=0,0,('Bilan Financier'!F7+'Bilan Financier'!F8+'Bilan Financier'!F14+'Bilan Financier'!F15-'Bilan Financier'!F9-'Bilan Financier'!L16-'Bilan Financier'!L21)/('Bilan Financier'!L14-I5))","v":{"v":0,"d":"0.00"}},{"$f":"IF((PGFP!D123-PGFP!D124)=0,0,('Bilan Financier'!G7+'Bilan Financier'!G8+'Bilan Financier'!G14+'Bilan Financier'!G15-'Bilan Financier'!G9-'Bilan Financier'!M16-'Bilan Financier'!M21)/(PGFP!D123-PGFP!D124))","v":{"v":0,"d":"0.00"}},null,null,"CAF/IAF",{"$f":"Conso!B121-Conso!B140","v":{"v":0,"d":"0.00 €"}}]
[null,"1.3. Durée apparente de la dette","Emprunts (comptes 16 hors c/165, c/1688 et c/169)\nCAF",{"$f":"IF(I7=0,0,('Bilan Financier'!L14-I5)/I7)","v":{"v":0,"d":"0.00"}},{"$f":"IF(PGFP!D44=0,0,(PGFP!D123-PGFP!D124)/PGFP!D44)","v":{"v":0,"d":"0.00"}},null,null,"Total classe 6 (charges décaissables uniquement)",{"$f":"Conso!B144-Conso!B145+Conso!B1259-I16","v":{"v":0,"d":"0.00 €"}}]
[null,"2. Patrimoine immobilier",{"$nulls":5},"Total des consommations (comptes 601 à 603)",{"$f":"Conso!B146","v":{"v":0,"d":"0.00 €"}}]
[null,"2.1. Vétusté des immobilisations (1)","Solde créditeur des comptes 28\nSolde débiteur des comptes 21 correspondants",{"$nulls":4},"Total comptes 60 à 62",{"$f":"Conso!B155","v":{"v":0,"d":"0.00 €"}}]
[null,"Construction",null,{"$f":"IF('Bilan Financier'!F11=0,0,'Bilan Financier'!L18/'Bilan Financier'!F11)","v":{"v":0,"d":"0.00%"}},{"$f":"IF('Bilan Financier'!G11=0,0,'Bilan Financier'!M18/'Bilan Financier'!G11)","v":{"v":0,"d":"0.00%"}},null,null,"Total comptes 63 et 645 à 647",{"$f":"Conso!B149+Conso!B1260","v":{"v":0,"d":"0.00 €"}}]
[null,"Installations techniques, matériel et outillage",null,{"$f":"IF('Bilan Financier'!F12=0,0,'Bilan Financier'!L19/'Bilan Financier'!F12)","v":{"v":0,"d":"0.00%"}},{"$f":"IF('Bilan Financier'!G12=0,0,'Bilan Financier'!M19/'Bilan Financier'!G12)","v":{"v":0,"d":"0.00%"}},null,null,"Total compte 6611 (inscrits en produits)",{"$f":"Conso!B156","v":{"v":0,"d":"0.00 €"}},{"$f":"Conso!B184","v":{"v":0,"d":"0.00 €"}}]
[null,"Autres immobilisations corporelles",null,{"$f":"IF('Bilan Financier'!F13=0,0,'Bilan Financier'!L20/'Bilan Financier'!F13)","v":{"v":0,"d":"0.00%"}},{"$f":"IF('Bilan Financier'!G13=0,0,'Bilan Financier'!M20/'Bilan Financier'!G13)","v":{"v":0,"d":"0.00%"}},null,null,"Total comptes 60 à 65",{"$f":"Conso!B154","v":{"v":0,"d":"0.00 €"}}]
[null,"3. Equilibres du bilan",{"$nulls":5},"Total comptes 70 et 73",{"$f":"Conso!B147+Conso!B148","v":{"v":0,"d":"0.00 €"}}]
[null,"3.1.a. Fonds de roulement en jours d'exploitation",{"$nulls":5},"Total des produits (sauf c/747, 757, 775, 777 et 78)",{"$f":"Conso!B150","v":{"v":0,"d":"0.00 €"}},{"$f":"Conso!$B$294","v":{"v":0,"d":"0.00 €"}}]
[null,"Fonds de roulement d'investissement (FRI)","FRI ou FRE ou FRNG x 365 j.\nTotal classe 6 (charges décaissables uniquement)",{"$f":"IF(I8=0,0,(('Bilan Financier'!L27-'Bilan Financier'!F27)*365)/I8)","v":{"v":0,"d":"0.00"}},{"$f":"IF(((PGFP!$D$21-PGFP!$D$18)+Conso!$B$1252-Conso!$B$295-J16)=0,0,('Bilan Financier'!$M$27-'Bilan Financier'!$G$27)*365/((PGFP!$D$21-PGFP!$D$18)+Conso!$B$1252-Conso!$B$295-J16))","v":{"v":0,"d":"0.00"}},null,null,"Total comptes 709 et 713",{"$f":"Conso!B151","v":{"v":0,"d":"0.00 €"}},{"$f":"Conso!B182","v":{"v":0,"d":"0.00 €"}}]
[null,"Fonds de roulement d'exploitation (FRE)",null,{"$f":"IF(I8=0,0,(('Bilan Financier'!L39-'Bilan Financier'!F39)*365)/I8)","v":{"v":0,"d":"0.00"}},{"$f":"IF(((PGFP!$D$21-PGFP!$D$18)+Conso!$B$1252-Conso!$B$295-J16)=0,0,('Bilan Financier'!M39-'Bilan Financier'!G39)*365/((PGFP!$D$21-PGFP!$D$18)+Conso!$B$1252-Conso!$B$295-J16))","v":{"v":0,"d":"0.00"}},null,null,"Total classe 7 (sauf c/76, c/77, c/786 et c/ 787)",{"$f":"Conso!B152","v":{"v":0,"d":"0.00 €"}},{"$f":"Conso!B183","v":{"v":0,"d":"0.00 €"}}]
[null,"Fonds de roulement net global (FRNG)",null,{"$f":"IF(I8=0,0,(('Bilan Financier'!L40-'Bilan Financier'!F40)*365)/I8)","v":{"v":0,"d":"0.00"}},{"$f":"IF(((PGFP!$D$21-PGFP!$D$18)+Conso!$B$1252-Conso!$B$295-J16)=0,0,('Bilan Financier'!M40-'Bilan Financier'!G40)*365/((PGFP!$D$21-PGFP!$D$18)+Conso!$B$1252-Conso!$B$295-J16))","v":{"v":0,"d":"0.00"}},null,null,"Marge brute d'exploitation",{"$f":"Conso!B157","v":{"v":0,"d":"0.00 €"}},{"$f":"Conso!B1292","v":{"v":0,"d":"0.00 €"}}]
[null,"3.1.b. Besoin en fonds de roulement en jours d'exploitation","BFR x 365 j.\nTotal classe 6 (charges décaissables uniquement)",{"$f":"IF(I8=0,0,(('Bilan Financier'!F53-'Bilan Financier'!L53)*365)/I8)","v":{"v":0,"d":"0.00"}},{"$f":"IF(((PGFP!$D$21-PGFP!$D$18)+Conso!$B$1252-Conso!$B$295-J16)=0,0,('Bilan Financier'!G53-'Bilan Financier'!M53)*365/((PGFP!$D$21-PGFP!$D$18)+Conso!$B$1252-Conso!$B$295-J16))","v":{"v":0,"d":"0.00"}},null,null,"Produits courants d'exploitation (Comptes 70 à 75 - c/ 709 et 713)",{"$f":"Conso!B153","v":{"v":0,"d":"0.00 €"}},{"$f":"Conso!B1293","v":{"v":0,"d":"0.00 €"}}]
[null,"3.1.c. Trésorerie en jours d'exploitation","Trésorerie x 365 j.\nTotal classe 6 (charges décaissables uniquement)",{"$f":"IF(I8=0,0,(('Bilan Financier'!F63-'Bilan Financier'!L63)*365)/I8)","v":{"v":0,"d":"0.00"}},{"$f":"IF(((PGFP!$D$21-PGFP!$D$18)+Conso!$B$1252-Conso!$B$295-J16)=0,0,('Bilan Financier'!G63-'Bilan Financier'!M63)*365/((PGFP!$D$21-PGFP!$D$18)+Conso!$B$1252-Conso!$B$295-J16))","v":{"v":0,"d":"0.00"}}]
[null,"3.2. Réserve de couverture du BFR en jours d'exploitation","Solde des comptes 141 et 10685 x 365 j.\nTotal classe 6 (charges décaissables uniquement)",{"$f":"IF(I8=0,0,('Bilan Financier'!L29*365)/I8)","v":{"v":0,"d":"0.00"}},{"$f":"IF(((PGFP!$D$21-PGFP!$D$18)+Conso!$B$1252-Conso!$B$295-J16)=0,0,'Bilan Financier'!M29*365/((PGFP!$D$21-PGFP!$D$18)+Conso!$B$1252-Conso!$B$295-J16))","v":{"v":0,"d":"0.00"}}]
[null,"4. Rotation des postes d'exploitation en jours"]
[null,"4.1. Stocks (10-20 j.)","[Stocks (solde débiteur classe 3)] x 365 j.\nTotal des consommations (comptes 601 à 603)",{"$f":"IF(I9=0,0,('Bilan Financier'!F42*365)/I9)","v":{"v":0,"d":"0.00"}},{"$f":"IF(PGFP!D15=0,0,('Bilan Financier'!G42*365/PGFP!D15))","v":{"v":0,"d":"0.00"}}]
[null,"4.2. Créances (< 30 j.)","(Solde débiteur comptes 41) x 365 j.\nTotal des produits (comptes 70 et 73)",{"$f":"IF(I14=0,0,(I6*365)/I14)","v":{"v":0,"d":"0.00"}},{"$f":"IF((PGFP!D6+PGFP!D9)=0,0,J6*365/(PGFP!D6+PGFP!D9))","v":{"v":0,"d":"0.00"}}]
[null,"4.3. Dettes fournisseurs (< 45 j.)","(Solde créditeur comptes 401) x 365 j.\nTotal des charges (comptes 60 à 62)(2)",{"$f":"IF((I10-I16)=0,0,('Bilan Financier'!L43*365)/(I10-I16))","v":{"v":0,"d":"0.00"}},{"$f":"IF((PGFP!D22-J16)=0,0,'Bilan Financier'!M43*365/(PGFP!D22-J16))","v":{"v":0,"d":"0.00"}}]
[null,"4.4. Dettes sociales et dettes fiscales","(Solde créditeur comptes 43 et 44) x 365 j.\nTotal des charges (comptes 63 et 645 à 647)",{"$f":"IF(I11=0,0,('Bilan Financier'!L44*365)/I11)","v":{"v":0,"d":"0.00"}},{"$f":"IF((PGFP!$D$23)+Conso!$B$1253=0,0,'Bilan Financier'!M44*365/((PGFP!$D$23)+Conso!$B$1253))","v":{"v":0,"d":"0.00"}}]
[null,"5. Autres","CAF x100\nTotal classe 7 (sauf c/747, 757, 775, 777 et 78) - c/709 et 713",{"$f":"IF((I15-I16)=0,0,I7/(I15-I16))","v":{"v":0,"d":"0.00%"}},{"$f":"IF((J15-J16)=0,0,PGFP!D44/(J15-J16))","v":{"v":0,"d":"0.00%"}}]
[null,"5.1. Taux de CAF (5 à 10%)"]
[null,"5.2. Taux de réserve de compensation des déficits","Réserve de compensation des déficits (c/ 10686 ou c/ 106856) x 100\nTotal classe 7 (sauf c/76, c/77, c/786 et c/ 787) - c/ 709 et 713"]
[{"$nulls":3},{"$f":"IF(I17-I16=0,0,'Bilan Financier'!L30/(I17-I16))","v":{"v":0,"d":"0.00%"}},{"$f":"IF(J17-J16=0,0,'Bilan Financier'!M30/(J17-J16))","v":{"v":0,"d":"0.00%"}}]
[null,"5.3. Taux de marge brute d'exploitation","(Comptes 70 à 75 - Charges c/60 à 65) x100\nComptes 70 à 75 - c/709 et c/713"]
[{"$nulls":3},{"$f":"IF(I19=0,0,I18/(I19))","v":{"v":0,"d":"0.00%"}},{"$f":"IF(J19=0,0,J18/(J19))","v":{"v":0,"d":"0.00%"}}]
[]
[null,"(1) : Dénominateurs à corriger des soldes débiteurs des comptes 23 correspondants le cas échéant"]
[null,"(2): Hors comptes 709 et 713 inscrits dans les charges du groupe I"]

{"sheet":"Tableau_Rcc","index":21,"n_rows":42,"n_cols":13,"rows_kept":42,"hidden":true,"merged":[[1,1,1,12],[5,1,7,1],[5,2,7,2],[5,3,7,3],[5,4,7,4],[5,5,5,10],[5,11,6,12],[6,5,6,6],[6,7,6,8],[6,9,6,10]]}
[]
[null,"Tableau de répartition des charges communes et opérations faites en commun"]
[]
[]
[null,"Préconisation de remplissage : la somme des budgets (2) + (3) devrait être égale à (1)"]
[null,"N° de compte","Libellé","Montant total du compte (1)","Clé de répartition\n(nature)","Activités/ESSMS relevant du périmètre du CPOM (2)",{"$nulls":5},"Budgets hors périmètre du CPOM (synthèse) (3)"]
[{"$nulls":5},"CRPP",null,"CRPA 1",null,"CRPA…"]
[{"$nulls":5},"%","Montant","%","Montant","%","Montant","%","Montant"]
[{"$nulls":5},{"$f":"IF($D9=0,0,G9/$D9)","v":{"v":0,"d":"0%"}},null,{"$f":"IF($D9=0,0,I9/$D9)","v":{"v":0,"d":"0%"}},null,{"$f":"IF($D9=0,0,K9/$D9)","v":{"v":0,"d":"0%"}},null,{"$f":"IF($D9=0,0,M9/$D9)","v":{"v":0,"d":"0%"}}]
[{"$nulls":5},{"v":0,"d":"0%"},null,{"v":0,"d":"0%"},null,{"v":0,"d":"0%"},null,{"v":0,"d":"0%"}]
[{"$nulls":5},{"v":0,"d":"0%"},null,{"v":0,"d":"0%"},null,{"v":0,"d":"0%"},null,{"v":0,"d":"0%"}]
[{"$nulls":5},{"v":0,"d":"0%"},null,{"v":0,"d":"0%"},null,{"v":0,"d":"0%"},null,{"v":0,"d":"0%"}]
[{"$nulls":5},{"v":0,"d":"0%"},null,{"v":0,"d":"0%"},null,{"v":0,"d":"0%"},null,{"v":0,"d":"0%"}]
[{"$nulls":5},{"v":0,"d":"0%"},null,{"v":0,"d":"0%"},null,{"v":0,"d":"0%"},null,{"v":0,"d":"0%"}]
[{"$nulls":5},{"v":0,"d":"0%"},null,{"v":0,"d":"0%"},null,{"v":0,"d":"0%"},null,{"v":0,"d":"0%"}]
[{"$nulls":5},{"v":0,"d":"0%"},null,{"v":0,"d":"0%"},null,{"v":0,"d":"0%"},null,{"v":0,"d":"0%"}]
[{"$nulls":5},{"v":0,"d":"0%"},null,{"v":0,"d":"0%"},null,{"v":0,"d":"0%"},null,{"v":0,"d":"0%"}]
[{"$nulls":5},{"v":0,"d":"0%"},null,{"v":0,"d":"0%"},null,{"v":0,"d":"0%"},null,{"v":0,"d":"0%"}]
[{"$nulls":5},{"v":0,"d":"0%"},null,{"v":0,"d":"0%"},null,{"v":0,"d":"0%"},null,{"v":0,"d":"0%"}]
[{"$nulls":5},{"v":0,"d":"0%"},null,{"v":0,"d":"0%"},null,{"v":0,"d":"0%"},null,{"v":0,"d":"0%"}]
[{"$nulls":5},{"v":0,"d":"0%"},null,{"v":0,"d":"0%"},null,{"v":0,"d":"0%"},null,{"v":0,"d":"0%"}]
[{"$nulls":5},{"v":0,"d":"0%"},null,{"v":0,"d":"0%"},null,{"v":0,"d":"0%"},null,{"v":0,"d":"0%"}]
[{"$nulls":5},{"v":0,"d":"0%"},null,{"v":0,"d":"0%"},null,{"v":0,"d":"0%"},null,{"v":0,"d":"0%"}]
[{"$nulls":5},{"v":0,"d":"0%"},null,{"v":0,"d":"0%"},null,{"v":0,"d":"0%"},null,{"v":0,"d":"0%"}]
[{"$nulls":5},{"v":0,"d":"0%"},null,{"v":0,"d":"0%"},null,{"v":0,"d":"0%"},null,{"v":0,"d":"0%"}]
[{"$nulls":5},{"v":0,"d":"0%"},null,{"v":0,"d":"0%"},null,{"v":0,"d":"0%"},null,{"v":0,"d":"0%"}]
[{"$nulls":5},{"v":0,"d":"0%"},null,{"v":0,"d":"0%"},null,{"v":0,"d":"0%"},null,{"v":0,"d":"0%"}]
[{"$nulls":5},{"v":0,"d":"0%"},null,{"v":0,"d":"0%"},null,{"v":0,"d":"0%"},null,{"v":0,"d":"0%"}]
[{"$nulls":5},{"v":0,"d":"0%"},null,{"v":0,"d":"0%"},null,{"v":0,"d":"0%"},null,{"v":0,"d":"0%"}]
[{"$nulls":5},{"v":0,"d":"0%"},null,{"v":0,"d":"0%"},null,{"v":0,"d":"0%"},null,{"v":0,"d":"0%"}]
[{"$nulls":5},{"v":0,"d":"0%"},null,{"v":0,"d":"0%"},null,{"v":0,"d":"0%"},null,{"v":0,"d":"0%"}]
[{"$nulls":5},{"v":0,"d":"0%"},null,{"v":0,"d":"0%"},null,{"v":0,"d":"0%"},null,{"v":0,"d":"0%"}]
[{"$nulls":5},{"v":0,"d":"0%"},null,{"v":0,"d":"0%"},null,{"v":0,"d":"0%"},null,{"v":0,"d":"0%"}]
[{"$nulls":5},{"v":0,"d":"0%"},null,{"v":0,"d":"0%"},null,{"v":0,"d":"0%"},null,{"v":0,"d":"0%"}]
[{"$nulls":5},{"v":0,"d":"0%"},null,{"v":0,"d":"0%"},null,{"v":0,"d":"0%"},null,{"v":0,"d":"0%"}]
[null,"Total",null,{"$f":"SUM(D9:D35)","v":0},null,{"v":0,"d":"0%"},{"$f":"SUM(G9:G35)","v":0},{"v":0,"d":"0%"},0,{"v":0,"d":"0%"},0,{"v":0,"d":"0%"},0]
[]
[null,null,"Montant des quotes-parts des opérations faites en commun",null,null,{"$f":"IF($D38=0,0,G38/$D38)","v":{"v":0,"d":"0%"}},null,{"$f":"IF($D38=0,0,I38/$D38)","v":{"v":0,"d":"0%"}},null,{"$f":"IF($D38=0,0,K38/$D38)","v":{"v":0,"d":"0%"}},null,{"$f":"IF($D38=0,0,M38/$D38)","v":{"v":0,"d":"0%"}}]
[null,null,"Quote-part des frais de siège",null,null,{"$f":"IF($D39=0,0,G39/$D39)","v":{"v":0,"d":"0%"}},null,{"$f":"IF($D39=0,0,I39/$D39)","v":{"v":0,"d":"0%"}},null,{"$f":"IF($D39=0,0,K39/$D39)","v":{"v":0,"d":"0%"}},null,{"$f":"IF($D39=0,0,M39/$D39)","v":{"v":0,"d":"0%"}}]
[null,null,"Quotes-parts Autres opérations faites en commun",null,null,{"$f":"IF($D40=0,0,G40/$D40)","v":{"v":0,"d":"0%"}},null,{"$f":"IF($D40=0,0,I40/$D40)","v":{"v":0,"d":"0%"}},null,{"$f":"IF($D40=0,0,K40/$D40)","v":{"v":0,"d":"0%"}},null,{"$f":"IF($D40=0,0,M40/$D40)","v":{"v":0,"d":"0%"}}]
[null,null,"…",null,null,{"$f":"IF($D41=0,0,G41/$D41)","v":{"v":0,"d":"0%"}},null,{"$f":"IF($D41=0,0,I41/$D41)","v":{"v":0,"d":"0%"}},null,{"$f":"IF($D41=0,0,K41/$D41)","v":{"v":0,"d":"0%"}},null,{"$f":"IF($D41=0,0,M41/$D41)","v":{"v":0,"d":"0%"}}]
[null,"Total",null,{"$f":"SUM(D38:D41)","v":0},null,{"$f":"IF($D42=0,0,G42/$D42)","v":{"v":0,"d":"0%"}},{"$f":"SUM(G38:G41)","v":0},{"$f":"IF($D42=0,0,I42/$D42)","v":{"v":0,"d":"0%"}},0,{"$f":"IF($D42=0,0,K42/$D42)","v":{"v":0,"d":"0%"}},0,{"$f":"IF($D42=0,0,M42/$D42)","v":{"v":0,"d":"0%"}},0]

{"sheet":"Tab_Eng. hors bilan","index":22,"n_rows":20,"n_cols":12,"rows_kept":20,"hidden":true,"merged":[[1,1,1,11],[5,1,5,9],[12,1,12,9],[15,1,16,1],[15,2,16,2],[15,3,16,3],[15,4,16,4],[15,5,15,6],[15,7,15,11],[19,1,19,3]]}
[]
[null,"ETAT DES ENGAGEMENTS HORS BILAN "]
[]
[null,"Précisions et consignes de remplissage : "]
[]
[null,"Cet onglet fournit des informations complémentaires au bilan financier sur les opérations relatives à des contrats de crédit-bail et/ou des locations mobilières ou immobilières de longue durée. Au besoin, ces informations pourront être utiles pour effectuer un retraitement sur les différentes composantes de la CAF, afin que cette dernière ne soit pas biaisée par une situation immobilière différente. Les autres engagements reçus et donnés peuvent être utilement mentionnés dans le rapport budgétaire et financier (engagements de retraite, litiges non provisionnés, garanties bancaires, etc.)."]
[]
[null,"L’information est à présenter opération par opération. Pour ajouter une nouvelle ligne de saisie, cliquer sur le bouton à gauche du tableau"]
[]
[null,"Il convient de saisir dans le tableau l’information la plus détaillée possible permettant : "]
[null,"• d’avoir une bonne compréhension du contrat (identité du cocontractant, nature, date et durée du contrat), en explicitant le cas échéant les clauses particulières dans le rapport budgétaire et financier ;"]
[null,"• d’apprécier les engagements du gestionnaire non traduits dans le bilan financier, en termes de sorties de trésorerie futures (redevances restant à payer) ; "]
[null,"• de reconstituer la valeur nette de l’actif correspondant à l’investissement (prix d’achat résiduel) et de mesurer l’impact total de cet investissement sur la trésorerie des ESSMS du périmètre (montant cumulé des redevances payées et restant à payer). "]
[]
[]
[null,"Raison sociale du cocontractant","Nature du contrat","Date du contrat","Durée du contrat","Redevances payées",null,"Redevances restant à payer selon échéances"]
[{"$nulls":5},"de l'exercice","cumulées","Moins de 1 an","de 1 à 5 ans"," + de 5 ans"," Total restant","Prix d'achat résiduel"]
[]
[]
[null,"Total",{"$nulls":3},{"$f":"SUM(F18:F19)","v":{"v":0,"d":"0.00 €"}},{"v":0,"d":"0.00 €"},{"v":0,"d":"0.00 €"},{"v":0,"d":"0.00 €"},{"v":0,"d":"0.00 €"},{"v":0,"d":"0.00 €"},{"v":0,"d":"0.00 €"}]