{"text_format":"3","workbook":"xlsx","n_sheets":14,"sheets":["Liste","Conversions","LISEZ-MOI","Page de garde","Id_CR_SF","Contrôles","Charges soc. fisc._SF","TPER type ESMS PH","TPER type EHPAD","Charges soc. fisc.","TPER type EHPAD_SF","TPER Autre ESSMS_SF","TPER ESSMS PH Cofin","TPER FAM-SAMSAH_SF"],"not_rendered":{"images":12,"macros":1,"defined_names":7010,"comments":1},"read":"whole","date_system":"1900"}

{"sheet":"Liste","index":0,"n_rows":5,"n_cols":3,"rows_kept":5,"hidden":true}
["categorie","Liste TP","categorie_Id_CRP_SF"]
[null,"P"]
["EHPAD-AJA","T","CRP rattaché à un EHPAD"]
["FAM-SAMSAH",null,"CRP rattaché à un FAM-SAMSAH"]
["Autres ESSMS",null,"CRP rattaché à d'autres ESSMS"]

{"sheet":"Conversions","index":1,"n_rows":2,"n_cols":2,"rows_kept":2,"hidden":true}
[]
["Date de génération du fichier ",{"$f":"'Page de garde'!$A$4","v":0}]

{"sheet":"LISEZ-MOI","index":2,"n_rows":152,"n_cols":4,"rows_kept":152,"merged":[[1,1,1,11],[3,2,3,11],[5,2,5,11],[7,2,7,11],[9,2,9,11],[10,2,10,11],[14,2,14,11],[15,2,15,11],[17,2,17,11],[18,2,18,11],[20,2,20,11],[24,2,24,11],[32,2,32,11],[35,2,35,11],[37,2,37,11],[38,2,38,11],[42,2,42,11],[46,2,46,11],[47,2,47,11],[49,2,49,11],[50,2,50,11],[51,2,51,11],[56,1,56,11],[58,2,58,7],[59,2,59,11],[61,2,61,7],[62,2,62,11],[64,2,64,7],[67,3,67,11],[69,2,69,7],[74,2,74,7],[77,2,77,7],[79,2,79,11],[81,2,81,7],[82,2,82,11],[84,2,84,7],[85,2,85,11],[87,2,87,7],[88,2,88,11],[90,2,90,7],[91,2,91,11],[93,2,93,7],[94,2,94,11],[96,2,96,7],[97,2,97,11],[99,2,99,7],[100,2,100,11],[102,2,102,7],[103,2,103,11],[105,2,105,7],[106,2,106,11],[108,2,108,7],[109,2,109,11],[111,2,111,7],[112,2,112,11],[114,2,114,7],[115,2,115,11],[117,2,117,7],[118,2,118,11],[120,2,120,7],[121,2,121,11],[123,2,123,7],[124,2,124,11],[126,2,126,7],[127,2,127,11],[129,2,129,7],[130,2,130,11],[132,2,132,7],[133,2,133,11],[135,2,135,7],[136,2,136,11],[138,2,138,7],[139,2,139,11],[140,2,140,7],[141,2,141,11],[142,2,142,11],[145,3,145,8],[146,3,146,8],[147,3,147,11],[148,3,148,8],[149,3,149,11],[151,3,151,10]]}
[null,"Dernière mise à jour : février 2026"]
[null,"Lisez-moi du cadre \"TPER\""]
[]
[null,null,"Ce cadre correspond aux tableaux prévisionnels des effectifs rémunérés mentionnés à l'article R. 314-224 du CASF et conformes aux modèles figurant aux annexes 6A à 6C de l’arrêté du 27 décembre 2016, modifié par l'arrêté du 18 juin 2018 (NOR: SSAA1804876A). \nDans un souci d'adaptation permanente aux pratiques et sans préjudice des obligations générales de dépôt de l'EPRD, des ajustements ponctuels peuvent être apportés par rapport aux modèles joints à l'arrêté précité et régularisés ultérieurement par arrêté modificatif."]
[null,null,"Tous les gestionnaires soumis à l'EPRD doivent transmettre ce cadre."]
[null,null,"Ce cadre fait apparaître, pour chacun des CRP et par type d'emploi, les effectifs, les rémunérations et les charges sociales et fiscales du personnel inscrit au budget (y compris personnels de remplacement). Il comprend l'ensemble des modèles applicables (6A à 6C), ainsi qu'un état relatif aux charges de l'employeur sur rémunérations (un état par budget). \nLe périmètre du TPER est identique au périmètre de l'EPRD auquel il est annexé.\nA noter que dans le cas des ESAT, le TPER ne s'applique qu'au budget de l'activité sociale."]
[]
[null,null,"Points de vigilance : \n- Il est attendu des gestionnaires un remplissage exhaustif du détail des ETP par métier, au sein des blocs d'emploi, dans la mesure où ces données sont utilisées dans le cadre du calibrage et de la répartition des crédits nationaux relatifs aux revalorisations salariales, ainsi qu'au contrôle de ces derniers.\n- Les gestionnaires d'EHPAD doivent renseigner le TPER pour la totalité du personnel, y compris les ETP et charges relevant de la section hébergement, que leur établissement soit en tarification administrée ou en tarification libre."]
[]
[null,null,"Adaptations temporaires des tableaux relatifs aux EHPAD-AJA dans le cadre de l'expérimentation du forfait global unique : les EHPAD relevant de cette expérimentation doivent renseigner les ETP et rémunérations relatifs à la section \"Soins et entretien de l'autonomie\" (colonnes O et P) en lieu et place des sections \"Dépendance\" et \"Soins\" (colonnes G, H, L et M)."]
[null,null,"Cette notice, qui n’a qu’une valeur indicative, ne reprend pas toutes les explications nécessaires à l’élaboration des EPRD et ne se substitue pas à la documentation officielle de l'administration. Les organismes gestionnaires et les autorités de tarification peuvent contacter la direction générale de la cohésion sociale (DGCS) pour connaître son interprétation formelle des textes législatifs et réglementaires en vigueur.\nVous avez des suggestions à faire sur le contenu de ce LISEZ-MOI (informations manquantes, intitulés pas suffisamment clairs, non-conformité...) ? Contactez l’équipe référente EPRD-ERRD de la CNSA."]
[]
[null,null,"I.- Fonctionnement du cadre "]
[]
[null,null,"Ce cadre fonctionne sur la base d'un procédé de création automatique des onglets en remplissant le tableau de page de garde nommé « Etablissements et services relevant du "]
[null,null,"périmètre de l'EPRD » et en cliquant sur l’icône : + , selon l’ordonnancement suivant : "]
[null,null,"1) Le finess juridique (FINESS EJ) doit être saisi dans le champ situé en haut de la page de garde (Champ nommé « N° FINESS (entité juridique) »)."]
[null,null,"2) Chacun des finess Etablissement (FINESS ET) relevant de l’organisme gestionnaire (c'est-à-dire du Finess EJ renseigné plus haut) et inclus dans le périmètre de l’EPRD, doit"]
[null,null,"être renseigné dans le tableau du bas de la page de garde \"Etablissements et services relevant du périmètre de l'EPRD\". "]
[]
[null,null,"Dans ce tableau, il convient de saisir une ligne par établissement ou service (nommé ci-après FINESS ET pour plus de simplicité), selon les modalités suivantes : "]
[null,null,"a) 1er finess ET : "]
[null,null,"i)     saisie de la première ligne"]
[null,null,"ii)   puis clic sur l’icône +"]
[null,null,"iii) l’onglet du TPER relatif au 1er FINESS ET est alors automatiquement généré.  "]
[null,null,"b) 2ème finess ET : "]
[null,null,"i)     saisie de la deuxième ligne"]
[null,null,"ii)   puis clic sur l’icône +"]
[null,null,"iii) l’onglet du TPER relatif au 2ème FINESS ET est alors automatiquement généré.  "]
[null,null,"c) Etc. "]
[]
[null,null,"Les champs à saisir obligatoirement sur chaque ligne, pour que les onglets soient effectivement générés, sont: "]
[null,null,"- \"N° FINESS Etablissement\" \n- \"Catégorie\""]
[]
[null,null,"II.- Consignes d'utilisation"]
[null,null,"Un emploi incorrect ne tenant pas compte des indications ci-dessous peut affecter les fonctionnalités automatiques du cadre, le bon déroulement du dépôt et la performance de la plateforme de collecte des EPRD. "]
[null,null,"- Les cellules sur fond jaune sont à compléter manuellement. Les champs grisés sont des cellules verrouillées, qui peuvent contenir des formules de calcul automatique."]
[null,null,"- Le cadre normalisé n'est pas compatible avec Libre Office ni Open Office.  "]
[null,null,"- Veuillez ne pas modifier tout élément de mise en page (comme les déplacements, insertions de lignes ou de colonnes). Veuillez ne pas copier ni déplacer le contenu d'une cellule vers une autre cellule (\"couper-coller\"/\"cliquer-glisser\"), ces actions pouvant endommager la structure des cadres Excel. Les macros de remplissage automatique des cellules ouvertes à la saisie sont possibles. "]
[null,null,"- Le N° FINESS EJ saisi dans la page de garde doit être le même que le N° FINESS EJ du dossier de dépôt dans la plateforme de collecte des EPRD. "]
[null,null,"- Les FINESS ET (Etablissement) saisis dans le tableau de la page de garde doivent impérativement correspondre aux FINESS ET affectés au dossier dans la plateforme de collecte des EPRD. "]
[null,null,"- Le déverrouillage du fichier peut impacter la bonne marche des fonctions automatiques et la reconnaissance du fichier lors du dépôt sur la plateforme."]
[null,null,"- Ne jamais laisser de liens directs pointant vers des fichiers externes ni de formules dans les cellules ouvertes à la saisie. Ces liaisons entre classeurs ou ces formules génèrent des problèmes de lisibilité pouvant exclure l'établissement concerné des bases de la CNSA.\n- Ne pas utiliser le caractère « | » : ce caractère est généralement réservé pour des opérations techniques. Son utilisation dans les champs de saisie peut provoquer des dysfonctionnements sur la chaîne SI (traitements data ou autres)."]
[]
[null,null,"III.- Cas spécifique des activités sans FINESS"]
[]
[null,null,"Afin de permettre l'intégration technique des activités sans FINESS dans le présent cadre, il convient de saisir l'onglet \"Id_CR_SF\" selon le même procédé que le tableau de la page de"]
[null,null,"garde décrit en I. ci-dessus, afin que les onglets de TPER des CRP sans finess soient créés automatiquement. "]
[]
[null,null,"Pour chaque ligne, un identifiant est créé automatiquement à partir des données du tableau de l'onglet \"Id_CR_SF\". Les onglets sont créés dans l'ordre de remplissage de ce tableau. "]
[null,null,"Nous vous invitons à compléter ce tableau selon le même ordonnancement chaque année, afin qu'un même numéro d'identification soit toujours attribué à la même activité."]
[]
[]
[]
[]
[]
[null,"Récapitulatif des aides contextuelles "]
[]
[null,1,"N° FINESS (entité juridique)"]
[null,null,"Indiquer le n° FINESS de l'organisme gestionnaire en tant que personnalité morale titulaire des autorisations. Il doit correspondre au N° FINESS EJ du dossier de dépôt sur la plateforme de collecte. Lorsque l'EPRD est établi par une société commerciale pour le compte d'une autre société contrôlée, indiquer le n° FINESS qui a été sélectionné pour déposer le fichier sur cette plateforme. "]
[]
[null,2,"Lignes du tableau de la page de garde"]
[null,null,"Saisir les informations du compte de résultat prévisionnel principal (CRPP) et/ou des comptes de résultat prévisionnels annexes (CRPA). "]
[]
[null,3,"Icônes du tableau de la page de garde"]
[{"$nulls":3},": crée les onglets correspondants selon le procédé décrit dans le \"LISEZ-MOI\". "]
[{"$nulls":3},": supprime un CRPA du tableau (dans la colonne C \"Etablissements et services\", sélectionnez la ligne à supprimer puis cliquez sur \"-\")."]
[{"$nulls":3},": modifie une saisie de n° FINESS Etablissement déjà enregistrée. Placez-vous sur la ligne à modifier dans la colonne \"Etablissements et services\", puis cliquez sur l'icône. "]
[]
[null,4,"N° FINESS Etablissement"]
[null,null,"Indiquer le n° FINESS de l'établissement, du service ou de l'activité. "]
[null,null,"Les FINESS saisis doivent impérativement correspondre aux FINESS ET affectés au dossier sur la plateforme de collecte. "]
[null,null,"Ils doivent nécessairement relever du FINESS de l'entité juridique (sauf cas particulier des sociétés commerciales contrôlées). "]
[]
[null,5,"Dénomination du CR sans n° FINESS"]
[null,null,"Donner un titre explicite: par exemple nom du site et structure de rattachement."]
[]
[null,6,"N° FINESS de rattachement"]
[null,null,"Saisir le n° FINESS de l'établissement/service/activité auquel le budget est adossé (ESAT, AJ, etc.)."]
[null,null,"S'il n'existe pas de structure d'adossement, saisir le n° FINESS Etablissement de son choix (parmi ceux gérés par l'entité juridique), afin de le rattacher à une structure identifiée au sein du périmètre. Il est préconisé de ne pas changer le n° FINESS de rattachement d'une année sur l'autre."]
[]
[null,7,"Imputation des ASG"]
[null,null,"La fonction d'ASG étant accessible aux AS et aux AMP, ces emplois sont à retracer directement dans l’une ou l’autre de ces catégories selon la situation d’emploi dans l'établissement donné, et sont à affecter à 100% à la section « soins ». "]
[]
[null,8,"Cas des EHPAD/AJA dont le tarif hébergement n'est pas administré par l'autorité de tarification"]
[null,null,"Les EHPAD/AJA dont le tarif hébergement (ou accompagnement à la vie sociale) n'est pas administré doivent renseigner le TPER pour la totalité du personnel, y compris les ETP et charges relevant de la section hébergement (ou accompagnement à la vie sociale)."]
[]
[null,9,"Clefs de répartition par section tarifaire (EHPAD et PUV en tarification ternaire)"]
[null,null,"Les clefs effectivement retenues par le gestionnaire doivent être autant que possibles constantes d'une année sur l'autre et explicitées dans le rapport budgétaire et financier. Leur évolution devrait être en cohérence avec les engagements du CPOM."]
[]
[null,10,"Nomenclature des emplois (TPER type EHPAD)"]
[null,null,"La nomenclature des emplois présentée dans ces tableaux reprend les principaux items cités dans la liste des fonctions du personnel utilisée dans le cadre de l'enquête EHPA (source : DREES).\nFonctions \"ASH\" et \"Psychologues\" : utiliser les icônes + pour ajouter des lignes ouvertes à la saisie. "]
[]
[null,11,"Nomenclature des emplois (TPER type ESMS PH ou type ESSMS PH Cofin)"]
[null,null,"Renseigner les effectifs, en moyenne annuelle pondérée, par catégorie d'emploi. Si des organigrammes sont présentés dans d’autres documents du dossier EPRD, par exemple dans le rapport budgétaire et financier, il est préconisé de les harmoniser avec la nomenclature du TPER.\nCatégorie \"Autres fonctions\" : utiliser les icônes + pour ajouter des lignes ouvertes à la saisie."]
[]
[null,12,"Emplois permanents/temporaires"]
[null,null,"Emplois permanents = postes ouverts à caractère permanent par opposition à des postes ouverts ponctuellement. Des CDD peuvent exister sur des postes permanents."]
[]
[null,13,"Nombre d'ETP"]
[null,null,"Renseigner le nombre prévisionnel total d'ETP de l'établissement ou du service (ou attaché à ce buget) au titre de l'exercice N, dans la catégorie d'emploi considérée. Il doit correspondre à la somme des ETP indiqués dans les colonnes F à H.\nLes effectifs sont à saisir en moyenne annuelle pondérée."]
[]
[null,14,"Rémunérations brutes et charges sociales et fiscales (annexe 6A)"]
[null,null,"Correspond à la somme des valeurs indiquées dans les colonnes K à M (rémunérations brutes et charges sociales et fiscales, hors remboursements sur charges de personnel). Les sommes indiquées doivent normalement concorder avec les charges de personnel reportées dans le groupe 2 des dépenses du CRP concerné (écarts à expliquer le cas échéant dans le dossier)."]
[]
[null,15,"Personnel extérieur"]
[null,null,"En l'absence de norme définissant la notion de personnel extérieur, le périmètre préconisé pour le remplissage du TPER est le suivant : toutes les sommes inscrites aux comptes 621 (Personnel extérieur à l'établissement), 6223 (intervenants médicaux et paramédicaux), 6282 (Alimentation à l'extérieur) et 6283 (Nettoyage à l'extérieur). Les montants devraient normalement concorder avec les charges reportées dans le CRP concerné (écarts à expliquer le cas échéant dans le dossier)."]
[]
[null,16,"Rémunérations brutes et charges sociales et fiscales (annexes 6B et 6C)"]
[null,null,"Correspond à la sommes des rémunérations brutes + charges sociales et fiscales, hors remboursements sur charges de personnel, au titre de l'exercice N. Les sommes indiquées doivent normalement concorder avec les charges de personnel reportées dans le groupe 2 des dépenses du CRP (écarts à expliquer le cas échéant dans le dossier)."]
[]
[null,17,"Présentation des charges de l'employeur"]
[null,null,"Dans le cas des gestionnaires utilisant le plan comptable général, l'onglet est a minima complété des montants figurant dans les comptes à trois chiffres."]
[]
[null,18,"Assiette des charges sociales et fiscales"]
[null,null,"Montant des rémunérations à prendre pour base de calcul des charges sociales et fiscales."]
[]
[null,19,"Taux de charges sociales et fiscales"]
[null,null,"Taux de cotisations sociales (part patronale) ou taxe applicable à ces rémunérations suivant la nature des risques couverts ou de l'imposition."]
[]
[null,20,"Montant (charges sociales et fiscales)"]
[null,null,"Montant des charges prévisionnelles net des allègements sur charges sociales et fiscales, qui résulte de la multiplication \"Assiette\" x \"Taux\". Les hypothèses d'évolution et les options de calcul retenues, s'il en existe plusieurs, sont à préciser dans le rapport budgétaire et financier."]
[]
[null,21,"Charges fiscales sur rémunérations"]
[null,null,"Dans le cas des EHPAD relevant de l'article L. 342-1 (tarif hébergement non fixé par l'autorité de tarification) : l'assiette des comptes 631 et 633 est la rémunération du personnel émargeant sur le forfait soins ainsi que sur le forfait dépendance si l’établissement n’est pas soumis à la TVA."]
[]
[null,22,"Charges sociales sur rémunérations"]
[null,null,"L'assiette des comptes 645 et 647 est constituée de la totalité des salaires versés par l'établissement, même dans le cas des EHPAD relevant de l'article L. 342-1 (tarif hébergement non fixé par l'autorité de tarification)."]
[]
[null,23,"Agent administratit et personnel de bureau"]
[null,null,"Ce personnel regroupe notamment les fonctions suivantes : secrétaire, standardiste, hôtesse d'accueil, personnel informatique, comptable …"]
[]
[null,24,"Ouvrier professionnel"]
[null,null,"Ce personnel regroupe notamment les fonctions suivantes : cuisinier, électricien, jardinier, plombier…"]
[]
[null,25,"ASH"]
[null,null,"Ce personnel regroupe les agents de service hospitalier (public) ou agents de service (privé)"]
[]
[null,26,"A.E.S."]
[null,null,"Ce personnel regroupe les accompagnants éducatifs et sociaux. Y inclure également le cas échéant les AVS."]
[null,27,"ETP travaillés (TER type EHPAD)"]
[null,null,"La colonne \"Nombre d'ETP travaillés\" a été ajoutée pour permettre aux ESMS et aux autorités de tarification de calculer des taux d’encadrement ajustés de certains éléments qui peuvent contribuer à les surévaluer (par ex. remplacements de personnel)."]
[null,null,"En l'absence de norme relative aux notions d'ETP rémunérés et d'ETP travaillés, la préconisation pour le remplissage du TER est la suivante : \n- les ETP rémunérés prennent en compte la quotité de temps de travail, la durée de présence de l’agent sur la période de référence, toute absence dès lors qu'elle est rémunérée, le personnel de remplacement, ainsi que la sur-rémunération des agents de droit public à temps partiel. \n- les ETP travaillés prennent en compte la quotité de temps de travail, la durée de présence de l’agent sur la période de référence et toute absence dès lors qu'elle est rémunérée."]
[]
[]
[{"$nulls":3},"- la quotité de temps de travail "]
[{"$nulls":3},"- la durée de présence de l’agent sur la période de référence"]
[{"$nulls":3},"- toute absence, dès lors qu'elle est rémunérée"]
[{"$nulls":3},"- le personnel de remplacement"]
[{"$nulls":3},"- la sur-rémunération des agents de droit public à temps partiels"]
[]
[{"$nulls":3},"ETPT = ETPR hors sur-rémunération des temps partiels et hors personnel de remplacement dès lors que le salarié absent remplacé est déjà compté dans les ETPT    "]

{"sheet":"Page de garde","index":3,"n_rows":12,"n_cols":6,"rows_kept":12,"merged":[[1,2,1,10],[7,3,7,10]]}
["#AEPRDEFF-2025-01#"]
[null,null," CADRE NORMALISE DE PRESENTATION DES DOCUMENTS ANNEXES PREVUS A L'ARTICLE R. 314-223 DU CODE DE L'ACTION SOCIALE ET DES FAMILLES"]
[]
[null,null,"Exercice :"]
[]
[null,null,"N° FINESS (entité juridique) :",""]
[]
[null,null,"Organisme gestionnaire :"]
[]
[null,null,"Etablissements et services relevant du périmètre de l'EPRD :"]
[]
[null,null,"Etablissements et services","Adresses","N° FINESS Etablissement","Catégorie"]

{"sheet":"Id_CR_SF","index":4,"n_rows":13,"n_cols":6,"rows_kept":13,"merged":[[1,1,1,5],[11,1,11,5],[12,1,12,5]]}
[]
[null,"Identification des activités sans numéro FINESS"]
[]
[null,"Liste des activités sans FINESS Etablissement relevant du périmètre de l'EPRD"]
[]
[]
[null,"Identifiant (*)","Dénomination du CRP sans n° FINESS","Adresse","N° FINESS ET de rattachement","Catégorie"]
[{"$nulls":4},""]
[]
[]
[]
[null,"(*) Veuillez saisir un identifiant de votre choix comprenant 6 caractères (sans caractères spéciaux, tirets, accents…)."]
[null,"Nous vous invitons à compléter le tableau de l'onglet \"Id_CR_SF\" selon le même ordonnancement chaque année, afin qu'un même numéro d'identification soit toujours attribué à la même activité."]

{"sheet":"Contrôles","index":5,"n_rows":114,"n_cols":4,"rows_kept":114}
["FICHE D'AUTO-CONTRÔLE A TITRE D'INFORMATION","Finess ET: è","Consolidation","Modèle vierge"]
[]
["Cet onglet a été ajouté à titre expérimental. Il n'est pas protégé. En cas de modification, le bon fonctionnement des formules ne peut être garanti."]
[]
[]
["Résultats d'autocontrôles (réalisé N) : ","Modèles concernés"]
["Nombre global d'ETPR salariés > 0","Tous",null,{"$f":"IFERROR(IF(VLOOKUP(D1,'Page de garde'!$E$12:$F$155,2,FALSE)=Liste!$A$3,IF('TPER type EHPAD'!$E$119>0,\"VU\",\"KO\"),IF(VLOOKUP(D1,'Page de garde'!$E$12:$F$155,2,FALSE)=Liste!$A$4,IF('TPER ESSMS PH Cofin'!$D$108>0,\"VU\",\"KO\"),IF(VLOOKUP(D1,'Page de garde'!$E$12:$F$155,2,FALSE)=Liste!$A$5,IF('TPER type ESMS PH'!$H$108>0,\"VU\",\"KO\"),\"\"))),\"\")&IFERROR(IF(VLOOKUP(D1,Id_CR_SF!$B$7:$F$154,5,FALSE)=Liste!$C$3,IF('TPER type EHPAD_SF'!$E$120>0,\"VU\",\"KO\"),IF(VLOOKUP(D1,Id_CR_SF!$B$7:$F$154,5,FALSE)=Liste!$C$4,IF('TPER FAM-SAMSAH_SF'!$D$108>0,\"VU\",\"KO\"),IF(VLOOKUP(D1,Id_CR_SF!$B$7:$F$154,5,FALSE)=Liste!$C$5,IF('TPER Autre ESSMS_SF'!$H$108>0,\"VU\",\"KO\"),\"\"))),\"\")","v":""}]
["Nombre global d'ETPR salariés < 1 000","Tous",null,{"$f":"IFERROR(IF(VLOOKUP(D1,'Page de garde'!$E$12:$F$155,2,FALSE)=Liste!$A$3,IF('TPER type EHPAD'!$E$119<1000,\"VU\",\"KO\"),IF(VLOOKUP(D1,'Page de garde'!$E$12:$F$155,2,FALSE)=Liste!$A$4,IF('TPER ESSMS PH Cofin'!$D$108<1000,\"VU\",\"KO\"),IF(VLOOKUP(D1,'Page de garde'!$E$12:$F$155,2,FALSE)=Liste!$A$5,IF('TPER type ESMS PH'!$H$108<1000,\"VU\",\"KO\"),\"\"))),\"\")&IFERROR(IF(VLOOKUP(D1,Id_CR_SF!$B$7:$F$154,5,FALSE)=Liste!$C$3,IF('TPER type EHPAD_SF'!$E$120<1000,\"VU\",\"KO\"),IF(VLOOKUP(D1,Id_CR_SF!$B$7:$F$154,5,FALSE)=Liste!$C$4,IF('TPER FAM-SAMSAH_SF'!$D$108<1000,\"VU\",\"KO\"),IF(VLOOKUP(D1,Id_CR_SF!$B$7:$F$154,5,FALSE)=Liste!$C$5,IF('TPER Autre ESSMS_SF'!$H$108<1000,\"VU\",\"KO\"),\"\"))),\"\")","v":""}]
["Nombre global d'ETPT salariés > 0","EHPAD-AJA",null,{"$f":"IF(AND('TPER type EHPAD'!$D$3=\"\",'TPER type EHPAD_SF'!$D$3=\"\"),\"\",IF(('TPER type EHPAD'!$R$119+'TPER type EHPAD_SF'!$R$120)>0,\"VU\",\"KO\"))","v":""}]
["Nombre global d'ETPT salariés < 1000","EHPAD-AJA",null,{"$f":"IF(AND('TPER type EHPAD'!$D$3=\"\",'TPER type EHPAD_SF'!$D$3=\"\"),\"\",IF(('TPER type EHPAD'!$R$119+'TPER type EHPAD_SF'!$R$120)<1000,\"VU\",\"KO\"))","v":""}]
["Nombre global d'ETPR salariés = cumul ETPR par section","EHPAD-AJA",null,{"$f":"IF(AND('TPER type EHPAD'!$D$3=\"\",'TPER type EHPAD_SF'!$D$3=\"\"),\"\",IF(ROUND('TPER type EHPAD'!$E$119-'TPER type EHPAD'!$F$119-'TPER type EHPAD'!$G$119-'TPER type EHPAD'!$H$119-'TPER type EHPAD'!$O$119+'TPER type EHPAD_SF'!$E$120-'TPER type EHPAD_SF'!$F$120-'TPER type EHPAD_SF'!$G$120-'TPER type EHPAD_SF'!$H$120-'TPER type EHPAD_SF'!$O$120,0)=0,\"VU\",\"KO\"))","v":""}]
["Nombre global d'ETPR salariés AS-AMP-AES > 0","EHPAD-AJA",null,{"$f":"IF(AND('TPER type EHPAD'!$D$3=\"\",'TPER type EHPAD_SF'!$D$3=\"\"),\"\",IF(('TPER type EHPAD'!$E$50+'TPER type EHPAD_SF'!$E$51)>0,\"VU\",\"KO\"))","v":""}]
["Nombre d'ETPR salariés sur forfait \"soins\" > 0","FAM-SAMSAH",null,{"$f":"IF(AND('TPER ESSMS PH Cofin'!$D$3=\"\",'TPER FAM-SAMSAH_SF'!$D$3=\"\"),\"\",IF(('TPER ESSMS PH Cofin'!$H$108+'TPER FAM-SAMSAH_SF'!$H$108)>0,\"VU\",\"KO\"))","v":""}]
["Nombre d'ETPR salariés sur forfait \"soins\" < Nombre global d'ETPR salariés","FAM-SAMSAH",null,{"$f":"IF(AND('TPER ESSMS PH Cofin'!$D$3=\"\",'TPER FAM-SAMSAH_SF'!$D$3=\"\"),\"\",IF(('TPER ESSMS PH Cofin'!$H$108+'TPER FAM-SAMSAH_SF'!$H$108)<('TPER ESSMS PH Cofin'!$D$108+'TPER FAM-SAMSAH_SF'!$D$108),\"VU\",\"KO\"))","v":""}]
["Rémunérations globales salariés > 0","Tous",null,{"$f":"IFERROR(IF(VLOOKUP(D1,'Page de garde'!$E$12:$F$155,2,FALSE)=Liste!$A$3,IF('TPER type EHPAD'!$J$119>0,\"VU\",\"KO\"),IF(VLOOKUP(D1,'Page de garde'!$E$12:$F$155,2,FALSE)=Liste!$A$4,IF('TPER ESSMS PH Cofin'!$K$108>0,\"VU\",\"KO\"),IF(VLOOKUP(D1,'Page de garde'!$E$12:$F$155,2,FALSE)=Liste!$A$5,IF('TPER type ESMS PH'!$L$108>0,\"VU\",\"KO\"),\"\"))),\"\")&IFERROR(IF(VLOOKUP(D1,Id_CR_SF!$B$7:$F$154,5,FALSE)=Liste!$C$3,IF('TPER type EHPAD_SF'!$J$120>0,\"VU\",\"KO\"),IF(VLOOKUP(D1,Id_CR_SF!$B$7:$F$154,5,FALSE)=Liste!$C$4,IF('TPER FAM-SAMSAH_SF'!$K$108>0,\"VU\",\"KO\"),IF(VLOOKUP(D1,Id_CR_SF!$B$7:$F$154,5,FALSE)=Liste!$C$5,IF('TPER Autre ESSMS_SF'!$L$108>0,\"VU\",\"KO\"),\"\"))),\"\")","v":""}]
["Rémunérations globales salariés AS-AMP-AES > 0","EHPAD-AJA",null,{"$f":"IF(AND('TPER type EHPAD'!$D$3=\"\",'TPER type EHPAD_SF'!$D$3=\"\"),\"\",IF(('TPER type EHPAD'!$J$50+'TPER type EHPAD_SF'!$J$51)>0,\"VU\",\"KO\"))","v":""}]
["Rémunérations globales salariés = cumul rémunérations par section","EHPAD-AJA",null,{"$f":"IF(AND('TPER type EHPAD'!$D$3=\"\",'TPER type EHPAD_SF'!$D$3=\"\"),\"\",IF(ROUND('TPER type EHPAD'!$J$119-'TPER type EHPAD'!$K$119-'TPER type EHPAD'!$L$119-'TPER type EHPAD'!$M$119-'TPER type EHPAD'!$P$119+'TPER type EHPAD_SF'!$J$120-'TPER type EHPAD_SF'!$K$120-'TPER type EHPAD_SF'!$L$120-'TPER type EHPAD_SF'!$M$120-'TPER type EHPAD_SF'!$P$120,0)=0,\"VU\",\"KO\"))","v":""}]
["Augmentation N-1/N du nombre global d'ETPR > +/-10%","Tous",null,{"$f":"IFERROR(IF(VLOOKUP(D1,'Page de garde'!$E$12:$F$155,2,FALSE)=Liste!$A$3,IF('TPER type EHPAD'!$D$119=0,\"ETP N-1 non saisis\",IF(ABS('TPER type EHPAD'!$E$119/'TPER type EHPAD'!$D$119-1)>0.1,\">  +/-10%\",\"VU\")),IF(VLOOKUP(D1,'Page de garde'!$E$12:$F$155,2,FALSE)=Liste!$A$4,IF('TPER ESSMS PH Cofin'!$F$108=0,\"ETP N-1 non saisis\",IF(ABS('TPER ESSMS PH Cofin'!$G$108/'TPER ESSMS PH Cofin'!$F$108)>0.1,\"> +/-10%\",\"VU\")),IF(VLOOKUP(D1,'Page de garde'!$E$12:$F$155,2,FALSE)=Liste!$A$5,IF('TPER type ESMS PH'!$I$108=0,\"ETP N-1 non saisis\",IF(ABS('TPER type ESMS PH'!$J$108/'TPER type ESMS PH'!$I$108)>0.1,\">  +/-10%\",\"VU\")),\"\"))),\"\")&IFERROR(IF(VLOOKUP(D1,Id_CR_SF!$B$7:$F$154,5,FALSE)=Liste!$C$3,IF('TPER type EHPAD_SF'!$D$120=0,\"ETP N-1 non saisis\",IF(ABS('TPER type EHPAD_SF'!$E$120/'TPER type EHPAD_SF'!$D$120-1)>0.1,\"> +/-10%\",\"VU\")),IF(VLOOKUP(D1,Id_CR_SF!$B$7:$F$154,5,FALSE)=Liste!$C$4,IF('TPER FAM-SAMSAH_SF'!$F$108=0,\"ETP N-1 non saisis\",IF(ABS('TPER FAM-SAMSAH_SF'!$G$108/'TPER FAM-SAMSAH_SF'!$F$108)>0.1,\"> +/-10%\",\"VU\")),IF(VLOOKUP(D1,Id_CR_SF!$B$7:$F$154,5,FALSE)=Liste!$C$5,IF('TPER Autre ESSMS_SF'!$I$108=0,\"ETP N-1 non saisis\",IF(ABS('TPER Autre ESSMS_SF'!$J$108/'TPER Autre ESSMS_SF'!$I$108)>0.1,\"> +/-10%\",\"VU\")),\"\"))),\"\")","v":""}]
["Augmentation N-1/N des remunérations globales salariés > +/- 10%","Tous",null,{"$f":"IFERROR(IF(VLOOKUP(D1,'Page de garde'!$E$12:$F$155,2,FALSE)=Liste!$A$3,IF('TPER type EHPAD'!$I$119=0,\"Rem. N-1 non saisies\",IF(ABS('TPER type EHPAD'!$J$119/'TPER type EHPAD'!$I$119-1)>0.1,\">  +/-10%\",\"VU\")),IF(VLOOKUP(D1,'Page de garde'!$E$12:$F$155,2,FALSE)=Liste!$A$4,IF('TPER ESSMS PH Cofin'!$L$108=0,\"Rem. N-1 non saisies\",IF(ABS('TPER ESSMS PH Cofin'!$M$108/'TPER ESSMS PH Cofin'!$L$108)>0.1,\"> +/-10%\",\"VU\")),IF(VLOOKUP(D1,'Page de garde'!$E$12:$F$155,2,FALSE)=Liste!$A$5,IF('TPER type ESMS PH'!$K$108=0,\"Rem. N-1 non saisies\",IF(ABS('TPER type ESMS PH'!$M$108/'TPER type ESMS PH'!$K$108)>0.1,\">  +/-10%\",\"VU\")),\"\"))),\"\")&IFERROR(IF(VLOOKUP(D1,Id_CR_SF!$B$7:$F$154,5,FALSE)=Liste!$C$3,IF('TPER type EHPAD_SF'!$I$120=0,\"Rem. N-1 non saisies\",IF(ABS('TPER type EHPAD_SF'!$J$120/'TPER type EHPAD_SF'!$I$120-1)>0.1,\"> +/-10%\",\"VU\")),IF(VLOOKUP(D1,Id_CR_SF!$B$7:$F$154,5,FALSE)=Liste!$C$4,IF('TPER FAM-SAMSAH_SF'!$L$108=0,\"Rem. N-1 non saisies\",IF(ABS('TPER FAM-SAMSAH_SF'!$M$108/'TPER FAM-SAMSAH_SF'!$L$108)>0.1,\"> +/-10%\",\"VU\")),IF(VLOOKUP(D1,Id_CR_SF!$B$7:$F$154,5,FALSE)=Liste!$C$5,IF('TPER Autre ESSMS_SF'!$K$108=0,\"Rem. N-1 non saisies\",IF(ABS('TPER Autre ESSMS_SF'!$M$108/'TPER Autre ESSMS_SF'!$K$108)>0.1,\"> +/-10%\",\"VU\")), \"\")) ),\"\")","v":""}]
[]
["Valeurs de référence à titre d'information (réalisé N) : "]
["Nombre de places installées EHPAD-AJA (Saisie manuelle pour le calcul des taux d'encadrement)","EHPAD-AJA"]
["Nombre de places installées ESSMS hors EHPAD-AJA (Saisie manuelle pour le calcul des taux d'encadrement)","FAM-SAMSAH / Autres ESSMS"]
["Nombre global d'ETPT salariés - Toutes catégories","EHPAD-AJA",null,{"$f":"IF(AND('TPER type EHPAD'!$D$3=\"\",'TPER type EHPAD_SF'!$D$3=\"\"),\"\",'TPER type EHPAD'!$R$119+'TPER type EHPAD_SF'!$R$120)","v":""}]
["Nombre global d'ETPR salariés - Toutes catégories","Tous",null,{"$f":"IFERROR(IF(VLOOKUP(D1,'Page de garde'!$E$12:$F$155,2,FALSE)=Liste!$A$3,'TPER type EHPAD'!$E$119,IF(VLOOKUP(D1,'Page de garde'!$E$12:$F$155,2,FALSE)=Liste!$A$4,'TPER ESSMS PH Cofin'!$D$108,IF(VLOOKUP(D1,'Page de garde'!$E$12:$F$155,2,FALSE)=Liste!$A$5,'TPER type ESMS PH'!$H$108,\"\"))),)+IFERROR(IF(VLOOKUP(D1,Id_CR_SF!$B$7:$F$154,5,FALSE)=Liste!$C$3,'TPER type EHPAD_SF'!$E$120,IF(VLOOKUP(D1,Id_CR_SF!$B$7:$F$154,5,FALSE)=Liste!$C$4,'TPER FAM-SAMSAH_SF'!$D$108,IF(VLOOKUP(D1,Id_CR_SF!$B$7:$F$154,5,FALSE)=Liste!$C$5,'TPER Autre ESSMS_SF'!$H$108,\"\"))),)","v":{"v":0,"d":"0.00"}}]
["Taux d'encadrement salariés - Toutes catégories (base ETPT)","EHPAD-AJA",null,{"$f":"IF(AND('TPER type EHPAD'!$D$3=\"\",'TPER type EHPAD_SF'!$D$3=\"\"),\"\",IF(D22=0,\"nc\",(D24/D22)*100))","v":""}]
["Taux d'encadrement salariés - Toutes catégories (base ETPR)","Tous",null,{"$f":"IFERROR(IF(VLOOKUP(D1,'Page de garde'!$E$12:$F$155,2,FALSE)=Liste!$A$3,IF(D22=0,\"nc\",D25/D22*100),IF(VLOOKUP(D1,'Page de garde'!$E$12:$F$155,2,FALSE)=Liste!$A$4,IF(D23=0,\"nc\",D25/D23*100),IF(VLOOKUP(D1,'Page de garde'!$E$12:$F$155,2,FALSE)=Liste!$A$5,IF(D23=0,\"nc\",D25/D23*100),\"\"))),IFERROR(IF(VLOOKUP(D1,Id_CR_SF!$B$7:$F$154,5,FALSE)=Liste!$C$3,IF(D22=0,\"nc\",D25/D22*100),IF(VLOOKUP(D1,Id_CR_SF!$B$7:$F$154,5,FALSE)=Liste!$C$4,IF(D23=0,\"nc\",D25/D23*100),IF(VLOOKUP(D1,Id_CR_SF!$B$7:$F$154,5,FALSE)=Liste!$C$5,IF(D23=0,\"nc\",D25/D23*100),\"\"))),))","v":{"v":0,"d":"0.00"}}]
["Rémunérations globales salariés - Toutes catégories","Tous",null,{"$f":"IFERROR(IF(VLOOKUP(D1,'Page de garde'!$E$12:$F$155,2,FALSE)=Liste!$A$3,'TPER type EHPAD'!$J$119,IF(VLOOKUP(D1,'Page de garde'!$E$12:$F$155,2,FALSE)=Liste!$A$4,'TPER ESSMS PH Cofin'!$K$108,IF(VLOOKUP(D1,'Page de garde'!$E$12:$F$155,2,FALSE)=Liste!$A$5,'TPER type ESMS PH'!$L$108,\"\"))),)+IFERROR(IF(VLOOKUP(D1,Id_CR_SF!$B$7:$F$154,5,FALSE)=Liste!$C$3,'TPER type EHPAD_SF'!$J$120,IF(VLOOKUP(D1,Id_CR_SF!$B$7:$F$154,5,FALSE)=Liste!$C$4,'TPER FAM-SAMSAH_SF'!$K$108,IF(VLOOKUP(D1,Id_CR_SF!$B$7:$F$154,5,FALSE)=Liste!$C$5,'TPER Autre ESSMS_SF'!$L$108,\"\"))),)","v":{"v":0,"d":"0.00 €"}}]
["Salaire moyen brut chargé salariés - Toutes catégories","Tous",null,{"$f":"IF(D25=\"\",\"\",IF(D25=0,\"nc\",D28/D25))","v":"nc"}]
["Nombre global d'ETPT salariés - Direction/adm.","EHPAD-AJA",null,{"$f":"IF(AND('TPER type EHPAD'!$D$3=\"\",'TPER type EHPAD_SF'!$D$3=\"\"),\"\",'TPER type EHPAD'!$R$10+'TPER type EHPAD_SF'!$R$11)","v":""}]
["Nombre global d'ETPR salariés - Direction/adm.","EHPAD-AJA",null,{"$f":"IF(AND('TPER type EHPAD'!$D$3=\"\",'TPER type EHPAD_SF'!$D$3=\"\"),\"\",'TPER type EHPAD'!$E$10+'TPER type EHPAD_SF'!$E$11)","v":""}]
["Taux d'encadrement salariés - Direction/adm. (base ETPT)","EHPAD-AJA",null,{"$f":"IF(AND('TPER type EHPAD'!$D$3=\"\",'TPER type EHPAD_SF'!$D$3=\"\"),\"\",IF(D22=0,\"nc\",(D30/D22)*100))","v":""}]
["Rémunérations globales salariés - Direction/adm.","EHPAD-AJA",null,{"$f":"IF(AND('TPER type EHPAD'!$D$3=\"\",'TPER type EHPAD_SF'!$D$3=\"\"),\"\",'TPER type EHPAD'!$J$10+'TPER type EHPAD_SF'!$J$11)","v":""}]
["Salaire moyen brut chargé salariés - Direction/adm.","EHPAD-AJA",null,{"$f":"IF(AND('TPER type EHPAD'!$D$3=\"\",'TPER type EHPAD_SF'!$D$3=\"\"),\"\",IF(D31=0,\"nc\",D33/D31))","v":""}]
["Nombre global d'ETPT salariés - Cuisine/SG.","EHPAD-AJA",null,{"$f":"IF(AND('TPER type EHPAD'!$D$3=\"\",'TPER type EHPAD_SF'!$D$3=\"\"),\"\",'TPER type EHPAD'!$R$24+'TPER type EHPAD_SF'!$R$25)","v":""}]
["Nombre global d'ETPR salariés - Cuisine/SG.","EHPAD-AJA",null,{"$f":"IF(AND('TPER type EHPAD'!$D$3=\"\",'TPER type EHPAD_SF'!$D$3=\"\"),\"\",'TPER type EHPAD'!$E$24+'TPER type EHPAD_SF'!$E$25)","v":""}]
["Taux d'encadrement salariés - Cuisine/SG. (base ETPT)","EHPAD-AJA",null,{"$f":"IF(AND('TPER type EHPAD'!$D$3=\"\",'TPER type EHPAD_SF'!$D$3=\"\"),\"\",IF(D22=0,\"nc\",(D35/D22)*100))","v":""}]
["Rémunérations globales salariés - Cuisine/SG.","EHPAD-AJA",null,{"$f":"IF(AND('TPER type EHPAD'!$D$3=\"\",'TPER type EHPAD_SF'!$D$3=\"\"),\"\",'TPER type EHPAD'!$J$24+'TPER type EHPAD_SF'!$J$25)","v":""}]
["Salaire moyen brut chargé salariés - Cuisine/SG.","EHPAD-AJA",null,{"$f":"IF(AND('TPER type EHPAD'!$D$3=\"\",'TPER type EHPAD_SF'!$D$3=\"\"),\"\",IF(D36=0,\"nc\",D38/D36))","v":""}]
["Nombre global d'ETPT salariés - Animation/service_soc.","EHPAD-AJA",null,{"$f":"IF(AND('TPER type EHPAD'!$D$3=\"\",'TPER type EHPAD_SF'!$D$3=\"\"),\"\",'TPER type EHPAD'!$R$36+'TPER type EHPAD_SF'!$R$37)","v":""}]
["Nombre global d'ETPR salariés - Animation/service_soc.","EHPAD-AJA",null,{"$f":"IF(AND('TPER type EHPAD'!$D$3=\"\",'TPER type EHPAD_SF'!$D$3=\"\"),\"\",'TPER type EHPAD'!$E$36+'TPER type EHPAD_SF'!$E$37)","v":""}]
["Taux d'encadrement salariés - Animation/service_soc. (base ETPT)","EHPAD-AJA",null,{"$f":"IF(AND('TPER type EHPAD'!$D$3=\"\",'TPER type EHPAD_SF'!$D$3=\"\"),\"\",IF(D22=0,\"nc\",(D40/D22)*100))","v":""}]
["Rémunérations globales salariés - Animation/service_soc.","EHPAD-AJA",null,{"$f":"IF(AND('TPER type EHPAD'!$D$3=\"\",'TPER type EHPAD_SF'!$D$3=\"\"),\"\",'TPER type EHPAD'!$J$36+'TPER type EHPAD_SF'!$J$37)","v":""}]
["Salaire moyen brut chargé salariés - Animation/service_soc.","EHPAD-AJA",null,{"$f":"IF(AND('TPER type EHPAD'!$D$3=\"\",'TPER type EHPAD_SF'!$D$3=\"\"),\"\",IF(D41=0,\"nc\",D43/D41))","v":""}]
["Nombre global d'ETPT salariés - ASH.","EHPAD-AJA",null,{"$f":"IF(AND('TPER type EHPAD'!$D$3=\"\",'TPER type EHPAD_SF'!$D$3=\"\"),\"\",'TPER type EHPAD'!$R$44+'TPER type EHPAD_SF'!$R$45)","v":""}]
["Nombre global d'ETPR salariés - ASH.","EHPAD-AJA",null,{"$f":"IF(AND('TPER type EHPAD'!$D$3=\"\",'TPER type EHPAD_SF'!$D$3=\"\"),\"\",'TPER type EHPAD'!$E$44+'TPER type EHPAD_SF'!$E$45)","v":""}]
["Taux d'encadrement salariés - ASH. (base ETPT)","EHPAD-AJA",null,{"$f":"IF(AND('TPER type EHPAD'!$D$3=\"\",'TPER type EHPAD_SF'!$D$3=\"\"),\"\",IF(D22=0,\"nc\",(D45/D22)*100))","v":""}]
["Rémunérations globales salariés - ASH.","EHPAD-AJA",null,{"$f":"IF(AND('TPER type EHPAD'!$D$3=\"\",'TPER type EHPAD_SF'!$D$3=\"\"),\"\",'TPER type EHPAD'!$J$44+'TPER type EHPAD_SF'!$J$45)","v":""}]
["Salaire moyen brut chargé salariés - ASH.","EHPAD-AJA",null,{"$f":"IF(AND('TPER type EHPAD'!$D$3=\"\",'TPER type EHPAD_SF'!$D$3=\"\"),\"\",IF(D48=0,\"nc\",D48/D46))","v":""}]
["Nombre global d'ETPT salariés - AS/AES/AMP.","EHPAD-AJA",null,{"$f":"IF(AND('TPER type EHPAD'!$D$3=\"\",'TPER type EHPAD_SF'!$D$3=\"\"),\"\",'TPER type EHPAD'!$R$50+'TPER type EHPAD_SF'!$R$51)","v":""}]
["Nombre global d'ETPR salariés - AS/AES/AMP.","EHPAD-AJA",null,{"$f":"IF(AND('TPER type EHPAD'!$D$3=\"\",'TPER type EHPAD_SF'!$D$3=\"\"),\"\",'TPER type EHPAD'!$E$50+'TPER type EHPAD_SF'!$E$51)","v":""}]
["Taux d'encadrement salariés - AS/AES/AMP. (base ETPT)","EHPAD-AJA",null,{"$f":"IF(AND('TPER type EHPAD'!$D$3=\"\",'TPER type EHPAD_SF'!$D$3=\"\"),\"\",IF(D22=0,\"nc\",(D50/D22)*100))","v":""}]
["Rémunérations globales salariés - AS/AES/AMP.","EHPAD-AJA",null,{"$f":"IF(AND('TPER type EHPAD'!$D$3=\"\",'TPER type EHPAD_SF'!$D$3=\"\"),\"\",'TPER type EHPAD'!$J$50+'TPER type EHPAD_SF'!$J$51)","v":""}]
["Salaire moyen brut chargé salariés - AS/AES/AMP.","EHPAD-AJA",null,{"$f":"IF(AND('TPER type EHPAD'!$D$3=\"\",'TPER type EHPAD_SF'!$D$3=\"\"),\"\",IF(D51=0,\"nc\",D53/D51))","v":""}]
["Part des ETP AS/AMP/AES imputés sur section \"soins\" (*)","EHPAD-AJA",null,{"$f":"IF(AND('TPER type EHPAD'!$D$3=\"\",'TPER type EHPAD_SF'!$D$3=\"\"),\"\",IF('TPER type EHPAD'!$H$49<>\"\",'TPER type EHPAD'!$H$49,IF('TPER type EHPAD_SF'!$H$50<>\"\",'TPER type EHPAD_SF'!$H$50,\"nc\")))","v":""}]
["Nombre global d'ETPT salariés - Psychologues","EHPAD-AJA",null,{"$f":"IF(AND('TPER type EHPAD'!$D$3=\"\",'TPER type EHPAD_SF'!$D$3=\"\"),\"\",'TPER type EHPAD'!$R$64+'TPER type EHPAD_SF'!$R$65)","v":""}]
["Nombre global d'ETPR salariés - Psychologues","EHPAD-AJA",null,{"$f":"IF(AND('TPER type EHPAD'!$D$3=\"\",'TPER type EHPAD_SF'!$D$3=\"\"),\"\",'TPER type EHPAD'!$E$64+'TPER type EHPAD_SF'!$E$65)","v":""}]
["Taux d'encadrement salariés - Psychologues (base ETPT)","EHPAD-AJA",null,{"$f":"IF(AND('TPER type EHPAD'!$D$3=\"\",'TPER type EHPAD_SF'!$D$3=\"\"),\"\",IF(D22=0,\"nc\",(D56/D22)*100))","v":""}]
["Rémunérations globales salariés - Psychologues","EHPAD-AJA",null,{"$f":"IF(AND('TPER type EHPAD'!$D$3=\"\",'TPER type EHPAD_SF'!$D$3=\"\"),\"\",'TPER type EHPAD'!$J$64+'TPER type EHPAD_SF'!$J$65)","v":""}]
["Salaire moyen brut chargé salariés - Psychologues","EHPAD-AJA",null,{"$f":"IF(AND('TPER type EHPAD'!$D$3=\"\",'TPER type EHPAD_SF'!$D$3=\"\"),\"\",IF(D57=0,\"nc\",D59/D57))","v":""}]
["Nombre global d'ETPT salariés - Infirmiers","EHPAD-AJA",null,{"$f":"IF(AND('TPER type EHPAD'!$D$3=\"\",'TPER type EHPAD_SF'!$D$3=\"\"),\"\",'TPER type EHPAD'!$R$70+'TPER type EHPAD_SF'!$R$71)","v":""}]
["Nombre global d'ETPR salariés - Infirmiers","EHPAD-AJA",null,{"$f":"IF(AND('TPER type EHPAD'!$D$3=\"\",'TPER type EHPAD_SF'!$D$3=\"\"),\"\",'TPER type EHPAD'!$E$70+'TPER type EHPAD_SF'!$E$71)","v":""}]
["Taux d'encadrement salariés - Infirmiers (base ETPT)","EHPAD-AJA",null,{"$f":"IF(AND('TPER type EHPAD'!$D$3=\"\",'TPER type EHPAD_SF'!$D$3=\"\"),\"\",IF(D22=0,\"nc\",(D61/D22)*100))","v":""}]
["Rémunérations globales salariés - Infirmiers","EHPAD-AJA",null,{"$f":"IF(AND('TPER type EHPAD'!$D$3=\"\",'TPER type EHPAD_SF'!$D$3=\"\"),\"\",'TPER type EHPAD'!$J$70+'TPER type EHPAD_SF'!$J$71)","v":""}]
["Salaire moyen brut chargé salariés - Infirmiers","EHPAD-AJA",null,{"$f":"IF(AND('TPER type EHPAD'!$D$3=\"\",'TPER type EHPAD_SF'!$D$3=\"\"),\"\",IF(D62=0,\"nc\",D64/D62))","v":""}]
["Nombre global d'ETPT salariés - Autres aux. méd.","EHPAD-AJA",null,{"$f":"IF(AND('TPER type EHPAD'!$D$3=\"\",'TPER type EHPAD_SF'!$D$3=\"\"),\"\",'TPER type EHPAD'!$R$82+'TPER type EHPAD_SF'!$R$83)","v":""}]
["Nombre global d'ETPR salariés - Autres aux. méd.","EHPAD-AJA",null,{"$f":"IF(AND('TPER type EHPAD'!$D$3=\"\",'TPER type EHPAD_SF'!$D$3=\"\"),\"\",'TPER type EHPAD'!$E$82+'TPER type EHPAD_SF'!$E$83)","v":""}]
["Taux d'encadrement salariés - Autres aux. méd. (base ETPT)","EHPAD-AJA",null,{"$f":"IF(AND('TPER type EHPAD'!$D$3=\"\",'TPER type EHPAD_SF'!$D$3=\"\"),\"\",IF(D22=0,\"nc\",(D66/D22)*100))","v":""}]
["Rémunérations globales salariés - Autres aux. méd.","EHPAD-AJA",null,{"$f":"IF(AND('TPER type EHPAD'!$D$3=\"\",'TPER type EHPAD_SF'!$D$3=\"\"),\"\",'TPER type EHPAD'!$J$82+'TPER type EHPAD_SF'!$J$83)","v":""}]
["Salaire moyen brut chargé salariés - Autres aux. méd.","EHPAD-AJA",null,{"$f":"IF(AND('TPER type EHPAD'!$D$3=\"\",'TPER type EHPAD_SF'!$D$3=\"\"),\"\",IF(D67=0,\"nc\",D69/D67))","v":""}]
["Nombre global d'ETPT salariés - Pharmaciens/prép.","EHPAD-AJA",null,{"$f":"IF(AND('TPER type EHPAD'!$D$3=\"\",'TPER type EHPAD_SF'!$D$3=\"\"),\"\",'TPER type EHPAD'!$R$98+'TPER type EHPAD_SF'!$R$99)","v":""}]
["Nombre global d'ETPR salariés - Pharmaciens/prép.","EHPAD-AJA",null,{"$f":"IF(AND('TPER type EHPAD'!$D$3=\"\",'TPER type EHPAD_SF'!$D$3=\"\"),\"\",'TPER type EHPAD'!$E$98+'TPER type EHPAD_SF'!$E$99)","v":""}]
["Taux d'encadrement salariés - Pharmaciens/prép. (base ETPT)","EHPAD-AJA",null,{"$f":"IF(AND('TPER type EHPAD'!$D$3=\"\",'TPER type EHPAD_SF'!$D$3=\"\"),\"\",IF(D22=0,\"nc\",(D71/D22)*100))","v":""}]
["Rémunérations globales salariés - Pharmaciens/prép.","EHPAD-AJA",null,{"$f":"IF(AND('TPER type EHPAD'!$D$3=\"\",'TPER type EHPAD_SF'!$D$3=\"\"),\"\",'TPER type EHPAD'!$J$98+'TPER type EHPAD_SF'!$J$99)","v":""}]
["Salaire moyen brut chargé salariés - Pharmaciens/prép.","EHPAD-AJA",null,{"$f":"IF(AND('TPER type EHPAD'!$D$3=\"\",'TPER type EHPAD_SF'!$D$3=\"\"),\"\",IF(D72=0,\"nc\",D74/D72))","v":""}]
["Nombre global d'ETPT salariés - Médecins","EHPAD-AJA",null,{"$f":"IF(AND('TPER type EHPAD'!$D$3=\"\",'TPER type EHPAD_SF'!$D$3=\"\"),\"\",'TPER type EHPAD'!$R$106+'TPER type EHPAD_SF'!$R$107)","v":""}]
["Nombre global d'ETPR salariés - Médecins","EHPAD-AJA",null,{"$f":"IF(AND('TPER type EHPAD'!$D$3=\"\",'TPER type EHPAD_SF'!$D$3=\"\"),\"\",'TPER type EHPAD'!$E$106+'TPER type EHPAD_SF'!$E$107)","v":""}]
["Taux d'encadrement salariés - Médecins (base ETPT)","EHPAD-AJA",null,{"$f":"IF(AND('TPER type EHPAD'!$D$3=\"\",'TPER type EHPAD_SF'!$D$3=\"\"),\"\",IF(D22=0,\"nc\",(D76/D22)*100))","v":""}]
["Rémunérations globales salariés - Médecins","EHPAD-AJA",null,{"$f":"IF(AND('TPER type EHPAD'!$D$3=\"\",'TPER type EHPAD_SF'!$D$3=\"\"),\"\",'TPER type EHPAD'!$J$106+'TPER type EHPAD_SF'!$J$107)","v":""}]
["Salaire moyen brut chargé salariés - Médecins","EHPAD-AJA",null,{"$f":"IF(AND('TPER type EHPAD'!$D$3=\"\",'TPER type EHPAD_SF'!$D$3=\"\"),\"\",IF(D77=0,\"nc\",D79/D77))","v":""}]
["Nombre global d'ETPR salariés - Direction/enc.","FAM-SAMSAH / Autres ESSMS",null,{"$f":"IFERROR(IF(VLOOKUP(D1,'Page de garde'!$E$12:$F$155,2,FALSE)=Liste!$A$4,'TPER ESSMS PH Cofin'!$D$12,IF(VLOOKUP(D1,'Page de garde'!$E$12:$F$155,2,FALSE)=Liste!$A$5,'TPER type ESMS PH'!$H$12,)),)+IFERROR(IF(VLOOKUP(D1,Id_CR_SF!$B$7:$F$154,5,FALSE)=Liste!$C$4,'TPER FAM-SAMSAH_SF'!$D$12,IF(VLOOKUP(D1,Id_CR_SF!$B$7:$F$154,5,FALSE)=Liste!$C$5,'TPER Autre ESSMS_SF'!$H$12,)),)","v":{"v":0,"d":"0.00"}}]
["Taux d'encadrement salariés - Direction/enc. (base ETPR)","FAM-SAMSAH / Autres ESSMS",null,{"$f":"IFERROR((D81/D23)*100,\"\")","v":""}]
["Rémunérations globales salariés - Direction/enc.","FAM-SAMSAH / Autres ESSMS",null,{"$f":"IFERROR(IF(VLOOKUP(D1,'Page de garde'!$E$12:$F$155,2,FALSE)=Liste!$A$4,'TPER ESSMS PH Cofin'!$K$12,IF(VLOOKUP(D1,'Page de garde'!$E$12:$F$155,2,FALSE)=Liste!$A$5,'TPER type ESMS PH'!$L$12,)),)+IFERROR(IF(VLOOKUP(D1,Id_CR_SF!$B$7:$F$154,5,FALSE)=Liste!$C$4,'TPER FAM-SAMSAH_SF'!$K$12,IF(VLOOKUP(D1,Id_CR_SF!$B$7:$F$154,5,FALSE)=Liste!$C$5,'TPER Autre ESSMS_SF'!$L$12,)),)","v":{"v":0,"d":"0.00 €"}}]
["Salaire moyen brut chargé salariés - Direction/enc.","FAM-SAMSAH / Autres ESSMS",null,{"$f":"IFERROR(D83/D81,\"\")","v":""}]
["Nombre global d'ETPR salariés - Administration/gestion","FAM-SAMSAH / Autres ESSMS",null,{"$f":"IFERROR(IF(VLOOKUP(D1,'Page de garde'!$E$12:$F$155,2,FALSE)=Liste!$A$4,'TPER ESSMS PH Cofin'!$D$27,IF(VLOOKUP(D1,'Page de garde'!$E$12:$F$155,2,FALSE)=Liste!$A$5,'TPER type ESMS PH'!$H$27,)),)+IFERROR(IF(VLOOKUP(D1,Id_CR_SF!$B$7:$F$154,5,FALSE)=Liste!$C$4,'TPER FAM-SAMSAH_SF'!$D$27,IF(VLOOKUP(D1,Id_CR_SF!$B$7:$F$154,5,FALSE)=Liste!$C$5,'TPER Autre ESSMS_SF'!$H$27,)),)","v":{"v":0,"d":"0.00"}}]
["Taux d'encadrement salariés - Administration/gestion (base ETPR)","FAM-SAMSAH / Autres ESSMS",null,{"$f":"IFERROR((D85/D23)*100,\"\")","v":""}]
["Rémunérations globales salariés - Administration/gestion","FAM-SAMSAH / Autres ESSMS",null,{"$f":"IFERROR(IF(VLOOKUP(D1,'Page de garde'!$E$12:$F$155,2,FALSE)=Liste!$A$4,'TPER ESSMS PH Cofin'!$K$27,IF(VLOOKUP(D1,'Page de garde'!$E$12:$F$155,2,FALSE)=Liste!$A$5,'TPER type ESMS PH'!$L$27,)),)+IFERROR(IF(VLOOKUP(D1,Id_CR_SF!$B$7:$F$154,5,FALSE)=Liste!$C$4,'TPER FAM-SAMSAH_SF'!$K$27,IF(VLOOKUP(D1,Id_CR_SF!$B$7:$F$154,5,FALSE)=Liste!$C$5,'TPER Autre ESSMS_SF'!$L$27,)),)","v":{"v":0,"d":"0.00 €"}}]
["Salaire moyen brut chargé salariés - Administration/gestion","FAM-SAMSAH / Autres ESSMS",null,{"$f":"IFERROR(D87/D85,\"\")","v":""}]
["Nombre global d'ETPR salariés - SG","FAM-SAMSAH / Autres ESSMS",null,{"$f":"IFERROR(IF(VLOOKUP(D1,'Page de garde'!$E$12:$F$155,2,FALSE)=Liste!$A$4,'TPER ESSMS PH Cofin'!$D$32,IF(VLOOKUP(D1,'Page de garde'!$E$12:$F$155,2,FALSE)=Liste!$A$5,'TPER type ESMS PH'!$H$32,)),)+IFERROR(IF(VLOOKUP(D1,Id_CR_SF!$B$7:$F$154,5,FALSE)=Liste!$C$4,'TPER FAM-SAMSAH_SF'!$D$32,IF(VLOOKUP(D1,Id_CR_SF!$B$7:$F$154,5,FALSE)=Liste!$C$5,'TPER Autre ESSMS_SF'!$H$32,)),)","v":{"v":0,"d":"0.00"}}]
["Taux d'encadrement salariés - SG (base ETPR)","FAM-SAMSAH / Autres ESSMS",null,{"$f":"IFERROR((D89/D23)*100,\"\")","v":""}]
["Rémunérations globales salariés - SG","FAM-SAMSAH / Autres ESSMS",null,{"$f":"IFERROR(IF(VLOOKUP(D1,'Page de garde'!$E$12:$F$155,2,FALSE)=Liste!$A$4,'TPER ESSMS PH Cofin'!$K$32,IF(VLOOKUP(D1,'Page de garde'!$E$12:$F$155,2,FALSE)=Liste!$A$5,'TPER type ESMS PH'!$L$32,)),)+IFERROR(IF(VLOOKUP(D1,Id_CR_SF!$B$7:$F$154,5,FALSE)=Liste!$C$4,'TPER FAM-SAMSAH_SF'!$K$32,IF(VLOOKUP(D1,Id_CR_SF!$B$7:$F$154,5,FALSE)=Liste!$C$5,'TPER Autre ESSMS_SF'!$L$32,)),)","v":{"v":0,"d":"0.00 €"}}]
["Salaire moyen brut chargé salariés - SG","FAM-SAMSAH / Autres ESSMS",null,{"$f":"IFERROR(D91/D89,\"\")","v":""}]
["Nombre global d'ETPR salariés - Restauration","FAM-SAMSAH / Autres ESSMS",null,{"$f":"IFERROR(IF(VLOOKUP(D1,'Page de garde'!$E$12:$F$155,2,FALSE)=Liste!$A$4,'TPER ESSMS PH Cofin'!$D$39,IF(VLOOKUP(D1,'Page de garde'!$E$12:$F$155,2,FALSE)=Liste!$A$5,'TPER type ESMS PH'!$H$39,)),)+IFERROR(IF(VLOOKUP(D1,Id_CR_SF!$B$7:$F$154,5,FALSE)=Liste!$C$4,'TPER FAM-SAMSAH_SF'!$D$39,IF(VLOOKUP(D1,Id_CR_SF!$B$7:$F$154,5,FALSE)=Liste!$C$5,'TPER Autre ESSMS_SF'!$H$39,)),)","v":{"v":0,"d":"0.00"}}]
["Taux d'encadrement salariés - Restauration (base ETPR)","FAM-SAMSAH / Autres ESSMS",null,{"$f":"IFERROR((D93/D23)*100,\"\")","v":""}]
["Rémunérations globales salariés - Restauration","FAM-SAMSAH / Autres ESSMS",null,{"$f":"IFERROR(IF(VLOOKUP(D1,'Page de garde'!$E$12:$F$155,2,FALSE)=Liste!$A$4,'TPER ESSMS PH Cofin'!$K$39,IF(VLOOKUP(D1,'Page de garde'!$E$12:$F$155,2,FALSE)=Liste!$A$5,'TPER type ESMS PH'!$L$39,)),)+IFERROR(IF(VLOOKUP(D1,Id_CR_SF!$B$7:$F$154,5,FALSE)=Liste!$C$4,'TPER FAM-SAMSAH_SF'!$K$39,IF(VLOOKUP(D1,Id_CR_SF!$B$7:$F$154,5,FALSE)=Liste!$C$5,'TPER Autre ESSMS_SF'!$L$39,)),)","v":{"v":0,"d":"0.00 €"}}]
["Salaire moyen brut chargé salariés - Restauration","FAM-SAMSAH / Autres ESSMS",null,{"$f":"IFERROR(D95/D93,\"\")","v":""}]
["Nombre global d'ETPR salariés - Enseignement/socio_éduc.","FAM-SAMSAH / Autres ESSMS",null,{"$f":"IFERROR(IF(VLOOKUP(D1,'Page de garde'!$E$12:$F$155,2,FALSE)=Liste!$A$4,'TPER ESSMS PH Cofin'!$D$44,IF(VLOOKUP(D1,'Page de garde'!$E$12:$F$155,2,FALSE)=Liste!$A$5,'TPER type ESMS PH'!$H$44,)),)+IFERROR(IF(VLOOKUP(D1,Id_CR_SF!$B$7:$F$154,5,FALSE)=Liste!$C$4,'TPER FAM-SAMSAH_SF'!$D$44,IF(VLOOKUP(D1,Id_CR_SF!$B$7:$F$154,5,FALSE)=Liste!$C$5,'TPER Autre ESSMS_SF'!$H$44,)),)","v":{"v":0,"d":"0.00"}}]
["Taux d'encadrement salariés - Enseignement/socio_éduc. (base ETPR)","FAM-SAMSAH / Autres ESSMS",null,{"$f":"IFERROR((D97/D23)*100,\"\")","v":""}]
["Rémunérations globales salariés - Enseignement/socio_éduc.","FAM-SAMSAH / Autres ESSMS",null,{"$f":"IFERROR(IF(VLOOKUP(D1,'Page de garde'!$E$12:$F$155,2,FALSE)=Liste!$A$4,'TPER ESSMS PH Cofin'!$K$44,IF(VLOOKUP(D1,'Page de garde'!$E$12:$F$155,2,FALSE)=Liste!$A$5,'TPER type ESMS PH'!$L$44,)),)+IFERROR(IF(VLOOKUP(D1,Id_CR_SF!$B$7:$F$154,5,FALSE)=Liste!$C$4,'TPER FAM-SAMSAH_SF'!$K$44,IF(VLOOKUP(D1,Id_CR_SF!$B$7:$F$154,5,FALSE)=Liste!$C$5,'TPER Autre ESSMS_SF'!$L$44,)),)","v":{"v":0,"d":"0.00 €"}}]
["Salaire moyen brut chargé salariés - Enseignement/socio_éduc.","FAM-SAMSAH / Autres ESSMS",null,{"$f":"IFERROR(D99/D97,\"\")","v":""}]
["Nombre global d'ETPR salariés - Paramédical.","FAM-SAMSAH / Autres ESSMS",null,{"$f":"IFERROR(IF(VLOOKUP(D1,'Page de garde'!$E$12:$F$155,2,FALSE)=Liste!$A$4,'TPER ESSMS PH Cofin'!$D$76,IF(VLOOKUP(D1,'Page de garde'!$E$12:$F$155,2,FALSE)=Liste!$A$5,'TPER type ESMS PH'!$H$76,)),)+IFERROR(IF(VLOOKUP(D1,Id_CR_SF!$B$7:$F$154,5,FALSE)=Liste!$C$4,'TPER FAM-SAMSAH_SF'!$D$76,IF(VLOOKUP(D1,Id_CR_SF!$B$7:$F$154,5,FALSE)=Liste!$C$5,'TPER Autre ESSMS_SF'!$H$76,)),)","v":{"v":0,"d":"0.00"}}]
["Taux d'encadrement salariés - Paramédical. (base ETPR)","FAM-SAMSAH / Autres ESSMS",null,{"$f":"IFERROR((D101/D23)*100,\"\")","v":""}]
["Rémunérations globales salariés - Paramédical.","FAM-SAMSAH / Autres ESSMS",null,{"$f":"IFERROR(IF(VLOOKUP(D1,'Page de garde'!$E$12:$F$155,2,FALSE)=Liste!$A$4,'TPER ESSMS PH Cofin'!$K$76,IF(VLOOKUP(D1,'Page de garde'!$E$12:$F$155,2,FALSE)=Liste!$A$5,'TPER type ESMS PH'!$L$76,)),)+IFERROR(IF(VLOOKUP(D1,Id_CR_SF!$B$7:$F$154,5,FALSE)=Liste!$C$4,'TPER FAM-SAMSAH_SF'!$K$76,IF(VLOOKUP(D1,Id_CR_SF!$B$7:$F$154,5,FALSE)=Liste!$C$5,'TPER Autre ESSMS_SF'!$L$76,)),)","v":{"v":0,"d":"0.00 €"}}]
["Salaire moyen brut chargé salariés - Paramédical.","FAM-SAMSAH / Autres ESSMS",null,{"$f":"IFERROR(D103/D101,\"\")","v":""}]
["Nombre global d'ETPR salariés - Médical","FAM-SAMSAH / Autres ESSMS",null,{"$f":"IFERROR(IF(VLOOKUP(D1,'Page de garde'!$E$12:$F$155,2,FALSE)=Liste!$A$4,'TPER ESSMS PH Cofin'!$D$95,IF(VLOOKUP(D1,'Page de garde'!$E$12:$F$155,2,FALSE)=Liste!$A$5,'TPER type ESMS PH'!$H$95,)),)+IFERROR(IF(VLOOKUP(D1,Id_CR_SF!$B$7:$F$154,5,FALSE)=Liste!$C$4,'TPER FAM-SAMSAH_SF'!$D$95,IF(VLOOKUP(D1,Id_CR_SF!$B$7:$F$154,5,FALSE)=Liste!$C$5,'TPER Autre ESSMS_SF'!$H$95,)),)","v":{"v":0,"d":"0.00"}}]
["Taux d'encadrement salariés - Médical (base ETPR)","FAM-SAMSAH / Autres ESSMS",null,{"$f":"IFERROR((D105/D23)*100,\"\")","v":""}]
["Rémunérations globales salariés - Médical","FAM-SAMSAH / Autres ESSMS",null,{"$f":"IFERROR(IF(VLOOKUP(D1,'Page de garde'!$E$12:$F$155,2,FALSE)=Liste!$A$4,'TPER ESSMS PH Cofin'!$K$95,IF(VLOOKUP(D1,'Page de garde'!$E$12:$F$155,2,FALSE)=Liste!$A$5,'TPER type ESMS PH'!$L$95,)),)+IFERROR(IF(VLOOKUP(D1,Id_CR_SF!$B$7:$F$154,5,FALSE)=Liste!$C$4,'TPER FAM-SAMSAH_SF'!$K$95,IF(VLOOKUP(D1,Id_CR_SF!$B$7:$F$154,5,FALSE)=Liste!$C$5,'TPER Autre ESSMS_SF'!$L$95,)),)","v":{"v":0,"d":"0.00 €"}}]
["Salaire moyen brut chargé salariés - Médical","FAM-SAMSAH / Autres ESSMS",null,{"$f":"IFERROR(D107/D105,\"\")","v":""}]
["Nombre global d'ETPR salariés - Autres fonctions","FAM-SAMSAH / Autres ESSMS",null,{"$f":"IFERROR(IF(VLOOKUP(D1,'Page de garde'!$E$12:$F$155,2,FALSE)=Liste!$A$4,'TPER ESSMS PH Cofin'!$D$104,IF(VLOOKUP(D1,'Page de garde'!$E$12:$F$155,2,FALSE)=Liste!$A$5,'TPER type ESMS PH'!$H$104,)),)+IFERROR(IF(VLOOKUP(D1,Id_CR_SF!$B$7:$F$154,5,FALSE)=Liste!$C$4,'TPER FAM-SAMSAH_SF'!$D$104,IF(VLOOKUP(D1,Id_CR_SF!$B$7:$F$154,5,FALSE)=Liste!$C$5,'TPER Autre ESSMS_SF'!$H$104,)),)","v":{"v":0,"d":"0.00"}}]
["Taux d'encadrement salariés - Autres fonctions (base ETPR)","FAM-SAMSAH / Autres ESSMS",null,{"$f":"IFERROR((D109/D23)*100,\"\")","v":""}]
["Rémunérations globales salariés - Autres fonctions","FAM-SAMSAH / Autres ESSMS",null,{"$f":"IFERROR(IF(VLOOKUP(D1,'Page de garde'!$E$12:$F$155,2,FALSE)=Liste!$A$4,'TPER ESSMS PH Cofin'!$K$104,IF(VLOOKUP(D1,'Page de garde'!$E$12:$F$155,2,FALSE)=Liste!$A$5,'TPER type ESMS PH'!$L$104,)),)+IFERROR(IF(VLOOKUP(D1,Id_CR_SF!$B$7:$F$154,5,FALSE)=Liste!$C$4,'TPER FAM-SAMSAH_SF'!$K$104,IF(VLOOKUP(D1,Id_CR_SF!$B$7:$F$154,5,FALSE)=Liste!$C$5,'TPER Autre ESSMS_SF'!$L$104,)),)","v":{"v":0,"d":"0.00 €"}}]
["Salaire moyen brut chargé salariés - Autres fonctions","FAM-SAMSAH / Autres ESSMS",null,{"$f":"IFERROR(D111/D109,\"\")","v":""}]
[]
["(*) Hors EHPAD relevant de l'expérimentation du forfait global unique"]

{"sheet":"Charges soc. fisc._SF","index":6,"n_rows":62,"n_cols":9,"rows_kept":62,"hidden":true,"merged":[[1,1,1,4],[2,1,2,4],[3,1,3,4],[5,1,5,8],[7,1,7,5],[17,4,17,5],[24,4,24,5]]}
[]
[null,"Dénomination du CRP sans FINESS"]
[null,"N° Identifiant : "]
[null,"FINESS de rattachement : "]
[]
[null,"Charges de l'employeur sur rémunérations au titre de l'année N (Personnel figurant au tableau des effectifs)"]
[]
[null,"Comptes / intitulés (*)",{"$nulls":4},"Assiette","Taux","Montant"]
[null,63,"Impôts, taxes et versements assimilés",{"$nulls":5},{"$f":"I10+I19","v":{"v":0,"d":"0.00 €"}}]
[null,null,631," Impôts, taxes et versements assimilés sur rémunérations (administration des impôts)",{"$nulls":4},{"$f":"I11+SUM(I16:I17)","v":{"v":0,"d":"0.00 €"}}]
[{"$nulls":3},6311,"Taxe sur les salaires",null,{"$f":"G12","v":{"v":0,"d":"0.00 €"}},{"$f":"IF(G11=0,0,I11/G11)","v":{"v":0,"d":"0.00%"}}]
[{"$nulls":4},"Taux normal"]
[{"$nulls":4},"1er taux majoré"]
[{"$nulls":4},"2ème taux majoré"]
[{"$nulls":4},"3ème taux majoré"]
[{"$nulls":3},6312,"Taxe d'apprentissage"]
[{"$nulls":3},6318,"Autres impôts, taxes et versements assimilés sur rémunérations"]
[]
[null,null,633," Impôts, taxes et versements assimilés sur rémunérations (autres organismes)",{"$nulls":4},{"$f":"SUM(I20:I23)","v":{"v":0,"d":"0.00 €"}}]
[{"$nulls":3},6331,"Versement transport"]
[{"$nulls":3},6332,"Allocation logement"]
[{"$nulls":3},6333,"Participation des employeurs à la formation professionnelle continue"]
[{"$nulls":3},6338,"Autres impôts, taxes et versements assimilés sur rémunérations"]
[]
[]
[null,645,"Charges de sécurité sociale et de prévoyance",{"$nulls":5},{"$f":"I27+I37-I47","v":{"v":0,"d":"0.00 €"}}]
[null,null,6451,"Personnel non médical",null,null,{"$f":"G29","v":{"v":0,"d":"0.00 €"}},{"$f":"IF(G27=0,0,I27/G27)","v":{"v":0,"d":"0.00%"}},{"$f":"I28+SUM(I32:I36)","v":{"v":0,"d":"0.00 €"}}]
[{"$nulls":3},64511,"Cotisations à l'URSSAF",null,{"$f":"G29","v":{"v":0,"d":"0.00 €"}},{"$f":"IF(G28=0,0,I28/G28)","v":{"v":0,"d":"0.00%"}},{"$f":"SUM(I29:I31)","v":{"v":0,"d":"0.00 €"}}]
[{"$nulls":4},"Sur totalité des salaires"]
[{"$nulls":4},"Sur salaires plafonnés (tranche A)"]
[{"$nulls":4},"URSSAF prévoyance"]
[{"$nulls":3},64512,"Cotisations aux mutuelles"]
[{"$nulls":3},64513,"Cotisations aux caisses de retraite"]
[{"$nulls":3},64514,"Cotisations à l'ASSEDIC"]
[{"$nulls":3},64515,"Cotisations à la CNRACL (établissements publics)"]
[{"$nulls":3},64518,"Cotisations aux autres organismes sociaux (à préciser)"]
[null,null,6452,"Personnel médical",null,null,{"$f":"G39","v":{"v":0,"d":"0.00 €"}},{"$f":"IF(G37=0,0,I37/G37)","v":{"v":0,"d":"0.00%"}},{"$f":"I38+SUM(I42:I46)","v":{"v":0,"d":"0.00 €"}}]
[{"$nulls":3},64521,"Cotisations à l'URSSAF",null,{"$f":"G39","v":{"v":0,"d":"0.00 €"}},{"$f":"IF(G38=0,0,I38/G38)","v":{"v":0,"d":"0.00%"}},{"$f":"SUM(I39:I41)","v":{"v":0,"d":"0.00 €"}}]
[{"$nulls":4},"Sur totalité des salaires"]
[{"$nulls":4},"Sur salaires plafonnés (tranche A)"]
[{"$nulls":4},"URSSAF prévoyance"]
[{"$nulls":3},64522,"Cotisations aux mutuelles"]
[{"$nulls":3},64523,"Cotisations aux caisses de retraite"]
[{"$nulls":3},64524,"Cotisations à l'ASSEDIC"]
[{"$nulls":3},64525,"Cotisations à la CNRACL (établissements publics)"]
[{"$nulls":3},64528,"Cotisations aux autres organismes sociaux (à préciser)"]
[null,null,6459,"Remboursements sur charges de sécurité sociale et de prévoyance"]
[null,647,"Autres charges sociales",{"$nulls":5},{"$f":"SUM(I49:I54)-I60","v":{"v":0,"d":"0.00 €"}}]
[{"$nulls":3},6471,"Prestations versées pour le compte du FNAL"]
[{"$nulls":3},6472,"Fonds de solidarité"]
[{"$nulls":3},6473,"Allocations de chômage"]
[{"$nulls":3},6474,"Fonds d'insertion des personnes handicapées"]
[{"$nulls":3},6475,"Médecine du travail"]
[{"$nulls":3},6478,"Divers",{"$nulls":3},{"$f":"SUM(I55:I57)+I59","v":{"v":0,"d":"0.00 €"}}]
[{"$nulls":4},64781,"Cartes de transport"]
[{"$nulls":4},64783,"Comité d'hygiène et de sécurité"]
[{"$nulls":4},64784,"Œuvres sociales"]
[{"$nulls":5},"Dont fonctionnement"]
[{"$nulls":4},64788,"Autres (à préciser)"]
[{"$nulls":3},6479,"Remboursements sur autres charges sociales"]
[null,"  Allègements sur charges sociales et fiscales"]
[null,"(*) A compléter si nécessaire"]

{"sheet":"TPER type ESMS PH","index":7,"n_rows":207,"n_cols":15,"rows_kept":207,"hidden":true,"merged":[[1,3,1,5],[2,3,2,5],[4,1,4,12],[7,3,7,9],[7,10,7,12],[8,1,9,1],[8,3,9,3],[8,4,8,5],[8,6,8,7],[8,8,9,8],[8,9,9,9],[108,7,109,7],[108,8,109,8],[108,10,109,10],[108,11,109,11],[111,3,111,4],[111,5,111,6],[111,7,111,8],[111,9,111,10],[113,3,113,4],[113,5,113,6],[113,7,113,8],[113,9,113,10],[114,3,114,4],[114,5,114,6],[114,7,114,8],[114,9,114,10],[115,3,115,4],[115,5,115,6],[115,7,115,8],[115,9,115,10],[116,3,116,4],[116,5,116,6],[116,7,116,8],[116,9,116,10],[117,3,117,4],[117,5,117,6],[117,7,117,8],[117,9,117,10],[118,3,118,4],[118,5,118,6],[118,7,118,8],[118,9,118,10],[119,3,119,4],[119,5,119,6],[119,7,119,8],[119,9,119,10],[120,3,120,4],[120,5,120,6],[120,7,120,8],[120,9,120,10],[121,3,121,4],[121,5,121,6],[121,7,121,8],[121,9,121,10],[122,3,122,4],[122,5,122,6],[122,7,122,8],[122,9,122,10],[123,3,123,4],[123,5,123,6],[123,7,123,8],[123,9,123,10],[124,3,124,4],[124,5,124,6],[124,7,124,8],[124,9,124,10],[125,3,125,4],[125,5,125,6],[125,7,125,8],[125,9,125,10],[126,3,126,4],[126,5,126,6],[126,7,126,8],[126,9,126,10],[127,3,127,4],[127,5,127,6],[127,7,127,8],[127,9,127,10],[128,3,128,4],[128,5,128,6],[128,7,128,8],[128,9,128,10],[129,3,129,4],[129,5,129,6],[129,7,129,8],[129,9,129,10],[130,3,130,4],[130,5,130,6],[130,7,130,8],[130,9,130,10],[131,3,131,4],[131,5,131,6],[131,7,131,8],[131,9,131,10],[132,3,132,4],[132,5,132,6],[132,7,132,8],[132,9,132,10],[133,3,133,4],[133,5,133,6],[133,7,133,8],[133,9,133,10],[134,3,134,4],[134,5,134,6],[134,7,134,8],[134,9,134,10],[135,3,135,4],[135,5,135,6],[135,7,135,8],[135,9,135,10],[136,3,136,4],[136,5,136,6],[136,7,136,8],[136,9,136,10],[137,3,137,4],[137,5,137,6],[137,7,137,8],[137,9,137,10],[138,3,138,4],[138,5,138,6],[138,7,138,8],[138,9,138,10],[139,3,139,4],[139,5,139,6],[139,7,139,8],[139,9,139,10],[140,3,140,4],[140,5,140,6],[140,7,140,8],[140,9,140,10],[141,3,141,4],[141,5,141,6],[141,7,141,8],[141,9,141,10],[142,3,142,4],[142,5,142,6],[142,7,142,8],[142,9,142,10],[143,3,143,4],[143,5,143,6],[143,7,143,8],[143,9,143,10],[144,3,144,4],[144,5,144,6],[144,7,144,8],[144,9,144,10],[145,3,145,4],[145,5,145,6],[145,7,145,8],[145,9,145,10],[146,3,146,4],[146,5,146,6],[146,7,146,8],[146,9,146,10],[147,3,147,4],[147,5,147,6],[147,7,147,8],[147,9,147,10],[148,3,148,4],[148,5,148,6],[148,7,148,8],[148,9,148,10],[149,3,149,4],[149,5,149,6],[149,7,149,8],[149,9,149,10],[150,3,150,4],[150,5,150,6],[150,7,150,8],[150,9,150,10],[151,3,151,4],[151,5,151,6],[151,7,151,8],[151,9,151,10],[152,3,152,4],[152,5,152,6],[152,7,152,8],[152,9,152,10],[153,3,153,4],[153,5,153,6],[153,7,153,8],[153,9,153,10],[154,3,154,4],[154,5,154,6],[154,7,154,8],[154,9,154,10],[155,3,155,4],[155,5,155,6],[155,7,155,8],[155,9,155,10],[156,3,156,4],[156,5,156,6],[156,7,156,8],[156,9,156,10],[157,3,157,4],[157,5,157,6],[157,7,157,8],[157,9,157,10],[158,3,158,4],[158,5,158,6],[158,7,158,8],[158,9,158,10],[159,3,159,4],[159,5,159,6],[159,7,159,8],[159,9,159,10],[160,3,160,4],[160,5,160,6],[160,7,160,8],[160,9,160,10],[161,3,161,4],[161,5,161,6],[161,7,161,8],[161,9,161,10],[162,3,162,4],[162,5,162,6],[162,7,162,8],[162,9,162,10],[163,3,163,4],[163,5,163,6],[163,7,163,8],[163,9,163,10],[164,3,164,4],[164,5,164,6],[164,7,164,8],[164,9,164,10],[165,3,165,4],[165,5,165,6],[165,7,165,8],[165,9,165,10],[166,3,166,4],[166,5,166,6],[166,7,166,8],[166,9,166,10],[167,3,167,4],[167,5,167,6],[167,7,167,8],[167,9,167,10],[168,3,168,4],[168,5,168,6],[168,7,168,8],[168,9,168,10],[169,3,169,4],[169,5,169,6],[169,7,169,8],[169,9,169,10],[170,3,170,4],[170,5,170,6],[170,7,170,8],[170,9,170,10],[171,3,171,4],[171,5,171,6],[171,7,171,8],[171,9,171,10],[172,3,172,4],[172,5,172,6],[172,7,172,8],[172,9,172,10],[173,3,173,4],[173,5,173,6],[173,7,173,8],[173,9,173,10],[174,3,174,4],[174,5,174,6],[174,7,174,8],[174,9,174,10],[175,3,175,4],[175,5,175,6],[175,7,175,8],[175,9,175,10],[176,3,176,4],[176,5,176,6],[176,7,176,8],[176,9,176,10],[177,3,177,4],[177,5,177,6],[177,7,177,8],[177,9,177,10],[178,3,178,4],[178,5,178,6],[178,7,178,8],[178,9,178,10],[179,3,179,4],[179,5,179,6],[179,7,179,8],[179,9,179,10],[180,3,180,4],[180,5,180,6],[180,7,180,8],[180,9,180,10],[181,3,181,4],[181,5,181,6],[181,7,181,8],[181,9,181,10],[182,3,182,4],[182,5,182,6],[182,7,182,8],[182,9,182,10],[183,3,183,4],[183,5,183,6],[183,7,183,8],[183,9,183,10],[184,3,184,4],[184,5,184,6],[184,7,184,8],[184,9,184,10],[185,3,185,4],[185,5,185,6],[185,7,185,8],[185,9,185,10],[186,3,186,4],[186,5,186,6],[186,7,186,8],[186,9,186,10],[187,3,187,4],[187,5,187,6],[187,7,187,8],[187,9,187,10],[188,3,188,4],[188,5,188,6],[188,7,188,8],[188,9,188,10],[189,3,189,4],[189,5,189,6],[189,7,189,8],[189,9,189,10],[190,3,190,4],[190,5,190,6],[190,7,190,8],[190,9,190,10],[191,3,191,4],[191,5,191,6],[191,7,191,8],[191,9,191,10],[192,3,192,4],[192,5,192,6],[192,7,192,8],[192,9,192,10],[193,3,193,4],[193,5,193,6],[193,7,193,8],[193,9,193,10],[194,3,194,4],[194,5,194,6],[194,7,194,8],[194,9,194,10],[195,3,195,4],[195,5,195,6],[195,7,195,8],[195,9,195,10],[196,3,196,4],[196,5,196,6],[196,7,196,8],[196,9,196,10],[197,3,197,4],[197,5,197,6],[197,7,197,8],[197,9,197,10],[198,3,198,4],[198,5,198,6],[198,7,198,8],[198,9,198,10],[199,3,199,4],[199,5,199,6],[199,7,199,8],[199,9,199,10],[200,3,200,4],[200,5,200,6],[200,7,200,8],[200,9,200,10],[201,3,201,4],[201,5,201,6],[201,7,201,8],[201,9,201,10],[202,3,202,4],[202,5,202,6],[202,7,202,8],[202,9,202,10],[203,3,203,4],[203,5,203,6],[203,7,203,8],[203,9,203,10],[204,3,204,4],[204,5,204,6],[204,7,204,8],[204,9,204,10],[205,3,205,4],[205,5,205,6],[205,7,205,8],[205,9,205,10],[206,3,206,4],[206,5,206,6],[206,7,206,8],[206,9,206,10]]}
[]
[null,"Raison sociale :"]
[null,"FINESS ET :"]
[]
[null,"Annexe 6C : Tableau prévisionnel des effectifs rémunérés (y compris personnel de remplacement)"]
[]
[null,"Tableau des effectifs"]
[{"$nulls":3},"Tableau des effectifs",{"$nulls":6},"Rémunérations brutes + charges sociales et fiscales"]
[null,"Catégorie / emplois",null,"Nombre d'agents à temps plein\n(1)","Temps partiel",null,"Total",null,{"$f":" IF('Page de garde'!$D$4=\"\",\"Nombre d'ETP N-1 (*)\n(6)\",\"Nombre d'ETP \"&CREFEFIDEN___ANNEEREF___ANN0\\_________-1&\" (*)\n(6)\")","v":"Nombre d'ETP N-1 (*)\n(6)"},"Ecart\n(7) = (5)-(6)",{"$f":"IF(CREFEFIDEN___ANNEEREF___ANN0\\_________=\"\",\"N-1\",CREFEFIDEN___ANNEEREF___ANN0\\_________-1)","v":"N-1"},{"$f":"IF(CREFEFIDEN___ANNEEREF___ANN0\\_________=\"\",\"N\",CREFEFIDEN___ANNEEREF___ANN0\\_________)","v":"N"},"Ecart"]
[{"$nulls":4},"Nombre d'agents \n(2)","Nombre d'ETP\n(3)","Nombre d'agents \n(4) = (1)+(2)","Nombre d'ETP\n(5) = (1)+(3)",null,null,"(8)","(9)","(10)=(9)-(8)"]
[]
[null,"DIRECTION / ENCADREMENT",null,{"$f":"SUM(D14:D26)","v":0},{"$f":"SUM(E14:E26)","v":0},{"$f":"SUM(F14:F26)","v":{"v":0,"d":"0.00"}},{"$f":"D12+E12","v":0},{"$f":"F12+D12","v":{"v":0,"d":"0.00"}},{"$f":"SUM(I14:I26)","v":{"v":0,"d":"0.00"}},{"$f":"H12-I12","v":{"v":0,"d":"0.00"}},{"$f":"SUM(K14:K26)","v":{"v":0,"d":"0.00 €"}},{"$f":"SUM(L14:L26)","v":{"v":0,"d":"0.00 €"}},{"$f":"L12-K12","v":{"v":0,"d":"0.00 €"}}]
[null,"Dont emplois temporaires",{"$nulls":4},0,{"v":0,"d":"0.00"},null,{"v":0,"d":"0.00"},null,null,{"v":0,"d":"0.00 €"},null,{"$f":"IF(AND(H13<>0,OR(L13=0,L13=\"\")),\"Saisie incohérente : ETP sans rémunération correspondante\",IF(AND(L13<>0,OR(H13=0,H13=\"\")),\"Saisie incohérente : rémunération sans ETP correspondant\",\"\"))","v":""}]
[null,"Directeur",{"$nulls":4},0,{"v":0,"d":"0.00"},null,{"v":0,"d":"0.00"},null,null,{"v":0,"d":"0.00 €"},null,{"$f":"IF(AND(H14<>0,OR(L14=0,L14=\"\")),\"Saisie incohérente : ETP sans rémunération correspondante\",IF(AND(L14<>0,OR(H14=0,H14=\"\")),\"Saisie incohérente : rémunération sans ETP correspondant\",\"\"))","v":""}]
[null,"Médecin directeur",{"$nulls":4},0,{"v":0,"d":"0.00"},null,{"v":0,"d":"0.00"},null,null,{"v":0,"d":"0.00 €"},null,{"$f":"IF(AND(H15<>0,OR(L15=0,L15=\"\")),\"Saisie incohérente : ETP sans rémunération correspondante\",IF(AND(L15<>0,OR(H15=0,H15=\"\")),\"Saisie incohérente : rémunération sans ETP correspondant\",\"\"))","v":""}]
[null,"Directeur-adjoint",{"$nulls":4},0,{"v":0,"d":"0.00"},null,{"v":0,"d":"0.00"},null,null,{"v":0,"d":"0.00 €"},null,""]
[null,"Chef de service éducatif, pédagogique et social, paramédical",{"$nulls":4},0,{"v":0,"d":"0.00"},null,{"v":0,"d":"0.00"},null,null,{"v":0,"d":"0.00 €"},null,""]
[null,"Chef de service autre (administratif, etc.)",{"$nulls":4},0,{"v":0,"d":"0.00"},null,{"v":0,"d":"0.00"},null,null,{"v":0,"d":"0.00 €"},null,""]
[null,"Chef d'atelier",{"$nulls":4},0,{"v":0,"d":"0.00"},null,{"v":0,"d":"0.00"},null,null,{"v":0,"d":"0.00 €"},null,""]
[null,"Attaché de direction, économe",{"$nulls":4},0,{"v":0,"d":"0.00"},null,{"v":0,"d":"0.00"},null,null,{"v":0,"d":"0.00 €"},null,""]
[null,"Cadre de santé de la filière infirmière",{"$nulls":4},0,{"v":0,"d":"0.00"},null,{"v":0,"d":"0.00"},null,null,{"v":0,"d":"0.00 €"},null,""]
[null,"Cadre de service paramédical, cadre de la filière de rééducation, autre cadre de santé",{"$nulls":4},0,{"v":0,"d":"0.00"},null,{"v":0,"d":"0.00"},null,null,{"v":0,"d":"0.00 €"},null,""]
[null,"Cadre de service éducatif et social",{"$nulls":4},0,{"v":0,"d":"0.00"},null,{"v":0,"d":"0.00"},null,null,{"v":0,"d":"0.00 €"},null,""]
[null,"Responsable et coordonnateur de secteur",{"$nulls":4},0,{"v":0,"d":"0.00"},null,{"v":0,"d":"0.00"},null,null,{"v":0,"d":"0.00 €"},null,""]
[null,"Autres cadres (direction)",{"$nulls":4},0,{"v":0,"d":"0.00"},null,{"v":0,"d":"0.00"},null,null,{"v":0,"d":"0.00 €"},null,""]
[null,"Autres cadres (encadrement de proximité)",{"$nulls":4},0,{"v":0,"d":"0.00"},null,{"v":0,"d":"0.00"},null,null,{"v":0,"d":"0.00 €"},null,""]
[null,"ADMINISTRATION / GESTION",null,{"$f":"SUM(D29:D31)","v":0},{"$f":"SUM(E29:E31)","v":0},{"$f":"SUM(F29:F31)","v":{"v":0,"d":"0.00"}},0,{"v":0,"d":"0.00"},{"$f":"SUM(I29:I31)","v":{"v":0,"d":"0.00"}},{"v":0,"d":"0.00"},{"$f":"SUM(K29:K31)","v":{"v":0,"d":"0.00"}},{"$f":"SUM(L29:L31)","v":{"v":0,"d":"0.00"}},{"v":0,"d":"0.00 €"}]
[null,"Dont emplois temporaires",{"$nulls":4},0,{"v":0,"d":"0.00"},null,{"v":0,"d":"0.00"},null,null,{"v":0,"d":"0.00 €"},null,""]
[null,"Agent administratif",{"$nulls":4},0,{"v":0,"d":"0.00"},null,{"v":0,"d":"0.00"},null,null,{"v":0,"d":"0.00 €"},null,""]
[null,"Comptable",{"$nulls":4},0,{"v":0,"d":"0.00"},null,{"v":0,"d":"0.00"},null,null,{"v":0,"d":"0.00 €"},null,""]
[null,"Autre personnel administratif et de gestion",{"$nulls":4},0,{"v":0,"d":"0.00"},null,{"v":0,"d":"0.00"},null,null,{"v":0,"d":"0.00 €"},null,""]
[null,"SERVICES GENERAUX",null,{"$f":"SUM(D34:D38)","v":0},{"$f":"SUM(E34:E38)","v":0},{"$f":"SUM(F34:F38)","v":{"v":0,"d":"0.00"}},0,{"v":0,"d":"0.00"},{"$f":"SUM(I34:I38)","v":{"v":0,"d":"0.00"}},{"v":0,"d":"0.00"},{"$f":"SUM(K34:K38)","v":{"v":0,"d":"0.00 €"}},{"$f":"SUM(L34:L38)","v":{"v":0,"d":"0.00 €"}},{"v":0,"d":"0.00 €"}]
[null,"Dont emplois temporaires",{"$nulls":4},0,{"v":0,"d":"0.00"},null,{"v":0,"d":"0.00"},null,null,{"v":0,"d":"0.00 €"},null,""]
[null,"Agent de service général",{"$nulls":4},0,{"v":0,"d":"0.00"},null,{"v":0,"d":"0.00"},null,null,{"v":0,"d":"0.00 €"},null,""]
[null,"Maitre de maison (hors encadrant éducatif de nuit)",{"$nulls":4},0,{"v":0,"d":"0.00"},null,{"v":0,"d":"0.00"},null,null,{"v":0,"d":"0.00 €"},null,""]
[null,"Ouvrier qualifié",{"$nulls":4},0,{"v":0,"d":"0.00"},null,{"v":0,"d":"0.00"},null,null,{"v":0,"d":"0.00 €"},null,""]
[null,"Veilleur de nuit occupant à titre principal des fonctions d'accompagnement socio-éducatif (hors encadrant éducatif de nuit)",{"$nulls":4},0,{"v":0,"d":"0.00"},null,{"v":0,"d":"0.00"},null,null,{"v":0,"d":"0.00 €"},null,""]
[null,"Autre personnel services généraux",{"$nulls":4},0,{"v":0,"d":"0.00"},null,{"v":0,"d":"0.00"},null,null,{"v":0,"d":"0.00 €"},null,""]
[null,"RESTAURATION",null,{"$f":"SUM(D41:D43)","v":0},{"$f":"SUM(E41:E43)","v":0},{"$f":"SUM(F41:F43)","v":{"v":0,"d":"0.00"}},0,{"v":0,"d":"0.00"},{"$f":"SUM(I41:I43)","v":{"v":0,"d":"0.00"}},{"v":0,"d":"0.00"},{"$f":"SUM(K41:K43)","v":{"v":0,"d":"0.00 €"}},{"$f":"SUM(L41:L43)","v":{"v":0,"d":"0.00 €"}},{"v":0,"d":"0.00 €"}]
[null,"Dont emplois temporaires",{"$nulls":4},0,{"v":0,"d":"0.00"},null,{"v":0,"d":"0.00"},null,null,{"v":0,"d":"0.00 €"},null,""]
[null,"Chef cuisinier",{"$nulls":4},0,{"v":0,"d":"0.00"},null,{"v":0,"d":"0.00"},null,null,{"v":0,"d":"0.00 €"},null,""]
[null,"Cuisinier",{"$nulls":4},0,{"v":0,"d":"0.00"},null,{"v":0,"d":"0.00"},null,null,{"v":0,"d":"0.00 €"},null,""]
[null,"Autre personnel de restauration",{"$nulls":4},0,{"v":0,"d":"0.00"},null,{"v":0,"d":"0.00"},null,null,{"v":0,"d":"0.00 €"},null,""]
[null,"ENSEIGNEMENT ET SOCIO-EDUCATIF",null,{"$f":"SUM(D46:D51)+D53+SUM(D55:D75)","v":0},{"$f":"SUM(E46:E51)+E53+SUM(E55:E75)","v":0},{"$f":"SUM(F46:F51)+F53+SUM(F55:F75)","v":{"v":0,"d":"0.00"}},{"$f":"D44+E44","v":0},{"$f":"F44+D44","v":{"v":0,"d":"0.00"}},{"$f":"SUM(I46:I51)+I53+SUM(I55:I75)","v":{"v":0,"d":"0.00"}},{"$f":"H44-I44","v":{"v":0,"d":"0.00"}},{"$f":"SUM(K46:K51)+K53+SUM(K55:K75)","v":{"v":0,"d":"0.00 €"}},{"$f":"SUM(L46:L51)+L53+SUM(L55:L75)","v":{"v":0,"d":"0.00 €"}},{"$f":"L44-K44","v":{"v":0,"d":"0.00 €"}}]
[null,"Dont emplois temporaires",{"$nulls":4},0,{"v":0,"d":"0.00"},null,{"v":0,"d":"0.00"},null,null,{"v":0,"d":"0.00 €"},null,""]
[null,"Enseignant (enseignement primaire)",{"$nulls":4},0,{"v":0,"d":"0.00"},null,{"v":0,"d":"0.00"},null,null,{"v":0,"d":"0.00 €"},null,""]
[null,"Enseignant (enseignement secondaire)",{"$nulls":4},0,{"v":0,"d":"0.00"},null,{"v":0,"d":"0.00"},null,null,{"v":0,"d":"0.00 €"},null,""]
[null,"Enseignant (enseignement supérieur)",{"$nulls":4},0,{"v":0,"d":"0.00"},null,{"v":0,"d":"0.00"},null,null,{"v":0,"d":"0.00 €"},null,""]
[null,"Professeur EPS",{"$nulls":4},0,{"v":0,"d":"0.00"},null,{"v":0,"d":"0.00"},null,null,{"v":0,"d":"0.00 €"},null,""]
[null,"Moniteur EPS",{"$nulls":4},0,{"v":0,"d":"0.00"},null,{"v":0,"d":"0.00"},null,null,{"v":0,"d":"0.00 €"},null,""]
[null,"Accompagnant éducatif et social",{"$nulls":4},0,{"v":0,"d":"0.00"},null,{"v":0,"d":"0.00"},null,null,{"v":0,"d":"0.00 €"},null,""]
[null,"Dont contrats aidés, contrats d'apprentissage et de professionnalisation",{"$nulls":4},0,{"v":0,"d":"0.00"},null,{"v":0,"d":"0.00"},null,null,{"v":0,"d":"0.00 €"},null,""]
[null,"Aide médico-psychologique",{"$nulls":4},0,{"v":0,"d":"0.00"},null,{"v":0,"d":"0.00"},null,null,{"v":0,"d":"0.00 €"},null,""]
[null,"Dont contrats aidés, contrats d'apprentissage et de professionnalisation",{"$nulls":4},0,{"v":0,"d":"0.00"},null,{"v":0,"d":"0.00"},null,null,{"v":0,"d":"0.00 €"},null,""]
[null,"Animateur social",{"$nulls":4},0,{"v":0,"d":"0.00"},null,{"v":0,"d":"0.00"},null,null,{"v":0,"d":"0.00 €"},null,""]
[null,"Assistant de service social/assistant social spécialisé",{"$nulls":4},0,{"v":0,"d":"0.00"},null,{"v":0,"d":"0.00"},null,null,{"v":0,"d":"0.00 €"},null,""]
[null,"Assistant maternel",{"$nulls":4},0,{"v":0,"d":"0.00"},null,{"v":0,"d":"0.00"},null,null,{"v":0,"d":"0.00 €"},null,""]
[null,"Auxiliaire de vie sociale",{"$nulls":4},0,{"v":0,"d":"0.00"},null,{"v":0,"d":"0.00"},null,null,{"v":0,"d":"0.00 €"},null,""]
[null,"Conseiller en économie sociale et familiale",{"$nulls":4},0,{"v":0,"d":"0.00"},null,{"v":0,"d":"0.00"},null,null,{"v":0,"d":"0.00 €"},null,""]
[null,"Educateur jeunes enfants",{"$nulls":4},0,{"v":0,"d":"0.00"},null,{"v":0,"d":"0.00"},null,null,{"v":0,"d":"0.00 €"},null,""]
[null,"Educateur technique ou spécialisé",{"$nulls":4},0,{"v":0,"d":"0.00"},null,{"v":0,"d":"0.00"},null,null,{"v":0,"d":"0.00 €"},null,""]
[null,"Encadrant éducatif de nuit",{"$nulls":4},0,{"v":0,"d":"0.00"},null,{"v":0,"d":"0.00"},null,null,{"v":0,"d":"0.00 €"},null,""]
[null,"Mandataire judiciaire ou délégué aux prestations sociales",{"$nulls":4},0,{"v":0,"d":"0.00"},null,{"v":0,"d":"0.00"},null,null,{"v":0,"d":"0.00 €"},null,""]
[null,"Moniteur d'atelier",{"$nulls":4},0,{"v":0,"d":"0.00"},null,{"v":0,"d":"0.00"},null,null,{"v":0,"d":"0.00 €"},null,""]
[null,"Moniteur éducateur",{"$nulls":4},0,{"v":0,"d":"0.00"},null,{"v":0,"d":"0.00"},null,null,{"v":0,"d":"0.00 €"},null,""]
[null,"Moniteur enseignement ménager",{"$nulls":4},0,{"v":0,"d":"0.00"},null,{"v":0,"d":"0.00"},null,null,{"v":0,"d":"0.00 €"},null,""]
[null,"Moniteur jardin d'enfants",{"$nulls":4},0,{"v":0,"d":"0.00"},null,{"v":0,"d":"0.00"},null,null,{"v":0,"d":"0.00 €"},null,""]
[null,"Personnel d'aide à domicile",{"$nulls":4},0,{"v":0,"d":"0.00"},null,{"v":0,"d":"0.00"},null,null,{"v":0,"d":"0.00 €"},null,""]
[null,"Psychologue/neuropsychologue",{"$nulls":4},0,{"v":0,"d":"0.00"},null,{"v":0,"d":"0.00"},null,null,{"v":0,"d":"0.00 €"},null,""]
[null,"Responsable ou encadrant technique d'atelier",{"$nulls":4},0,{"v":0,"d":"0.00"},null,{"v":0,"d":"0.00"},null,null,{"v":0,"d":"0.00 €"},null,""]
[null,"Technicien de l'intervention sociale et familiale",{"$nulls":4},0,{"v":0,"d":"0.00"},null,{"v":0,"d":"0.00"},null,null,{"v":0,"d":"0.00 €"},null,""]
[null,"Technicien en compensation sensorielle",{"$nulls":4},0,{"v":0,"d":"0.00"},null,{"v":0,"d":"0.00"},null,null,{"v":0,"d":"0.00 €"},null,""]
[null,"Travailleur familial",{"$nulls":4},0,{"v":0,"d":"0.00"},null,{"v":0,"d":"0.00"},null,null,{"v":0,"d":"0.00 €"},null,""]
[null,"Autre personnel socio-éducatif",{"$nulls":4},0,{"v":0,"d":"0.00"},null,{"v":0,"d":"0.00"},null,null,{"v":0,"d":"0.00 €"},null,""]
[null,"Personnel socio-éducatif en cours de formation",{"$nulls":4},0,{"v":0,"d":"0.00"},null,{"v":0,"d":"0.00"},null,null,{"v":0,"d":"0.00 €"},null,""]
[null,"PARAMEDICAL",null,{"$f":"SUM(D79:D94)","v":0},{"$f":"SUM(E79:E94)","v":0},{"$f":"SUM(F79:F94)","v":{"v":0,"d":"0.00"}},{"$f":"D76+E76","v":0},{"$f":"F76+D76","v":{"v":0,"d":"0.00"}},{"$f":"SUM(I79:I94)","v":{"v":0,"d":"0.00"}},{"$f":"H76-I76","v":{"v":0,"d":"0.00"}},{"$f":"SUM(K79:K94)","v":{"v":0,"d":"0.00 €"}},{"$f":"SUM(L79:L94)","v":{"v":0,"d":"0.00 €"}},{"$f":"L76-K76","v":{"v":0,"d":"0.00 €"}}]
[null,"Dont emplois temporaires",{"$nulls":4},0,{"v":0,"d":"0.00"},null,{"v":0,"d":"0.00"},null,null,{"v":0,"d":"0.00 €"},null,""]
[null,"Dont contrats aidés, contrats d'apprentissage et de professionnalisation",{"$nulls":4},0,{"v":0,"d":"0.00"},null,{"v":0,"d":"0.00"},null,null,{"v":0,"d":"0.00 €"},null,{"$f":"IF(AND(H78<>0,OR(L78=0,L78=\"\")),\"Saisie incohérente : ETP sans rémunération correspondante\",IF(AND(L78<>0,OR(H78=0,H78=\"\")),\"Saisie incohérente : rémunération sans ETP correspondant\",\"\"))","v":""}]
[null,"Aide soignant",{"$nulls":4},0,{"v":0,"d":"0.00"},null,{"v":0,"d":"0.00"},null,null,{"v":0,"d":"0.00 €"},null,""]
[null,"Audioprothésiste",{"$nulls":4},0,{"v":0,"d":"0.00"},null,{"v":0,"d":"0.00"},null,null,{"v":0,"d":"0.00 €"},null,""]
[null,"Diététicien",{"$nulls":4},0,{"v":0,"d":"0.00"},null,{"v":0,"d":"0.00"},null,null,{"v":0,"d":"0.00 €"},null,""]
[null,"Ergothérapeute",{"$nulls":4},0,{"v":0,"d":"0.00"},null,{"v":0,"d":"0.00"},null,null,{"v":0,"d":"0.00 €"},null,""]
[null,"Infirmier D.E.",{"$nulls":4},0,{"v":0,"d":"0.00"},null,{"v":0,"d":"0.00"},null,null,{"v":0,"d":"0.00 €"},null,""]
[null,"Infirmier psychiatrique",{"$nulls":4},0,{"v":0,"d":"0.00"},null,{"v":0,"d":"0.00"},null,null,{"v":0,"d":"0.00 €"},null,""]
[null,"Masseur-kinésithérapeute",{"$nulls":4},0,{"v":0,"d":"0.00"},null,{"v":0,"d":"0.00"},null,null,{"v":0,"d":"0.00 €"},null,""]
[null,"Orthophoniste",{"$nulls":4},0,{"v":0,"d":"0.00"},null,{"v":0,"d":"0.00"},null,null,{"v":0,"d":"0.00 €"},null,""]
[null,"Orthoptiste",{"$nulls":4},0,{"v":0,"d":"0.00"},null,{"v":0,"d":"0.00"},null,null,{"v":0,"d":"0.00 €"},null,""]
[null,"Pédicure-podologue",{"$nulls":4},0,{"v":0,"d":"0.00"},null,{"v":0,"d":"0.00"},null,null,{"v":0,"d":"0.00 €"},null,""]
[null,"Personnel médicotechnique de la rééducation",{"$nulls":4},0,{"v":0,"d":"0.00"},null,{"v":0,"d":"0.00"},null,null,{"v":0,"d":"0.00 €"},null,""]
[null,"Psychomotricien",{"$nulls":4},0,{"v":0,"d":"0.00"},null,{"v":0,"d":"0.00"},null,null,{"v":0,"d":"0.00 €"},null,""]
[null,"Puériculteur",{"$nulls":4},0,{"v":0,"d":"0.00"},null,{"v":0,"d":"0.00"},null,null,{"v":0,"d":"0.00 €"},null,""]
[null,"Sage-femme",{"$nulls":4},0,{"v":0,"d":"0.00"},null,{"v":0,"d":"0.00"},null,null,{"v":0,"d":"0.00 €"},null,""]
[null,"Autre personnel paramédical",{"$nulls":4},0,{"v":0,"d":"0.00"},null,{"v":0,"d":"0.00"},null,null,{"v":0,"d":"0.00 €"},null,""]
[null,"Personnel paramédical en formation",{"$nulls":4},0,{"v":0,"d":"0.00"},null,{"v":0,"d":"0.00"},null,null,{"v":0,"d":"0.00 €"},null,""]
[null,"MEDICAL",null,{"$f":"SUM(D97:D103)","v":0},{"$f":"SUM(E97:E103)","v":0},{"$f":"SUM(F97:F103)","v":{"v":0,"d":"0.00"}},0,{"v":0,"d":"0.00"},{"$f":"SUM(I97:I103)","v":{"v":0,"d":"0.00"}},{"v":0,"d":"0.00"},{"$f":"SUM(K97:K103)","v":{"v":0,"d":"0.00 €"}},{"$f":"SUM(L97:L103)","v":{"v":0,"d":"0.00 €"}},{"v":0,"d":"0.00 €"}]
[null,"Dont emplois temporaires",{"$nulls":4},0,{"v":0,"d":"0.00"},null,{"v":0,"d":"0.00"},null,null,{"v":0,"d":"0.00 €"},null,""]
[null,"Médecin pédiatre",{"$nulls":4},0,{"v":0,"d":"0.00"},null,{"v":0,"d":"0.00"},null,null,{"v":0,"d":"0.00 €"},null,""]
[null,"Médecin psychiatre",{"$nulls":4},0,{"v":0,"d":"0.00"},null,{"v":0,"d":"0.00"},null,null,{"v":0,"d":"0.00 €"},null,""]
[null,"Médecin rééducation fonctionnelle",{"$nulls":4},0,{"v":0,"d":"0.00"},null,{"v":0,"d":"0.00"},null,null,{"v":0,"d":"0.00 €"},null,""]
[null,"Médecin autre spécialité",{"$nulls":4},0,{"v":0,"d":"0.00"},null,{"v":0,"d":"0.00"},null,null,{"v":0,"d":"0.00 €"},null,""]
[null,"Médecin généraliste",{"$nulls":4},0,{"v":0,"d":"0.00"},null,{"v":0,"d":"0.00"},null,null,{"v":0,"d":"0.00 €"},null,""]
[null,"Pharmacien",{"$nulls":4},0,{"v":0,"d":"0.00"},null,{"v":0,"d":"0.00"},null,null,{"v":0,"d":"0.00 €"},null,""]
[null,"Autre",{"$nulls":4},0,{"v":0,"d":"0.00"},null,{"v":0,"d":"0.00"},null,null,{"v":0,"d":"0.00 €"},null,""]
[null,"AUTRES FONCTIONS",null,{"$f":"SUM(D106:D107)","v":0},{"$f":"SUM(E106:E107)","v":0},{"$f":"SUM(F106:F107)","v":{"v":0,"d":"0.00"}},0,{"v":0,"d":"0.00"},{"$f":"SUM(I106:I107)","v":{"v":0,"d":"0.00"}},{"v":0,"d":"0.00"},{"$f":"SUM(K106:K107)","v":{"v":0,"d":"0.00 €"}},{"$f":"SUM(L106:L107)","v":{"v":0,"d":"0.00 €"}},{"v":0,"d":"0.00 €"}]
[null,"Dont emplois temporaires",{"$nulls":4},0,{"v":0,"d":"0.00"},null,{"v":0,"d":"0.00"},null,null,{"v":0,"d":"0.00 €"},null,""]
[{"$nulls":6},0,{"v":0,"d":"0.00"},null,{"v":0,"d":"0.00"},null,null,{"v":0,"d":"0.00 €"},null,""]
[{"$nulls":6},0,{"v":0,"d":"0.00"},null,{"v":0,"d":"0.00"},null,null,{"v":0,"d":"0.00 €"},null,""]
[null,"TOTAL Personnel salarié",null,{"$f":"D12+D27+D32+D39+D44+D95+D76+D104","v":0},{"$f":"E12+E27+E32+E39+E44+E95+E76+E104","v":0},{"$f":"F12+F27+F32+F39+F44+F95+F76+F104","v":{"v":0,"d":"0.00"}},0,{"v":0,"d":"0.00"},{"$f":"I12+I27+I32+I39+I44+I95+I76+I104","v":{"v":0,"d":"0.00"}},{"$f":"H108-I108","v":{"v":0,"d":"0.00"}},{"$f":"K12+K27+K32+K39+K44+K95+K76+K104","v":{"v":0,"d":"0.00 €"}},{"$f":"L12+L27+L32+L39+L44+L95+L76+L104","v":{"v":0,"d":"0.00 €"}},{"$f":"L108-K108","v":{"v":0,"d":"0.00 €"}}]
[null,"(*): Nombre d'ETP inscrits au précédent tableau des effectifs rémunérés (budget exécutoire)",{"$nulls":5},{"$f":"IF(OR(H108=\"\",H108=0),\"Effectifs N non saisis (colonne H)\",\"\")","v":"Effectifs N non saisis (colonne H)"},{"$f":"IF(OR(I108=\"\",I108=0),\"Effectifs N-1 non saisis (colonne I)\",\"\")","v":"Effectifs N-1 non saisis (colonne I)"},null,{"$f":"IF(OR(K108=\"\",K108=0),\"Rémunérations N-1 non saisies\",\"\")","v":"Rémunérations N-1 non saisies"},{"$f":"IF(OR(L108=\"\",L108=0),\"Rémunérations N non saisies\",\"\")","v":"Rémunérations N non saisies"}]
[]
[null,"Services extérieurs (hors audits, experts juridiques, comptables et commissaires aux comptes)"]
[null,"Catégorie / emplois",null,{"$f":"IF('Page de garde'!$D$4=\"\",\"Equivalents temps plein Année N\",\"Equivalents temps plein Année \"&'Page de garde'!$D$4)","v":"Equivalents temps plein Année N"},null,{"$f":"IF('Page de garde'!$D$4=\"\",\"Equivalents temps plein Année N-1\",\"Equivalents temps plein Année \"&'Page de garde'!$D$4-1)","v":"Equivalents temps plein Année N-1"},null,"N° de compte d'imputation de la prestation - Libellé du compte",null,"Montant de la prestation"]
[]
[null,"DIRECTION / ENCADREMENT",null,{"$f":"SUM(D116:D128)","v":{"v":0,"d":"0.00"}},{"$f":"SUM(#REF!)","v":{"$error":"#REF!"}},{"$f":"SUM(F116:F128)","v":{"v":0,"d":"0.00"}},{"$f":"SUM(#REF!)","v":{"$error":"#REF!"}},null,null,{"$f":"SUM(J116:J128)","v":{"v":0,"d":"0.00 €"}},{"$f":"SUM(#REF!)","v":{"$error":"#REF!"}}]
[null,"Dont emplois temporaires"]
[null,"Directeur"]
[null,"Médecin directeur"]
[null,"Directeur-adjoint"]
[null,"Chef de service éducatif, pédagogique et social, paramédical"]
[null,"Chef de service autre (administratif, etc.)"]
[null,"Chef d'atelier"]
[null,"Attaché de direction, économe"]
[null,"Cadre de santé de la filière infirmière"]
[null,"Cadre de service paramédical, cadre de la filière de rééducation, autre cadre de santé"]
[null,"Cadre de service éducatif et social"]
[null,"Responsable et coordonnateur de secteur"]
[null,"Autres cadres (direction)"]
[null,"Autres cadres (encadrement de proximité)"]
[null,"ADMINISTRATION / GESTION",null,{"$f":"SUM(D131:D133)","v":{"v":0,"d":"0.00"}},{"$f":"SUM(#REF!)","v":{"$error":"#REF!"}},{"$f":"SUM(F131:F133)","v":{"v":0,"d":"0.00"}},{"$f":"SUM(#REF!)","v":{"$error":"#REF!"}},null,null,{"$f":"SUM(J131:J133)","v":{"v":0,"d":"0.00 €"}},{"$f":"SUM(#REF!)","v":{"$error":"#REF!"}}]
[null,"Dont emplois temporaires"]
[null,"Agent administratif"]
[null,"Comptable"]
[null,"Autre personnel administratif et de gestion"]
[null,"SERVICES GENERAUX",null,{"$f":"SUM(D136:D140)","v":{"v":0,"d":"0.00"}},{"$f":"SUM(#REF!)","v":{"$error":"#REF!"}},{"$f":"SUM(F136:F140)","v":{"v":0,"d":"0.00"}},{"$f":"SUM(#REF!)","v":{"$error":"#REF!"}},null,null,{"$f":"SUM(J136:J140)","v":{"v":0,"d":"0.00 €"}},{"$f":"SUM(#REF!)","v":{"$error":"#REF!"}}]
[null,"Dont emplois temporaires"]
[null,"Agent de service général"]
[null,"Maître de maison (hors encadrant éducatif de nuit)"]
[null,"Ouvrier qualifié"]
[null,"Veilleur de nuit occupant à titre principal des fonctions d'accompagnement socio-éducatif (hors encadrant éducatif de nuit)"]
[null,"Autre personnel services généraux"]
[null,"RESTAURATION",null,{"$f":"SUM(D143:D145)","v":{"v":0,"d":"0.00"}},{"$f":"SUM(E143:E143)","v":{"v":0,"d":"0.00"}},{"$f":"SUM(F143:F145)","v":{"v":0,"d":"0.00"}},{"$f":"SUM(G143:G143)","v":{"v":0,"d":"0.00"}},null,null,{"$f":"SUM(J143:J145)","v":{"v":0,"d":"0.00 €"}},{"$f":"SUM(K143:K143)","v":{"v":0,"d":"0.00 €"}}]
[null,"Dont emplois temporaires"]
[null,"Chef cuisinier"]
[null,"Cuisinier"]
[null,"Autre personnel de restauration"]
[null,"ENSEIGNEMENT ET SOCIO-EDUCATIF",null,{"$f":"SUM(D148:D175)","v":{"v":0,"d":"0.00"}},{"$f":"SUM(#REF!)","v":{"$error":"#REF!"}},{"$f":"SUM(F148:F175)","v":{"v":0,"d":"0.00"}},{"$f":"SUM(#REF!)","v":{"$error":"#REF!"}},null,null,{"$f":"SUM(J148:J175)","v":{"v":0,"d":"0.00 €"}},{"$f":"SUM(#REF!)","v":{"$error":"#REF!"}}]
[null,"Dont emplois temporaires"]
[null,"Enseignant (enseignement primaire)"]
[null,"Enseignant (enseignement secondaire)"]
[null,"Enseignant (enseignement supérieur)"]
[null,"Professeur EPS"]
[null,"Moniteur EPS"]
[null,"Accompagnant éducatif et social"]
[null,"Aide médico-psychologique"]
[null,"Animateur social"]
[null,"Assistant de service social/assistant social spécialisé"]
[null,"Assistant maternel"]
[null,"Auxiliaire de vie sociale"]
[null,"Conseiller en économie sociale et familiale"]
[null,"Educateur jeunes enfants"]
[null,"Educateur technique ou spécialisé"]
[null,"Encadrant éducatif de nuit"]
[null,"Mandataire judiciaire ou délégué aux prestations sociales"]
[null,"Moniteur d'atelier"]
[null,"Moniteur éducateur"]
[null,"Moniteur enseignement ménager"]
[null,"Moniteur jardin d'enfants"]
[null,"Personnel d'aide à domicile"]
[null,"Psychologue/neuropsychologue"]
[null,"Responsable ou encadrant technique d'atelier"]
[null,"Technicien de l'intervention sociale et familiale"]
[null,"Technicien en compensation sensorielle"]
[null,"Travailleur familial"]
[null,"Autre personnel socio-éducatif"]
[null,"Personnel socio-éducatif en cours de formation"]
[null,"PARAMEDICAL",null,{"$f":"SUM(D178:D193)","v":{"v":0,"d":"0.00"}},{"$f":"SUM(#REF!)","v":{"$error":"#REF!"}},{"$f":"SUM(F178:F193)","v":{"v":0,"d":"0.00"}},{"$f":"SUM(#REF!)","v":{"$error":"#REF!"}},null,null,{"$f":"SUM(J178:J193)","v":{"v":0,"d":"0.00 €"}},{"$f":"SUM(#REF!)","v":{"$error":"#REF!"}}]
[null,"Dont emplois temporaires"]
[null,"Aide soignant"]
[null,"Audioprothésiste"]
[null,"Diététicien"]
[null,"Ergothérapeute"]
[null,"Infirmier D.E."]
[null,"Infirmier psychiatrique"]
[null,"Masseur-kinésithérapeute"]
[null,"Orthophoniste"]
[null,"Orthoptiste"]
[null,"Pédicure-podologue"]
[null,"Personnel médicotechnique de la rééducation"]
[null,"Psychomotricien"]
[null,"Puériculteur"]
[null,"Sage-femme"]
[null,"Autre personnel paramédical"]
[null,"Personnel paramédical en formation"]
[null,"MEDICAL",null,{"$f":"SUM(D196:D202)","v":{"v":0,"d":"0.00"}},{"$f":"SUM(#REF!)","v":{"$error":"#REF!"}},{"$f":"SUM(F196:F202)","v":{"v":0,"d":"0.00"}},{"$f":"SUM(#REF!)","v":{"$error":"#REF!"}},null,null,{"$f":"SUM(J196:J202)","v":{"v":0,"d":"0.00 €"}},{"$f":"SUM(#REF!)","v":{"$error":"#REF!"}}]
[null,"Dont emplois temporaires"]
[null,"Médecin pédiatre"]
[null,"Médecin psychiatre"]
[null,"Médecin rééducation fonctionnelle"]
[null,"Médecin autre spécialité"]
[null,"Médecin généraliste"]
[null,"Pharmacien"]
[null,"Autre"]
[null,"AUTRES FONCTIONS",null,{"$f":"SUM(D205:D206)","v":{"v":0,"d":"0.00"}},{"$f":"SUM(E206:E206)","v":{"v":0,"d":"0.00"}},{"$f":"SUM(F205:F206)","v":{"v":0,"d":"0.00"}},{"$f":"SUM(G206:G206)","v":{"v":0,"d":"0.00"}},null,null,{"$f":"SUM(J205:J206)","v":{"v":0,"d":"0.00 €"}},{"$f":"SUM(K206:K206)","v":{"v":0,"d":"0.00 €"}}]
[null,"Dont emplois temporaires"]
[]
[]
[null,"TOTAL Personnel extérieur",null,{"$f":"D114+D129+D134+D141+D146+D176+D194+D203","v":{"v":0,"d":"0.00"}},{"$f":"SUM(#REF!)","v":{"$error":"#REF!"}},{"$f":"F114+F129+F134+F141+F146+F176+F194+F203","v":{"v":0,"d":"0.00"}},{"$f":"SUM(#REF!)","v":{"$error":"#REF!"}},null,null,{"$f":"J114+J129+J134+J141+J146+J176+J194+J203","v":{"v":0,"d":"0.00 €"}},{"$f":"SUM(#REF!)","v":{"$error":"#REF!"}}]

{"sheet":"TPER type EHPAD","index":8,"n_rows":217,"n_cols":20,"rows_kept":217,"hidden":true,"merged":[[1,1,1,2],[1,3,1,5],[2,1,2,2],[2,3,2,5],[4,1,4,12],[6,4,6,7],[6,9,6,12],[6,14,6,15],[42,1,43,1],[96,1,97,1],[119,1,119,5],[121,1,121,12],[123,4,123,7],[123,9,123,12],[123,14,123,15],[153,1,154,1],[197,1,198,1],[216,1,216,5]]}
[]
[null,"Raison sociale :"]
[null,"FINESS ET :"]
[]
[null,"Annexe 6A : Tableau prévisionnel des effectifs rémunérés - Répartition des charges relatives au personnel salarié dans les EHPAD, PUV et AJ (y compris personnel de remplacement)",{"$nulls":15},"Données complémentaires"]
[]
[{"$nulls":4},{"$f":"IF('Page de garde'!$D$4=\"\",\"EPRD N\",\"EPRD \"&'Page de garde'!$D$4)","v":"EPRD N"},{"$nulls":4},{"$f":"IF('Page de garde'!$D$4=\"\",\"EPRD N\",\"EPRD \"&'Page de garde'!$D$4)","v":"EPRD N"},{"$nulls":4},"EPRD N"]
[null,"PERSONNEL (une ligne par emploi, le cas échéant subdivisée en une ligne \"emploi permanent\" et une ligne \"emploi temporaire\")","Emploi permanent (P) /  temporaire (T)",{"$f":"IF('Page de garde'!$D$4=\"\",\"Nombre d'ETP inscrits à l'EPRD N-1 (*)\",\"Nombre d'ETP inscrits à l'EPRD \"&'Page de garde'!$D$4-1&\" (*)\" )","v":"Nombre d'ETP inscrits à l'EPRD N-1 (*)"},"Nombre d'ETP","Hébergement \nen ETP","Dépendance \nen ETP","Soins \nen ETP",{"$f":"IF('Page de garde'!$D$4=\"\",\"Rémunérations brutes + charges sociales et fiscales N-1 (*)\",\"Rémunérations brutes + charges sociales et fiscales \"&'Page de garde'!$D$4-1&\" (*)\" )","v":"Rémunérations brutes + charges sociales et fiscales N-1 (*)"},"Rémunérations brutes + charges sociales et fiscales","Imputation à la section \"Hébergement\"","Imputation à la section \"Dépendance\"","Imputation à la section \"Soins\"",null,"Soins et entretien de l'autonomie en ETP","Rémunérations brutes + charges sociales et fiscales \nImputation à la section \"Soins et entretien de l'autonomie\"",null,"Nombre d'ETP travaillés \nprévus "]
[null,"DIRECTION - ADMINISTRATION",{"$nulls":3},{"v":1,"d":"100%"}]
[{"$nulls":3},{"$f":"D11+D12","v":{"v":0,"d":"0.00"}},{"$f":"E11+E12","v":{"v":0,"d":"0.00"}},{"$f":"F11+F12","v":{"v":0,"d":"0.00"}},null,{"$f":"H11+H12","v":{"v":0,"d":"0.00"}},{"$f":"I11+I12","v":{"v":0,"d":"0.00 €"}},{"$f":"J11+J12","v":{"v":0,"d":"0.00 €"}},{"$f":"K11+K12","v":{"v":0,"d":"0.00 €"}},null,{"$f":"M11+M12","v":{"v":0,"d":"0.00 €"}},null,{"$f":"O11+O12","v":{"v":0,"d":"0.00"}},{"$f":"P11+P12","v":{"v":0,"d":"0.00 €"}},null,{"$f":"R11+R12","v":{"v":0,"d":"0.00"}},null,{"$f":"IF(ROUND((F10+G10+H10+O10),2)<>ROUND(E10,2),\"Saisie incohérente : le cumul des sections en ETP devrait être égal au total global colonne E\",IF(ROUND((K10+L10+M10+P10),0)<>ROUND(J10,0),\"Saisie incohérente : le cumul des imputations par section devrait être égal au total global colonne J\",\"\"))","v":""}]
[null,null,"P",{"$f":"SUMIF($C13:$C22,\"P\",D13:D22)","v":{"v":0,"d":"0.00"}},{"$f":"SUMIF($C13:$C22,\"P\",E13:E22)","v":{"v":0,"d":"0.00"}},{"$f":"SUMIF($C13:$C22,\"P\",F13:F22)","v":{"v":0,"d":"0.00"}},null,{"$f":"SUMIF($C13:$C22,\"P\",H13:H22)","v":{"v":0,"d":"0.00"}},{"v":0,"d":"0.00 €"},{"v":0,"d":"0.00 €"},{"v":0,"d":"0.00 €"},null,{"$f":"SUMIF($C13:$C22,\"P\",M13:M22)","v":{"v":0,"d":"0.00 €"}},null,{"$f":"SUMIF($C13:$C22,\"P\",O13:O22)","v":{"v":0,"d":"0.00"}},{"$f":"SUMIF($C13:$C22,\"P\",P13:P22)","v":{"v":0,"d":"0.00 €"}},null,{"$f":"SUMIF($C13:$C22,\"P\",R13:R22)","v":{"v":0,"d":"0.00"}}]
[null,null,"T",{"$f":"SUMIF($C13:$C22,\"T\",D13:D22)","v":{"v":0,"d":"0.00"}},{"$f":"SUMIF($C13:$C22,\"T\",E13:E22)","v":{"v":0,"d":"0.00"}},{"$f":"SUMIF($C13:$C22,\"T\",F13:F22)","v":{"v":0,"d":"0.00"}},null,{"$f":"SUMIF($C13:$C22,\"T\",H13:H22)","v":{"v":0,"d":"0.00"}},{"$f":"SUMIF($C13:$C22,\"T\",I13:I22)","v":{"v":0,"d":"0.00 €"}},{"$f":"SUMIF($C13:$C22,\"T\",J13:J22)","v":{"v":0,"d":"0.00 €"}},{"$f":"SUMIF($C13:$C22,\"T\",K13:K22)","v":{"v":0,"d":"0.00 €"}},null,{"$f":"SUMIF($C13:$C22,\"T\",M13:M22)","v":{"v":0,"d":"0.00 €"}},null,{"$f":"SUMIF($C13:$C22,\"T\",O13:O22)","v":{"v":0,"d":"0.00"}},{"$f":"SUMIF($C13:$C22,\"T\",P13:P22)","v":{"v":0,"d":"0.00 €"}},null,{"$f":"SUMIF($C13:$C22,\"T\",R13:R22)","v":{"v":0,"d":"0.00"}}]
[null,"Directeur","P",{"$nulls":16},{"$f":"IF(AND(E13<>0,OR(J13=0,J13=\"\")),\"Saisie incohérente : ETP sans rémunération correspondante\",IF(AND(J13<>0,OR(E13=0,E13=\"\")),\"Saisie incohérente : rémunération sans ETP correspondant\",\"\"))","v":""}]
[null,"Directeur","T",{"$nulls":16},{"$f":"IF(AND(E14<>0,OR(J14=0,J14=\"\")),\"Saisie incohérente : ETP sans rémunération correspondante\",IF(AND(J14<>0,OR(E14=0,E14=\"\")),\"Saisie incohérente : rémunération sans ETP correspondant\",\"\"))","v":""}]
[null,"Médecin directeur","P",{"$nulls":16},""]
[null,"Médecin directeur","T",{"$nulls":16},""]
[null,"Directeur adjoint, attaché de direction, économe","P",{"$nulls":16},""]
[null,"Directeur adjoint, attaché de direction, économe","T",{"$nulls":16},""]
[null,"Agent administratif et personnel de bureau","P",{"$nulls":16},""]
[null,"Agent administratif et personnel de bureau","T",{"$nulls":16},""]
[null,"Autre personnel de direction ou d'administration","P",{"$nulls":16},""]
[null,"Autre personnel de direction ou d'administration","T",{"$nulls":16},""]
[null,"CUISINE - SERVICES GENERAUX - Diététicien",{"$nulls":3},{"v":1,"d":"100%"}]
[{"$nulls":3},{"$f":"D25+D26","v":{"v":0,"d":"0.00"}},{"$f":"E25+E26","v":{"v":0,"d":"0.00"}},{"$f":"F25+F26","v":{"v":0,"d":"0.00"}},null,{"$f":"H25+H26","v":{"v":0,"d":"0.00"}},{"$f":"I25+I26","v":{"v":0,"d":"0.00 €"}},{"$f":"J25+J26","v":{"v":0,"d":"0.00 €"}},{"$f":"K25+K26","v":{"v":0,"d":"0.00 €"}},null,{"$f":"M25+M26","v":{"v":0,"d":"0.00 €"}},null,{"$f":"O25+O26","v":{"v":0,"d":"0.00"}},{"$f":"P25+P26","v":{"v":0,"d":"0.00 €"}},null,{"$f":"R25+R26","v":{"v":0,"d":"0.00"}},null,{"$f":"IF(ROUND((F24+G24+H24+O24),2)<>ROUND(E24,2),\"Saisie incohérente : le cumul des sections en ETP devrait être égal au total global colonne E\",IF(ROUND((K24+L24+M24+P24),0)<>ROUND(J24,0),\"Saisie incohérente : le cumul des imputations par section devrait être égal au total global colonne J\",\"\"))","v":""}]
[null,null,"P",{"$f":"SUMIF($C27:$C34,\"P\",D27:D34)","v":{"v":0,"d":"0.00"}},{"$f":"SUMIF($C27:$C34,\"P\",E27:E34)","v":{"v":0,"d":"0.00"}},{"$f":"SUMIF($C27:$C34,\"P\",F27:F34)","v":{"v":0,"d":"0.00"}},null,{"$f":"SUMIF($C27:$C34,\"P\",H27:H34)","v":{"v":0,"d":"0.00"}},{"$f":"SUMIF($C27:$C34,\"P\",I27:I34)","v":{"v":0,"d":"0.00 €"}},{"$f":"SUMIF($C27:$C34,\"P\",J27:J34)","v":{"v":0,"d":"0.00 €"}},{"$f":"SUMIF($C27:$C34,\"P\",K27:K34)","v":{"v":0,"d":"0.00 €"}},null,{"$f":"SUMIF($C27:$C34,\"P\",M27:M34)","v":{"v":0,"d":"0.00 €"}},null,{"$f":"SUMIF($C27:$C34,\"P\",O27:O34)","v":{"v":0,"d":"0.00"}},{"$f":"SUMIF($C27:$C34,\"P\",P27:P34)","v":{"v":0,"d":"0.00 €"}},null,{"$f":"SUMIF($C27:$C34,\"P\",R27:R34)","v":{"v":0,"d":"0.00"}}]
[null,null,"T",{"$f":"SUMIF($C27:$C34,\"T\",D27:D34)","v":{"v":0,"d":"0.00"}},{"$f":"SUMIF($C27:$C34,\"T\",E27:E34)","v":{"v":0,"d":"0.00"}},{"$f":"SUMIF($C27:$C34,\"T\",F27:F34)","v":{"v":0,"d":"0.00"}},null,{"$f":"SUMIF($C27:$C34,\"T\",H27:H34)","v":{"v":0,"d":"0.00"}},{"$f":"SUMIF($C27:$C34,\"T\",I27:I34)","v":{"v":0,"d":"0.00 €"}},{"$f":"SUMIF($C27:$C34,\"T\",J27:J34)","v":{"v":0,"d":"0.00 €"}},{"$f":"SUMIF($C27:$C34,\"T\",K27:K34)","v":{"v":0,"d":"0.00 €"}},null,{"$f":"SUMIF($C27:$C34,\"T\",M27:M34)","v":{"v":0,"d":"0.00 €"}},null,{"$f":"SUMIF($C27:$C34,\"T\",O27:O34)","v":{"v":0,"d":"0.00"}},{"$f":"SUMIF($C27:$C34,\"T\",P27:P34)","v":{"v":0,"d":"0.00 €"}},null,{"$f":"SUMIF($C27:$C34,\"T\",R27:R34)","v":{"v":0,"d":"0.00"}}]
[null,"Ouvrier professionnel","P",{"$nulls":16},{"$f":"IF(AND(E27<>0,OR(J27=0,J27=\"\")),\"Saisie incohérente : ETP sans rémunération correspondante\",IF(AND(J27<>0,OR(E27=0,E27=\"\")),\"Saisie incohérente : rémunération sans ETP correspondant\",\"\"))","v":""}]
[null,"Ouvrier professionnel","T",{"$nulls":16},""]
[null,"Agent de service général","P",{"$nulls":16},""]
[null,"Agent de service général","T",{"$nulls":16},""]
[null,"Diététicien","P",{"$nulls":16},""]
[null,"Diététicien","T",{"$nulls":16},""]
[null,"Autre personnel de cuisine - services généraux","P",{"$nulls":16},""]
[null,"Autre personnel de cuisine - services généraux","T",{"$nulls":16},""]
[null,"ANIMATION - SERVICE SOCIAL",{"$nulls":3},{"v":1,"d":"100%"}]
[{"$nulls":3},{"$f":"D37+D38","v":{"v":0,"d":"0.00"}},{"$f":"E37+E38","v":{"v":0,"d":"0.00"}},{"$f":"F37+F38","v":{"v":0,"d":"0.00"}},null,{"$f":"H37+H38","v":{"v":0,"d":"0.00"}},{"$f":"I37+I38","v":{"v":0,"d":"0.00 €"}},{"$f":"J37+J38","v":{"v":0,"d":"0.00 €"}},{"$f":"K37+K38","v":{"v":0,"d":"0.00 €"}},null,{"$f":"M37+M38","v":{"v":0,"d":"0.00 €"}},null,{"$f":"O37+O38","v":{"v":0,"d":"0.00"}},{"$f":"P37+P38","v":{"v":0,"d":"0.00 €"}},null,{"$f":"R37+R38","v":{"v":0,"d":"0.00"}},null,{"$f":"IF(ROUND((F36+G36+H36+O36),2)<>ROUND(E36,2),\"Saisie incohérente : le cumul des sections en ETP devrait être égal au total global colonne E\",IF(ROUND((K36+L36+M36+P36),0)<>ROUND(J36,0),\"Saisie incohérente : le cumul des imputations par section devrait être égal au total global colonne J\",\"\"))","v":""}]
[null,null,"P",{"$f":"SUMIF($C39:$C42,\"P\",D39:D42)","v":{"v":0,"d":"0.00"}},{"$f":"SUMIF($C39:$C42,\"P\",E39:E42)","v":{"v":0,"d":"0.00"}},{"$f":"SUMIF($C39:$C42,\"P\",F39:F42)","v":{"v":0,"d":"0.00"}},null,{"$f":"SUMIF($C39:$C42,\"P\",H39:H42)","v":{"v":0,"d":"0.00"}},{"$f":"SUMIF($C39:$C42,\"P\",I39:I42)","v":{"v":0,"d":"0.00 €"}},{"$f":"SUMIF($C39:$C42,\"P\",J39:J42)","v":{"v":0,"d":"0.00 €"}},{"$f":"SUMIF($C39:$C42,\"P\",K39:K42)","v":{"v":0,"d":"0.00 €"}},null,{"$f":"SUMIF($C39:$C42,\"P\",M39:M42)","v":{"v":0,"d":"0.00 €"}},null,{"$f":"SUMIF($C39:$C42,\"P\",O39:O42)","v":{"v":0,"d":"0.00"}},{"$f":"SUMIF($C39:$C42,\"P\",P39:P42)","v":{"v":0,"d":"0.00 €"}},null,{"$f":"SUMIF($C39:$C42,\"P\",R39:R42)","v":{"v":0,"d":"0.00"}}]
[null,null,"T",{"$f":"SUMIF($C39:$C42,\"T\",D39:D42)","v":{"v":0,"d":"0.00"}},{"$f":"SUMIF($C39:$C42,\"T\",E39:E42)","v":{"v":0,"d":"0.00"}},{"$f":"SUMIF($C39:$C42,\"T\",F39:F42)","v":{"v":0,"d":"0.00"}},null,{"$f":"SUMIF($C39:$C42,\"T\",H39:H42)","v":{"v":0,"d":"0.00"}},{"$f":"SUMIF($C39:$C42,\"T\",I39:I42)","v":{"v":0,"d":"0.00 €"}},{"$f":"SUMIF($C39:$C42,\"T\",J39:J42)","v":{"v":0,"d":"0.00 €"}},{"$f":"SUMIF($C39:$C42,\"T\",K39:K42)","v":{"v":0,"d":"0.00 €"}},null,{"$f":"SUMIF($C39:$C42,\"T\",M39:M42)","v":{"v":0,"d":"0.00 €"}},null,{"$f":"SUMIF($C39:$C42,\"T\",O39:O42)","v":{"v":0,"d":"0.00"}},{"$f":"SUMIF($C39:$C42,\"T\",P39:P42)","v":{"v":0,"d":"0.00 €"}},null,{"$f":"SUMIF($C39:$C42,\"T\",R39:R42)","v":{"v":0,"d":"0.00"}}]
[null,"Animateur social","P",{"$nulls":16},{"$f":"IF(AND(E39<>0,OR(J39=0,J39=\"\")),\"Saisie incohérente : ETP sans rémunération correspondante\",IF(AND(J39<>0,OR(E39=0,E39=\"\")),\"Saisie incohérente : rémunération sans ETP correspondant\",\"\"))","v":""}]
[null,"Animateur social","T",{"$nulls":16},{"$f":"IF(AND(E40<>0,OR(J40=0,J40=\"\")),\"Saisie incohérente : ETP sans rémunération correspondante\",IF(AND(J40<>0,OR(E40=0,E40=\"\")),\"Saisie incohérente : rémunération sans ETP correspondant\",\"\"))","v":""}]
[null,"Autre personnel d'animation - service social","P",{"$nulls":16},{"$f":"IF(AND(E41<>0,OR(J41=0,J41=\"\")),\"Saisie incohérente : ETP sans rémunération correspondante\",IF(AND(J41<>0,OR(E41=0,E41=\"\")),\"Saisie incohérente : rémunération sans ETP correspondant\",\"\"))","v":""}]
[null,"Autre personnel d'animation - service social","T",{"$nulls":16},{"$f":"IF(AND(E42<>0,OR(J42=0,J42=\"\")),\"Saisie incohérente : ETP sans rémunération correspondante\",IF(AND(J42<>0,OR(E42=0,E42=\"\")),\"Saisie incohérente : rémunération sans ETP correspondant\",\"\"))","v":""}]
[null,"ASH - agents de service affectés aux fonctions de blanchissage, nettoyage et service des repas",{"$nulls":3},{"$f":"IF(E44=0,\"\",F44/E44)","v":""},{"$f":"IF(E44=0,\"\",G44/E44)","v":""},{"$nulls":7},{"$f":"IF(E44=0,\"\",O44/E44)","v":""}]
[{"$nulls":3},{"$f":"D45+D46","v":{"v":0,"d":"0.00"}},{"v":0,"d":"0.00"},{"v":0,"d":"0.00"},{"$f":"G45+G46","v":{"v":0,"d":"0.00"}},{"v":0,"d":"0.00"},{"v":0,"d":"0.00 €"},{"v":0,"d":"0.00 €"},{"v":0,"d":"0.00 €"},{"$f":"L45+L46","v":{"v":0,"d":"0.00 €"}},{"v":0,"d":"0.00 €"},null,{"$f":"O45+O46","v":{"v":0,"d":"0.00"}},{"$f":"P45+P46","v":{"v":0,"d":"0.00 €"}},null,{"$f":"R45+R46","v":{"v":0,"d":"0.00"}},null,{"$f":"IF(ROUND((F44+G44+H44+O44),2)<>ROUND(E44,2),\"Saisie incohérente : le cumul des sections en ETP devrait être égal au total global colonne E\",IF(ROUND((K44+L44+M44+P44),0)<>ROUND(J44,0),\"Saisie incohérente : le cumul des imputations par section devrait être égal au total global colonne J\",\"\"))","v":""}]
[null,null,"P",{"$f":"SUMIF($C47:$C48,\"P\",D47:D48)","v":{"v":0,"d":"0.00"}},{"$f":"SUMIF($C47:$C48,\"P\",E47:E48)","v":{"v":0,"d":"0.00"}},{"v":0,"d":"0.00"},{"v":0,"d":"0.00"},{"v":0,"d":"0.00"},{"v":0,"d":"0.00 €"},{"v":0,"d":"0.00 €"},{"v":0,"d":"0.00 €"},{"$f":"SUMIF($C47:$C48,\"P\",L47:L48)","v":{"v":0,"d":"0.00 €"}},{"v":0,"d":"0.00 €"},null,{"$f":"SUMIF($C47:$C48,\"P\",O47:O48)","v":{"v":0,"d":"0.00"}},{"$f":"SUMIF($C47:$C48,\"P\",P47:P48)","v":{"v":0,"d":"0.00 €"}},null,{"$f":"SUMIF($C47:$C48,\"P\",R47:R48)","v":{"v":0,"d":"0.00"}}]
[null,null,"T",{"$f":"SUMIF($C47:$C48,\"T\",D47:D48)","v":{"v":0,"d":"0.00"}},{"v":0,"d":"0.00"},{"v":0,"d":"0.00"},{"v":0,"d":"0.00"},{"v":0,"d":"0.00"},{"v":0,"d":"0.00 €"},{"v":0,"d":"0.00 €"},{"v":0,"d":"0.00 €"},{"v":0,"d":"0.00 €"},{"v":0,"d":"0.00 €"},null,{"$f":"SUMIF($C47:$C48,\"T\",O47:O48)","v":{"v":0,"d":"0.00"}},{"$f":"SUMIF($C47:$C48,\"T\",P47:P48)","v":{"v":0,"d":"0.00 €"}},null,{"$f":"SUMIF($C47:$C48,\"T\",R47:R48)","v":{"v":0,"d":"0.00"}}]
[null,null,"P",{"$nulls":16},{"$f":"IF(AND(E47<>0,OR(J47=0,J47=\"\")),\"Saisie incohérente : ETP sans rémunération correspondante\",IF(AND(J47<>0,OR(E47=0,E47=\"\")),\"Saisie incohérente : rémunération sans ETP correspondant\",\"\"))","v":""}]
[null,null,"P",{"$nulls":16},{"$f":"IF(AND(E48<>0,OR(J48=0,J48=\"\")),\"Saisie incohérente : ETP sans rémunération correspondante\",IF(AND(J48<>0,OR(E48=0,E48=\"\")),\"Saisie incohérente : rémunération sans ETP correspondant\",\"\"))","v":""}]
[null,"AIDES SOIGNANTS, AIDES MEDICO-PEDAGOGIQUES ET ACCOMPAGNANTS EDUCATIFS ET SOCIAUX",{"$nulls":4},{"$f":"IF(E50=0,\"\",G50/E50)","v":""},{"$f":"IF(E50=0,\"\",H50/E50)","v":""},{"$nulls":6},{"v":1,"d":"100%"}]
[null,{"$f":"IF(OR(E50=\"\",E50=0),\"Total AS, AMP, AES en colonne E devrait être rempli\",IF(ROUND((G50+H50),2)<>ROUND(E50,2),\"Total AS, AMP, AES des 2 colonnes G et H devrait être égal au total AS, AMP, AES en colonne E\",\"\"))&\" \"&IF(OR(J50=\"\",J50=0),\"/ Total AS, AMP, AES en colonne J devrait être rempli\",IF(ROUND((L50+M50),2)<>ROUND(J50,2),\" / Total AS, AMP, AES des 2 colonnes L et M devrait être égal au total AS, AMP, AES en colonne J\",\"\"))","v":"Total AS, AMP, AES en colonne E devrait être rempli / Total AS, AMP, AES en colonne J devrait être rempli"},null,{"$f":"D51+D52","v":{"v":0,"d":"0.00"}},{"$f":"E51+E52","v":{"v":0,"d":"0.00"}},null,{"$f":"G51+G52","v":{"v":0,"d":"0.00"}},{"$f":"H51+H52","v":{"v":0,"d":"0.00"}},{"$f":"I51+I52","v":{"v":0,"d":"0.00 €"}},{"$f":"J51+J52","v":{"v":0,"d":"0.00 €"}},null,{"$f":"L51+L52","v":{"v":0,"d":"0.00 €"}},{"$f":"M51+M52","v":{"v":0,"d":"0.00 €"}},null,{"$f":"O51+O52","v":{"v":0,"d":"0.00"}},{"$f":"P51+P52","v":{"v":0,"d":"0.00 €"}},null,{"$f":"R51+R52","v":{"v":0,"d":"0.00"}},null,{"$f":"IF(ROUND((F50+G50+H50+O50),2)<>ROUND(E50,2),\"Saisie incohérente : le cumul des sections en ETP devrait être égal au total global colonne E\",IF(ROUND((K50+L50+M50+P50),0)<>ROUND(J50,0),\"Saisie incohérente : le cumul des imputations par section devrait être égal au total global colonne J\",\"\"))","v":""}]
[null,null,"P",{"$f":"SUMIF($C53:$C62,\"P\",D53:D62)","v":{"v":0,"d":"0.00"}},{"$f":"SUMIF($C53:$C62,\"P\",E53:E62)","v":{"v":0,"d":"0.00"}},null,{"$f":"SUMIF($C53:$C62,\"P\",G53:G62)","v":{"v":0,"d":"0.00"}},{"$f":"SUMIF($C53:$C62,\"P\",H53:H62)","v":{"v":0,"d":"0.00"}},{"$f":"SUMIF($C53:$C62,\"P\",I53:I62)","v":{"v":0,"d":"0.00 €"}},{"$f":"SUMIF($C53:$C62,\"P\",J53:J62)","v":{"v":0,"d":"0.00 €"}},null,{"$f":"SUMIF($C53:$C62,\"P\",L53:L62)","v":{"v":0,"d":"0.00 €"}},{"$f":"SUMIF($C53:$C62,\"P\",M53:M62)","v":{"v":0,"d":"0.00 €"}},null,{"$f":"SUMIF($C53:$C62,\"P\",O53:O62)","v":{"v":0,"d":"0.00"}},{"$f":"SUMIF($C53:$C62,\"P\",P53:P62)","v":{"v":0,"d":"0.00 €"}},null,{"$f":"SUMIF($C53:$C62,\"P\",R53:R62)","v":{"v":0,"d":"0.00"}}]
[null,null,"T",{"$f":"SUMIF($C53:$C62,\"T\",D53:D62)","v":{"v":0,"d":"0.00"}},{"$f":"SUMIF($C53:$C62,\"T\",E53:E62)","v":{"v":0,"d":"0.00"}},null,{"$f":"SUMIF($C53:$C62,\"T\",G53:G62)","v":{"v":0,"d":"0.00"}},{"$f":"SUMIF($C53:$C62,\"T\",H53:H62)","v":{"v":0,"d":"0.00"}},{"$f":"SUMIF($C53:$C62,\"T\",I53:I62)","v":{"v":0,"d":"0.00 €"}},{"$f":"SUMIF($C53:$C62,\"T\",J53:J62)","v":{"v":0,"d":"0.00 €"}},null,{"$f":"SUMIF($C53:$C62,\"T\",L53:L62)","v":{"v":0,"d":"0.00 €"}},{"$f":"SUMIF($C53:$C62,\"T\",M53:M62)","v":{"v":0,"d":"0.00 €"}},null,{"$f":"SUMIF($C53:$C62,\"T\",O53:O62)","v":{"v":0,"d":"0.00"}},{"$f":"SUMIF($C53:$C62,\"T\",P53:P62)","v":{"v":0,"d":"0.00 €"}},null,{"$f":"SUMIF($C53:$C62,\"T\",R53:R62)","v":{"v":0,"d":"0.00"}}]
[null,"Aide-soignant non assistant de soins en gérontologie","P",{"$nulls":16},{"$f":"IF(AND(E53<>0,OR(J53=0,J53=\"\")),\"Saisie incohérente : ETP sans rémunération correspondante\",IF(AND(J53<>0,OR(E53=0,E53=\"\")),\"Saisie incohérente : rémunération sans ETP correspondant\",\"\"))","v":""}]
[null,"Aide-soignant non assistant de soins en gérontologie","T",{"$nulls":16},""]
[null,"Aide-soignant assistant de soins en gérontologie","P",{"$nulls":16},""]
[null,"Aide-soignant assistant de soins en gérontologie","T",{"$nulls":16},""]
[null,"A.M.P.","P",{"$nulls":16},""]
[null,"A.M.P.","T",{"$nulls":16},""]
[null,"A.E.S.","P",{"$nulls":16},""]
[null,"A.E.S.","T",{"$nulls":16},""]
[null,"Autre personnel","P",{"$nulls":16},""]
[null,"Autre personnel","T",{"$nulls":16},""]
[null,"PSYCHOLOGUES",{"$nulls":4},{"v":1,"d":"100%"},{"$nulls":7},{"v":1,"d":"100%"}]
[{"$nulls":3},{"$f":"D65+D66","v":{"v":0,"d":"0.00"}},{"$f":"E65+E66","v":{"v":0,"d":"0.00"}},null,{"$f":"G65+G66","v":{"v":0,"d":"0.00"}},{"$f":"H65+H66","v":{"v":0,"d":"0.00"}},{"$f":"I65+I66","v":{"v":0,"d":"0.00 €"}},{"$f":"J65+J66","v":{"v":0,"d":"0.00 €"}},null,{"$f":"L65+L66","v":{"v":0,"d":"0.00 €"}},{"$f":"M65+M66","v":{"v":0,"d":"0.00 €"}},null,{"$f":"O65+O66","v":{"v":0,"d":"0.00"}},{"$f":"P65+P66","v":{"v":0,"d":"0.00 €"}},null,{"$f":"R65+R66","v":{"v":0,"d":"0.00"}},null,{"$f":"IF(ROUND((F64+G64+H64+O64),2)<>ROUND(E64,2),\"Saisie incohérente : le cumul des sections en ETP devrait être égal au total global colonne E\",IF(ROUND((K64+L64+M64+P64),0)<>ROUND(J64,0),\"Saisie incohérente : le cumul des imputations par section devrait être égal au total global colonne J\",\"\"))","v":""}]
[null,null,"P",{"$f":"SUMIF($C67:$C68,\"P\",D67:D68)","v":{"v":0,"d":"0.00"}},{"$f":"SUMIF($C67:$C68,\"P\",E67:E68)","v":{"v":0,"d":"0.00"}},null,{"$f":"SUMIF($C67:$C68,\"P\",G67:G68)","v":{"v":0,"d":"0.00"}},{"$f":"SUMIF($C67:$C68,\"P\",H67:H68)","v":{"v":0,"d":"0.00"}},{"$f":"SUMIF($C67:$C68,\"P\",I67:I68)","v":{"v":0,"d":"0.00 €"}},{"$f":"SUMIF($C67:$C68,\"P\",J67:J68)","v":{"v":0,"d":"0.00 €"}},null,{"$f":"SUMIF($C67:$C68,\"P\",L67:L68)","v":{"v":0,"d":"0.00 €"}},{"$f":"SUMIF($C67:$C68,\"P\",M67:M68)","v":{"v":0,"d":"0.00 €"}},null,{"$f":"SUMIF($C67:$C68,\"P\",O67:O68)","v":{"v":0,"d":"0.00"}},{"$f":"SUMIF($C67:$C68,\"P\",P67:P68)","v":{"v":0,"d":"0.00 €"}},null,{"$f":"SUMIF($C67:$C68,\"P\",R67:R68)","v":{"v":0,"d":"0.00"}}]
[null,null,"T",{"$f":"SUMIF($C67:$C68,\"T\",D67:D68)","v":{"v":0,"d":"0.00"}},{"$f":"SUMIF($C67:$C68,\"T\",E67:E68)","v":{"v":0,"d":"0.00"}},null,{"$f":"SUMIF($C67:$C68,\"T\",G67:G68)","v":{"v":0,"d":"0.00"}},{"$f":"SUMIF($C67:$C68,\"T\",H67:H68)","v":{"v":0,"d":"0.00"}},{"$f":"SUMIF($C67:$C68,\"T\",I67:I68)","v":{"v":0,"d":"0.00 €"}},{"$f":"SUMIF($C67:$C68,\"T\",J67:J68)","v":{"v":0,"d":"0.00 €"}},null,{"$f":"SUMIF($C67:$C68,\"T\",L67:L68)","v":{"v":0,"d":"0.00 €"}},{"$f":"SUMIF($C67:$C68,\"T\",M67:M68)","v":{"v":0,"d":"0.00 €"}},null,{"$f":"SUMIF($C67:$C68,\"T\",O67:O68)","v":{"v":0,"d":"0.00"}},{"$f":"SUMIF($C67:$C68,\"T\",P67:P68)","v":{"v":0,"d":"0.00 €"}},null,{"$f":"SUMIF($C67:$C68,\"T\",R67:R68)","v":{"v":0,"d":"0.00"}}]
[null,null,"P",{"$nulls":16},{"$f":"IF(AND(E67<>0,OR(J67=0,J67=\"\")),\"Saisie incohérente : ETP sans rémunération correspondante\",IF(AND(J67<>0,OR(E67=0,E67=\"\")),\"Saisie incohérente : rémunération sans ETP correspondant\",\"\"))","v":""}]
[null,null,"P",{"$nulls":16},{"$f":"IF(AND(E68<>0,OR(J68=0,J68=\"\")),\"Saisie incohérente : ETP sans rémunération correspondante\",IF(AND(J68<>0,OR(E68=0,E68=\"\")),\"Saisie incohérente : rémunération sans ETP correspondant\",\"\"))","v":""}]
[null,"INFIRMIERS",{"$nulls":5},{"v":1,"d":"100%"},{"$nulls":6},{"v":1,"d":"100%"}]
[{"$nulls":3},{"$f":"D71+D72","v":{"v":0,"d":"0.00"}},{"$f":"E71+E72","v":{"v":0,"d":"0.00"}},null,null,{"$f":"H71+H72","v":{"v":0,"d":"0.00"}},{"$f":"I71+I72","v":{"v":0,"d":"0.00 €"}},{"$f":"J71+J72","v":{"v":0,"d":"0.00 €"}},null,null,{"$f":"M71+M72","v":{"v":0,"d":"0.00 €"}},null,{"$f":"O71+O72","v":{"v":0,"d":"0.00"}},{"$f":"P71+P72","v":{"v":0,"d":"0.00 €"}},null,{"$f":"R71+R72","v":{"v":0,"d":"0.00"}},null,{"$f":"IF(ROUND((F70+G70+H70+O70),2)<>ROUND(E70,2),\"Saisie incohérente : le cumul des sections en ETP devrait être égal au total global colonne E\",IF(ROUND((K70+L70+M70+P70),0)<>ROUND(J70,0),\"Saisie incohérente : le cumul des imputations par section devrait être égal au total global colonne J\",\"\"))","v":""}]
[null,null,"P",{"$f":"SUMIF($C73:$C80,\"P\",D73:D80)","v":{"v":0,"d":"0.00"}},{"$f":"SUMIF($C73:$C80,\"P\",E73:E80)","v":{"v":0,"d":"0.00"}},null,null,{"$f":"SUMIF($C73:$C80,\"P\",H73:H80)","v":{"v":0,"d":"0.00"}},{"$f":"SUMIF($C73:$C80,\"P\",I73:I80)","v":{"v":0,"d":"0.00 €"}},{"$f":"SUMIF($C73:$C80,\"P\",J73:J80)","v":{"v":0,"d":"0.00 €"}},null,null,{"$f":"SUMIF($C73:$C80,\"P\",M73:M80)","v":{"v":0,"d":"0.00 €"}},null,{"$f":"SUMIF($C73:$C80,\"P\",O73:O80)","v":{"v":0,"d":"0.00"}},{"$f":"SUMIF($C73:$C80,\"P\",P73:P80)","v":{"v":0,"d":"0.00 €"}},null,{"$f":"SUMIF($C73:$C80,\"P\",R73:R80)","v":{"v":0,"d":"0.00"}}]
[null,null,"T",{"$f":"SUMIF($C73:$C80,\"T\",D73:D80)","v":{"v":0,"d":"0.00"}},{"$f":"SUMIF($C73:$C80,\"T\",E73:E80)","v":{"v":0,"d":"0.00"}},null,null,{"$f":"SUMIF($C73:$C80,\"T\",H73:H80)","v":{"v":0,"d":"0.00"}},{"$f":"SUMIF($C73:$C80,\"T\",I73:I80)","v":{"v":0,"d":"0.00 €"}},{"$f":"SUMIF($C73:$C80,\"T\",J73:J80)","v":{"v":0,"d":"0.00 €"}},null,null,{"$f":"SUMIF($C73:$C80,\"T\",M73:M80)","v":{"v":0,"d":"0.00 €"}},null,{"$f":"SUMIF($C73:$C80,\"T\",O73:O80)","v":{"v":0,"d":"0.00"}},{"$f":"SUMIF($C73:$C80,\"T\",P73:P80)","v":{"v":0,"d":"0.00 €"}},null,{"$f":"SUMIF($C73:$C80,\"T\",R73:R80)","v":{"v":0,"d":"0.00"}}]
[null,"Infirmier coordonnateur","P",{"$nulls":16},{"$f":"IF(AND(E73<>0,OR(J73=0,J73=\"\")),\"Saisie incohérente : ETP sans rémunération correspondante\",IF(AND(J73<>0,OR(E73=0,E73=\"\")),\"Saisie incohérente : rémunération sans ETP correspondant\",\"\"))","v":""}]
[null,"Infirmier coordonnateur","T",{"$nulls":16},""]
[null,"Infirmier diplômé d'État","P",{"$nulls":16},""]
[null,"Infirmier diplômé d'État","T",{"$nulls":16},""]
[null,"Infirmier psychiatrique","P",{"$nulls":16},""]
[null,"Infirmier psychiatrique","T",{"$nulls":16},""]
[null,"Autre personnel infirmier","P",{"$nulls":16},""]
[null,"Autre personnel infirmier","T",{"$nulls":16},""]
[null,"AUTRES AUXILIAIRES MEDICAUX",{"$nulls":5},{"v":1,"d":"100%"},{"$nulls":6},{"v":1,"d":"100%"}]
[{"$nulls":3},{"$f":"D83+D84","v":{"v":0,"d":"0.00"}},{"$f":"E83+E84","v":{"v":0,"d":"0.00"}},null,null,{"$f":"H83+H84","v":{"v":0,"d":"0.00"}},{"$f":"I83+I84","v":{"v":0,"d":"0.00 €"}},{"$f":"J83+J84","v":{"v":0,"d":"0.00 €"}},null,null,{"$f":"M83+M84","v":{"v":0,"d":"0.00 €"}},null,{"$f":"O83+O84","v":{"v":0,"d":"0.00"}},{"$f":"P83+P84","v":{"v":0,"d":"0.00 €"}},null,{"$f":"R83+R84","v":{"v":0,"d":"0.00"}},null,{"$f":"IF(ROUND((F82+G82+H82+O82),2)<>ROUND(E82,2),\"Saisie incohérente : le cumul des sections en ETP devrait être égal au total global colonne E\",IF(ROUND((K82+L82+M82+P82),0)<>ROUND(J82,0),\"Saisie incohérente : le cumul des imputations par section devrait être égal au total global colonne J\",\"\"))","v":""}]
[null,null,"P",{"$f":"SUMIF($C85:$C96,\"P\",D85:D96)","v":{"v":0,"d":"0.00"}},{"$f":"SUMIF($C85:$C96,\"P\",E85:E96)","v":{"v":0,"d":"0.00"}},null,null,{"$f":"SUMIF($C85:$C96,\"P\",H85:H96)","v":{"v":0,"d":"0.00"}},{"$f":"SUMIF($C85:$C96,\"P\",I85:I96)","v":{"v":0,"d":"0.00 €"}},{"$f":"SUMIF($C85:$C96,\"P\",J85:J96)","v":{"v":0,"d":"0.00 €"}},null,null,{"$f":"SUMIF($C85:$C96,\"P\",M85:M96)","v":{"v":0,"d":"0.00 €"}},null,{"$f":"SUMIF($C85:$C96,\"P\",O85:O96)","v":{"v":0,"d":"0.00"}},{"$f":"SUMIF($C85:$C96,\"P\",P85:P96)","v":{"v":0,"d":"0.00 €"}},null,{"$f":"SUMIF($C85:$C96,\"P\",R85:R96)","v":{"v":0,"d":"0.00"}}]
[null,null,"T",{"$f":"SUMIF($C85:$C96,\"T\",D85:D96)","v":{"v":0,"d":"0.00"}},{"$f":"SUMIF($C85:$C96,\"T\",E85:E96)","v":{"v":0,"d":"0.00"}},null,null,{"$f":"SUMIF($C85:$C96,\"T\",H85:H96)","v":{"v":0,"d":"0.00"}},{"$f":"SUMIF($C85:$C96,\"T\",I85:I96)","v":{"v":0,"d":"0.00 €"}},{"$f":"SUMIF($C85:$C96,\"T\",J85:J96)","v":{"v":0,"d":"0.00 €"}},null,null,{"$f":"SUMIF($C85:$C96,\"T\",M85:M96)","v":{"v":0,"d":"0.00 €"}},null,{"$f":"SUMIF($C85:$C96,\"T\",O85:O96)","v":{"v":0,"d":"0.00"}},{"$f":"SUMIF($C85:$C96,\"T\",P85:P96)","v":{"v":0,"d":"0.00 €"}},null,{"$f":"SUMIF($C85:$C96,\"T\",R85:R96)","v":{"v":0,"d":"0.00"}}]
[null,"Masseur-kinésithérapeute","P",{"$nulls":16},{"$f":"IF(AND(E85<>0,OR(J85=0,J85=\"\")),\"Saisie incohérente : ETP sans rémunération correspondante\",IF(AND(J85<>0,OR(E85=0,E85=\"\")),\"Saisie incohérente : rémunération sans ETP correspondant\",\"\"))","v":""}]
[null,"Masseur-kinésithérapeute","T",{"$nulls":16},""]
[null,"Ergothérapeute","P",{"$nulls":16},""]
[null,"Ergothérapeute","T",{"$nulls":16},""]
[null,"Pédicure-Podologue","P",{"$nulls":16},""]
[null,"Pédicure-Podologue","T",{"$nulls":16},""]
[null,"Psychomotricien, rééducateur en psychomotricité","P",{"$nulls":16},""]
[null,"Psychomotricien, rééducateur en psychomotricité","T",{"$nulls":16},""]
[null,"Intervenant en activité physique adaptée","P",{"$nulls":16},""]
[null,"Intervenant en activité physique adaptée","T",{"$nulls":16},""]
[null,"Autre personnel paramédical","P",{"$nulls":16},""]
[null,"Autre personnel paramédical","T",{"$nulls":16},""]
[null,"PHARMACIENS - PREPARATEURS EN PHARMACIE",{"$nulls":5},{"v":1,"d":"100%"},{"$nulls":6},{"v":1,"d":"100%"}]
[{"$nulls":3},{"$f":"D99+D100","v":{"v":0,"d":"0.00"}},{"$f":"E99+E100","v":{"v":0,"d":"0.00"}},null,null,{"$f":"H99+H100","v":{"v":0,"d":"0.00"}},{"$f":"I99+I100","v":{"v":0,"d":"0.00 €"}},{"$f":"J99+J100","v":{"v":0,"d":"0.00 €"}},null,null,{"$f":"M99+M100","v":{"v":0,"d":"0.00 €"}},null,{"$f":"O99+O100","v":{"v":0,"d":"0.00"}},{"$f":"P99+P100","v":{"v":0,"d":"0.00 €"}},null,{"$f":"R99+R100","v":{"v":0,"d":"0.00"}},null,{"$f":"IF(ROUND((F98+G98+H98+O98),2)<>ROUND(E98,2),\"Saisie incohérente : le cumul des sections en ETP devrait être égal au total global colonne E\",IF(ROUND((K98+L98+M98+P98),0)<>ROUND(J98,0),\"Saisie incohérente : le cumul des imputations par section devrait être égal au total global colonne J\",\"\"))","v":""}]
[null,null,"P",{"$f":"SUMIF($C101:$C104,\"P\",D101:D104)","v":{"v":0,"d":"0.00"}},{"$f":"SUMIF($C101:$C104,\"P\",E101:E104)","v":{"v":0,"d":"0.00"}},null,null,{"$f":"SUMIF($C101:$C104,\"P\",H101:H104)","v":{"v":0,"d":"0.00"}},{"$f":"SUMIF($C101:$C104,\"P\",I101:I104)","v":{"v":0,"d":"0.00 €"}},{"$f":"SUMIF($C101:$C104,\"P\",J101:J104)","v":{"v":0,"d":"0.00 €"}},null,null,{"$f":"SUMIF($C101:$C104,\"P\",M101:M104)","v":{"v":0,"d":"0.00 €"}},null,{"$f":"SUMIF($C101:$C104,\"P\",O101:O104)","v":{"v":0,"d":"0.00"}},{"$f":"SUMIF($C101:$C104,\"P\",P101:P104)","v":{"v":0,"d":"0.00 €"}},null,{"$f":"SUMIF($C101:$C104,\"P\",R101:R104)","v":{"v":0,"d":"0.00"}}]
[null,null,"T",{"$f":"SUMIF($C101:$C104,\"T\",D101:D104)","v":{"v":0,"d":"0.00"}},{"$f":"SUMIF($C101:$C104,\"T\",E101:E104)","v":{"v":0,"d":"0.00"}},null,null,{"$f":"SUMIF($C101:$C104,\"T\",H101:H104)","v":{"v":0,"d":"0.00"}},{"$f":"SUMIF($C101:$C104,\"T\",I101:I104)","v":{"v":0,"d":"0.00 €"}},{"$f":"SUMIF($C101:$C104,\"T\",J101:J104)","v":{"v":0,"d":"0.00 €"}},null,null,{"$f":"SUMIF($C101:$C104,\"T\",M101:M104)","v":{"v":0,"d":"0.00 €"}},null,{"$f":"SUMIF($C101:$C104,\"T\",O101:O104)","v":{"v":0,"d":"0.00"}},{"$f":"SUMIF($C101:$C104,\"T\",P101:P104)","v":{"v":0,"d":"0.00 €"}},null,{"$f":"SUMIF($C101:$C104,\"T\",R101:R104)","v":{"v":0,"d":"0.00"}}]
[null,"Pharmacien","P",{"$nulls":16},{"$f":"IF(AND(E101<>0,OR(J101=0,J101=\"\")),\"Saisie incohérente : ETP sans rémunération correspondante\",IF(AND(J101<>0,OR(E101=0,E101=\"\")),\"Saisie incohérente : rémunération sans ETP correspondant\",\"\"))","v":""}]
[null,"Pharmacien","T",{"$nulls":16},{"$f":"IF(AND(E102<>0,OR(J102=0,J102=\"\")),\"Saisie incohérente : ETP sans rémunération correspondante\",IF(AND(J102<>0,OR(E102=0,E102=\"\")),\"Saisie incohérente : rémunération sans ETP correspondant\",\"\"))","v":""}]
[null,"Préparateur en pharmacie","P",{"$nulls":16},{"$f":"IF(AND(E103<>0,OR(J103=0,J103=\"\")),\"Saisie incohérente : ETP sans rémunération correspondante\",IF(AND(J103<>0,OR(E103=0,E103=\"\")),\"Saisie incohérente : rémunération sans ETP correspondant\",\"\"))","v":""}]
[null,"Préparateur en pharmacie","T",{"$nulls":16},{"$f":"IF(AND(E104<>0,OR(J104=0,J104=\"\")),\"Saisie incohérente : ETP sans rémunération correspondante\",IF(AND(J104<>0,OR(E104=0,E104=\"\")),\"Saisie incohérente : rémunération sans ETP correspondant\",\"\"))","v":""}]
[null,"MEDECIN",{"$nulls":5},{"v":1,"d":"100%"},{"$nulls":6},{"v":1,"d":"100%"}]
[{"$nulls":3},{"$f":"D107+D108","v":{"v":0,"d":"0.00"}},{"$f":"E107+E108","v":{"v":0,"d":"0.00"}},null,null,{"$f":"H107+H108","v":{"v":0,"d":"0.00"}},{"$f":"I107+I108","v":{"v":0,"d":"0.00 €"}},{"$f":"J107+J108","v":{"v":0,"d":"0.00 €"}},null,null,{"$f":"M107+M108","v":{"v":0,"d":"0.00 €"}},null,{"$f":"O107+O108","v":{"v":0,"d":"0.00"}},{"$f":"P107+P108","v":{"v":0,"d":"0.00 €"}},null,{"$f":"R107+R108","v":{"v":0,"d":"0.00"}},null,{"$f":"IF(ROUND((F106+G106+H106+O106),2)<>ROUND(E106,2),\"Saisie incohérente : le cumul des sections en ETP devrait être égal au total global colonne E\",IF(ROUND((K106+L106+M106+P106),0)<>ROUND(J106,0),\"Saisie incohérente : le cumul des imputations par section devrait être égal au total global colonne J\",\"\"))","v":""}]
[null,null,"P",{"$f":"SUMIF($C109:$C118,\"P\",D109:D118)","v":{"v":0,"d":"0.00"}},{"$f":"SUMIF($C109:$C118,\"P\",E109:E118)","v":{"v":0,"d":"0.00"}},null,null,{"$f":"SUMIF($C109:$C118,\"P\",H109:H118)","v":{"v":0,"d":"0.00"}},{"$f":"SUMIF($C109:$C118,\"P\",I109:I118)","v":{"v":0,"d":"0.00 €"}},{"$f":"SUMIF($C109:$C118,\"P\",J109:J118)","v":{"v":0,"d":"0.00 €"}},null,null,{"$f":"SUMIF($C109:$C118,\"P\",M109:M118)","v":{"v":0,"d":"0.00 €"}},null,{"$f":"SUMIF($C109:$C118,\"P\",O109:O118)","v":{"v":0,"d":"0.00"}},{"$f":"SUMIF($C109:$C118,\"P\",P109:P118)","v":{"v":0,"d":"0.00 €"}},null,{"$f":"SUMIF($C109:$C118,\"P\",R109:R118)","v":{"v":0,"d":"0.00"}}]
[null,null,"T",{"$f":"SUMIF($C109:$C118,\"T\",D109:D118)","v":{"v":0,"d":"0.00"}},{"$f":"SUMIF($C109:$C118,\"T\",E109:E118)","v":{"v":0,"d":"0.00"}},null,null,{"$f":"SUMIF($C109:$C118,\"T\",H109:H118)","v":{"v":0,"d":"0.00"}},{"$f":"SUMIF($C109:$C118,\"T\",I109:I118)","v":{"v":0,"d":"0.00 €"}},{"$f":"SUMIF($C109:$C118,\"T\",J109:J118)","v":{"v":0,"d":"0.00 €"}},null,null,{"$f":"SUMIF($C109:$C118,\"T\",M109:M118)","v":{"v":0,"d":"0.00 €"}},null,{"$f":"SUMIF($C109:$C118,\"T\",O109:O118)","v":{"v":0,"d":"0.00"}},{"$f":"SUMIF($C109:$C118,\"T\",P109:P118)","v":{"v":0,"d":"0.00 €"}},null,{"$f":"SUMIF($C109:$C118,\"T\",R109:R118)","v":{"v":0,"d":"0.00"}}]
[null,"Médecin coordonnateur","P",{"$nulls":16},{"$f":"IF(AND(E109<>0,OR(J109=0,J109=\"\")),\"Saisie incohérente : ETP sans rémunération correspondante\",IF(AND(J109<>0,OR(E109=0,E109=\"\")),\"Saisie incohérente : rémunération sans ETP correspondant\",\"\"))","v":""}]
[null,"Médecin coordonnateur","T",{"$nulls":16},""]
[null,"Médecin généraliste","P",{"$nulls":16},""]
[null,"Médecin généraliste","T",{"$nulls":16},""]
[null,"Gériatre","P",{"$nulls":16},""]
[null,"Gériatre","T",{"$nulls":16},""]
[null,"Psychiatre","P",{"$nulls":16},""]
[null,"Psychiatre","T",{"$nulls":16},""]
[null,"Autre médecin","P",{"$nulls":16},""]
[null,"Autre médecin","T",{"$nulls":16},""]
[null,"TOTAL Personnel salarié",null,{"$f":"D106+D98+D82+D70+D64+D50+D44+D36+D24+D10","v":{"v":0,"d":"0.00"}},{"v":0,"d":"0.00"},{"v":0,"d":"0.00"},{"v":0,"d":"0.00"},{"v":0,"d":"0.00"},{"$f":"I106+I98+I82+I70+I64+I50+I44+I36+I24+I10","v":{"v":0,"d":"0.00 €"}},{"v":0,"d":"0.00 €"},{"v":0,"d":"0.00 €"},{"v":0,"d":"0.00 €"},{"$f":"M106+M98+M82+M70+M64+M50+M44+M36+M24+M10","v":{"v":0,"d":"0.00 €"}},null,{"$f":"O106+O98+O82+O70+O64+O50+O44+O36+O24+O10","v":{"v":0,"d":"0.00"}},{"$f":"P106+P98+P82+P70+P64+P50+P44+P36+P24+P10","v":{"v":0,"d":"0.00 €"}},null,{"$f":"R10+R24+R36+R44+R50+R64+R70+R82+R98+R106","v":{"v":0,"d":"0.00"}}]
[null,"(*) Nombre d'ETP et charges inscrits au tableau prévisionnel des emplois rémunérés annexé au cadre EPRD de l'année N-1"]
[null,{"$f":"IF(OR(E121<>\"\",J121<>\"\",AND(E121<>\"\",J121<>\"\")),\"Vérification des ETP et des rémunérations :\",\"\")","v":"Vérification des ETP et des rémunérations :"},null,null,{"$f":"IF(OR(E119=\"\",E119=0),\"Total global en colonne E devrait être rempli\",IF(ROUND((F119+G119+H119+O119),2)<>ROUND(E119,2),\"Cumul des sections devrait être égal au total global en colonne E\",\"\"))","v":"Total global en colonne E devrait être rempli"},{"$nulls":4},{"$f":"IF(OR(J119=\"\",J119=0),\"Total global en colonne J devrait être rempli\",IF(ROUND((K119+L119+M119+P119),2)<>ROUND(J119,2),\"Cumul des sections devrait être égal au total global en colonne J\",\"\"))","v":"Total global en colonne J devrait être rempli"},{"$nulls":7},{"$f":"IF(OR(R119=\"\",R119=0),\"ETP travaillés non saisis (colonne O)\",\"\")","v":"ETP travaillés non saisis (colonne O)"}]
[null,"Répartition des charges relatives au personnel extérieur à l'établissement (hors experts juridiques et comptables et commissaire aux comptes)"]
[]
[{"$nulls":4},{"$f":"IF('Page de garde'!$D$4=\"\",\"EPRD N\",\"EPRD \"&'Page de garde'!$D$4)","v":"EPRD N"},{"$nulls":4},{"$f":"IF('Page de garde'!$D$4=\"\",\"EPRD N\",\"EPRD \"&'Page de garde'!$D$4)","v":"EPRD N"},{"$nulls":4},"EPRD N"]
[null,"PERSONNEL (une ligne par emploi)","Emploi permanent (P) /  temporaire (T)",{"$f":"IF('Page de garde'!$D$4=\"\",\"Nombre d'ETP inscrits à l'EPRD N-1 (*)\",\"Nombre d'ETP inscrits à l'EPRD \"&'Page de garde'!$D$4-1&\" (*)\" )","v":"Nombre d'ETP inscrits à l'EPRD N-1 (*)"},"Nombre d'ETP","Hébergement \nen ETP","Dépendance \nen ETP","Soins \nen ETP",{"$f":"IF('Page de garde'!$D$4=\"\",\"Charges relatives au personnel extérieur à l'établissement N-1 (*)\",\"Charges relatives au personnel extérieur à l'établissement \"&'Page de garde'!$D$4-1&\" (*)\" )","v":"Charges relatives au personnel extérieur à l'établissement N-1 (*)"},"Charges relatives au personnel extérieur à l'établissement","IMPUTATION à la section \"Hébergement\"","IMPUTATION à la section \"Dépendance\"","IMPUTATION à la section \"Soins\"",null,"Soins et entretien de l'autonomie en ETP","Charges relatives au personnel extérieur \nImputation à la section \"Soins et entretien de l'autonomie\""]
[null,"DIRECTION - ADMINISTRATION",{"$nulls":3},{"v":1,"d":"100%"}]
[{"$nulls":3},{"$f":"SUM(D128:D137)","v":{"v":0,"d":"0.00"}},{"$f":"SUM(E128:E137)","v":{"v":0,"d":"0.00"}},{"$f":"SUM(F128:F137)","v":{"v":0,"d":"0.00"}},null,{"$f":"SUM(H128:H137)","v":{"v":0,"d":"0.00"}},{"$f":"SUM(I128:I137)","v":{"v":0,"d":"0.00 €"}},{"$f":"SUM(J128:J137)","v":{"v":0,"d":"0.00 €"}},{"$f":"SUM(K128:K137)","v":{"v":0,"d":"0.00 €"}},null,{"$f":"SUM(M128:M137)","v":{"v":0,"d":"0.00 €"}},null,{"$f":"SUM(O128:O137)","v":{"v":0,"d":"0.00"}},{"$f":"SUM(P128:P137)","v":{"v":0,"d":"0.00 €"}}]
[null,"Directeur","P"]
[null,"Directeur","T"]
[null,"Médecin directeur","P"]
[null,"Médecin directeur","T"]
[null,"Directeur adjoint, attaché de direction, économe","P"]
[null,"Directeur adjoint, attaché de direction, économe","T"]
[null,"Agent administratif et personnel de bureau","P"]
[null,"Agent administratif et personnel de bureau","T"]
[null,"Autre personnel de direction ou d'administration","P"]
[null,"Autre personnel de direction ou d'administration","T"]
[null,"CUISINE - SERVICES GENERAUX - Diététicien",{"$nulls":3},{"v":1,"d":"100%"}]
[{"$nulls":3},{"$f":"SUM(D140:D147)","v":{"v":0,"d":"0.00"}},{"$f":"SUM(E140:E147)","v":{"v":0,"d":"0.00"}},{"$f":"SUM(F140:F147)","v":{"v":0,"d":"0.00"}},null,{"$f":"SUM(H140:H147)","v":{"v":0,"d":"0.00"}},{"$f":"SUM(I140:I147)","v":{"v":0,"d":"0.00 €"}},{"$f":"SUM(J140:J147)","v":{"v":0,"d":"0.00 €"}},{"$f":"SUM(K140:K147)","v":{"v":0,"d":"0.00 €"}},null,{"$f":"SUM(M140:M147)","v":{"v":0,"d":"0.00 €"}},null,{"$f":"SUM(O140:O147)","v":{"v":0,"d":"0.00"}},{"$f":"SUM(P140:P147)","v":{"v":0,"d":"0.00 €"}}]
[null,"Ouvrier professionnel","P"]
[null,"Ouvrier professionnel","T"]
[null,"Agent de service général","P"]
[null,"Agent de service général","T"]
[null,"Diététicien","P"]
[null,"Diététicien","T"]
[null,"Autre personnel de cuisine - services généraux","P"]
[null,"Autre personnel de cuisine - services généraux","T"]
[null,"ANIMATION - SERVICE SOCIAL",{"$nulls":3},{"v":1,"d":"100%"}]
[{"$nulls":3},{"$f":"SUM(D150:D153)","v":{"v":0,"d":"0.00"}},{"$f":"SUM(E150:E153)","v":{"v":0,"d":"0.00"}},{"$f":"SUM(F150:F153)","v":{"v":0,"d":"0.00"}},null,{"$f":"SUM(H150:H153)","v":{"v":0,"d":"0.00"}},{"$f":"SUM(I150:I153)","v":{"v":0,"d":"0.00 €"}},{"$f":"SUM(J150:J153)","v":{"v":0,"d":"0.00 €"}},{"$f":"SUM(K150:K153)","v":{"v":0,"d":"0.00 €"}},null,{"$f":"SUM(M150:M153)","v":{"v":0,"d":"0.00 €"}},null,{"$f":"SUM(O150:O153)","v":{"v":0,"d":"0.00"}},{"$f":"SUM(P150:P153)","v":{"v":0,"d":"0.00 €"}}]
[null,"Animateur social","P"]
[null,"Animateur social","T"]
[null,"Autre personnel d'animation - service social","P"]
[null,"Autre personnel d'animation - service social","T"]
[null,"ASH - agents de service affectés aux fonctions de blanchissage, nettoyage et service des repas",{"$nulls":3},{"$f":"IF(E155=0,\"\",F155/E155)","v":""},{"$f":"IF(E155=0,\"\",G155/E155)","v":""},{"$nulls":7},{"$f":"IF(E155=0,\"\",O155/E155)","v":""}]
[{"$nulls":3},{"$f":"SUM(D156:D157)","v":{"v":0,"d":"0.00"}},{"$f":"SUM(E156:E157)","v":{"v":0,"d":"0.00"}},{"v":0,"d":"0.00"},{"$f":"SUM(G156:G157)","v":{"v":0,"d":"0.00"}},{"v":0,"d":"0.00"},{"v":0,"d":"0.00 €"},{"v":0,"d":"0.00 €"},{"v":0,"d":"0.00 €"},{"v":0,"d":"0.00 €"},{"v":0,"d":"0.00 €"},null,{"$f":"SUM(O156:O157)","v":{"v":0,"d":"0.00"}},{"$f":"SUM(P156:P157)","v":{"v":0,"d":"0.00 €"}}]
[null,null,"P"]
[null,null,"P"]
[null,"AIDES SOIGNANTS, AIDES MEDICO-PEDAGOGIQUES ET ACCOMPAGNANTS EDUCATIFS ET SOCIAUX",{"$nulls":4},{"$f":"IF(E159=0,\"\",G159/E159)","v":""},{"$f":"IF(E159=0,\"\",H159/E159)","v":""},{"$nulls":6},{"v":1,"d":"100%"}]
[{"$nulls":3},{"$f":"SUM(D160:D169)","v":{"v":0,"d":"0.00"}},{"$f":"SUM(E160:E169)","v":{"v":0,"d":"0.00"}},null,{"$f":"SUM(G160:G169)","v":{"v":0,"d":"0.00"}},{"$f":"SUM(H160:H169)","v":{"v":0,"d":"0.00"}},{"$f":"SUM(I160:I169)","v":{"v":0,"d":"0.00 €"}},{"$f":"SUM(J160:J169)","v":{"v":0,"d":"0.00 €"}},null,{"$f":"SUM(L160:L169)","v":{"v":0,"d":"0.00 €"}},{"$f":"SUM(M160:M169)","v":{"v":0,"d":"0.00 €"}},null,{"$f":"SUM(O160:O169)","v":{"v":0,"d":"0.00"}},{"$f":"SUM(P160:P169)","v":{"v":0,"d":"0.00 €"}}]
[null,"Aide-soignant non assistant de soins en gérontologie","P"]
[null,"Aide-soignant non assistant de soins en gérontologie","T"]
[null,"Aide-soignant assistant de soins en gérontologie","P"]
[null,"Aide-soignant assistant de soins en gérontologie","T"]
[null,"A.M.P.","P"]
[null,"A.M.P.","T"]
[null,"A.E.S.","P"]
[null,"A.E.S.","T"]
[null,"Autre personnel","P"]
[null,"Autre personnel","T"]
[null,"PSYCHOLOGUES",{"$nulls":4},{"v":1,"d":"100%"},{"$nulls":7},{"v":1,"d":"100%"}]
[{"$nulls":3},{"$f":"SUM(D172:D173)","v":{"v":0,"d":"0.00"}},{"$f":"SUM(E172:E173)","v":{"v":0,"d":"0.00"}},null,{"$f":"SUM(G172:G173)","v":{"v":0,"d":"0.00"}},{"$f":"SUM(H172:H173)","v":{"v":0,"d":"0.00"}},{"$f":"SUM(I172:I173)","v":{"v":0,"d":"0.00 €"}},{"$f":"SUM(J172:J173)","v":{"v":0,"d":"0.00 €"}},null,{"$f":"SUM(L172:L173)","v":{"v":0,"d":"0.00 €"}},{"$f":"SUM(M172:M173)","v":{"v":0,"d":"0.00 €"}},null,{"$f":"SUM(O172:O173)","v":{"v":0,"d":"0.00"}},{"$f":"SUM(P172:P173)","v":{"v":0,"d":"0.00 €"}}]
[null,null,"P"]
[null,null,"P"]
[null,"INFIRMIERS",{"$nulls":5},{"v":1,"d":"100%"},{"$nulls":6},{"v":1,"d":"100%"}]
[{"$nulls":3},{"$f":"SUM(D176:D183)","v":{"v":0,"d":"0.00"}},{"$f":"SUM(E176:E183)","v":{"v":0,"d":"0.00"}},null,null,{"$f":"SUM(H176:H183)","v":{"v":0,"d":"0.00"}},{"$f":"SUM(I176:I183)","v":{"v":0,"d":"0.00 €"}},{"$f":"SUM(J176:J183)","v":{"v":0,"d":"0.00 €"}},null,null,{"$f":"SUM(M176:M183)","v":{"v":0,"d":"0.00 €"}},null,{"$f":"SUM(O176:O183)","v":{"v":0,"d":"0.00"}},{"$f":"SUM(P176:P183)","v":{"v":0,"d":"0.00 €"}}]
[null,"Infirmier coordonnateur","P"]
[null,"Infirmier coordonnateur","T"]
[null,"Infirmier diplômé d'État","P"]
[null,"Infirmier diplômé d'État","T"]
[null,"Infirmier psychiatrique","P"]
[null,"Infirmier psychiatrique","T"]
[null,"Autre personnel infirmier","P"]
[null,"Autre personnel infirmier","T"]
[null,"AUTRES AUXILIAIRES MEDICAUX",{"$nulls":5},{"v":1,"d":"100%"},{"$nulls":6},{"v":1,"d":"100%"}]
[{"$nulls":3},{"$f":"SUM(D186:D197)","v":{"v":0,"d":"0.00"}},{"$f":"SUM(E186:E197)","v":{"v":0,"d":"0.00"}},null,null,{"$f":"SUM(H186:H197)","v":{"v":0,"d":"0.00"}},{"$f":"SUM(I186:I197)","v":{"v":0,"d":"0.00 €"}},{"$f":"SUM(J186:J197)","v":{"v":0,"d":"0.00 €"}},null,null,{"$f":"SUM(M186:M197)","v":{"v":0,"d":"0.00 €"}},null,{"$f":"SUM(O186:O197)","v":{"v":0,"d":"0.00"}},{"$f":"SUM(P186:P197)","v":{"v":0,"d":"0.00 €"}}]
[null,"Masseur-kinésithérapeute","P"]
[null,"Masseur-kinésithérapeute","T"]
[null,"Ergothérapeute","P"]
[null,"Ergothérapeute","T"]
[null,"Pédicure-Podologue","P"]
[null,"Pédicure-Podologue","T"]
[null,"Psychomotricien, rééducateur en psychomotricité","P"]
[null,"Psychomotricien, rééducateur en psychomotricité","T"]
[null,"Intervenant en activité physique adaptée","P"]
[null,"Intervenant en activité physique adaptée","T"]
[null,"Autre personnel paramédical","P"]
[null,"Autre personnel paramédical","T"]
[null,"PHARMACIENS - PREPARATEURS EN PHARMACIE",{"$nulls":5},{"v":1,"d":"100%"},{"$nulls":6},{"v":1,"d":"100%"}]
[{"$nulls":3},{"$f":"SUM(D200:D203)","v":{"v":0,"d":"0.00"}},{"$f":"SUM(E200:E203)","v":{"v":0,"d":"0.00"}},null,null,{"$f":"SUM(H200:H203)","v":{"v":0,"d":"0.00"}},{"$f":"SUM(I200:I203)","v":{"v":0,"d":"0.00 €"}},{"$f":"SUM(J200:J203)","v":{"v":0,"d":"0.00 €"}},null,null,{"$f":"SUM(M200:M203)","v":{"v":0,"d":"0.00 €"}},null,{"$f":"SUM(O200:O203)","v":{"v":0,"d":"0.00"}},{"$f":"SUM(P200:P203)","v":{"v":0,"d":"0.00 €"}}]
[null,"Pharmacien","P"]
[null,"Pharmacien","T"]
[null,"Préparateur en pharmacie","P"]
[null,"Préparateur en pharmacie","T"]
[null,"MEDECIN",{"$nulls":5},{"v":1,"d":"100%"},{"$nulls":6},{"v":1,"d":"100%"}]
[{"$nulls":3},{"$f":"SUM(D206:D215)","v":{"v":0,"d":"0.00"}},{"$f":"SUM(E206:E215)","v":{"v":0,"d":"0.00"}},null,null,{"$f":"SUM(H206:H215)","v":{"v":0,"d":"0.00"}},{"$f":"SUM(I206:I215)","v":{"v":0,"d":"0.00 €"}},{"$f":"SUM(J206:J215)","v":{"v":0,"d":"0.00 €"}},null,null,{"$f":"SUM(M206:M215)","v":{"v":0,"d":"0.00 €"}},null,{"$f":"SUM(O206:O215)","v":{"v":0,"d":"0.00"}},{"$f":"SUM(P206:P215)","v":{"v":0,"d":"0.00 €"}}]
[null,"Médecin coordonnateur","P"]
[null,"Médecin coordonnateur","T"]
[null,"Médecin généraliste","P"]
[null,"Médecin généraliste","T"]
[null,"Gériatre","P"]
[null,"Gériatre","T"]
[null,"Psychiatre","P"]
[null,"Psychiatre","T"]
[null,"Autre médecin","P"]
[null,"Autre médecin","T"]
[null,"TOTAL Personnel extérieur",null,{"$f":"D205+D199+D185+D175+D171+D155+D159+D149+D139+D127","v":{"v":0,"d":"0.00"}},{"$f":"E205+E199+E185+E175+E171+E155+E159+E149+E139+E127","v":{"v":0,"d":"0.00"}},{"$f":"F205+F199+F185+F175+F171+F155+F159+F149+F139+F127","v":{"v":0,"d":"0.00"}},{"$f":"G205+G199+G185+G175+G171+G155+G159+G149+G139+G127","v":{"v":0,"d":"0.00"}},{"$f":"H205+H199+H185+H175+H171+H155+H159+H149+H139+H127","v":{"v":0,"d":"0.00"}},{"v":0,"d":"0.00 €"},{"v":0,"d":"0.00 €"},{"v":0,"d":"0.00 €"},{"v":0,"d":"0.00 €"},{"$f":"M205+M199+M185+M175+M171+M155+M159+M149+M139+M127","v":{"v":0,"d":"0.00 €"}},null,{"$f":"O205+O199+O185+O175+O171+O155+O159+O149+O139+O127","v":{"v":0,"d":"0.00"}},{"$f":"P205+P199+P185+P175+P171+P155+P159+P149+P139+P127","v":{"v":0,"d":"0.00 €"}}]
[null,"(*) Nombre d'ETP et charges inscrits au tableau prévisionnel des emplois rémunérés annexé au cadre EPRD de l'année N-1"]

{"sheet":"Charges soc. fisc.","index":9,"n_rows":61,"n_cols":9,"rows_kept":61,"hidden":true,"merged":[[1,1,1,4],[2,1,2,4],[4,1,4,8],[6,1,6,5],[16,4,16,5],[23,4,23,5]]}
[]
[null,"Raison sociale :"]
[null,"FINESS ET :"]
[]
[null,"Charges de l'employeur sur rémunérations au titre de l'année N (Personnel figurant au tableau des effectifs)"]
[]
[null,"Comptes / intitulés (*)",{"$nulls":4},"Assiette","Taux","Montant"]
[null,63,"Impôts, taxes et versements assimilés",{"$nulls":5},{"$f":"I9+I18","v":{"v":0,"d":"0.00 €"}}]
[null,null,631," Impôts, taxes et versements assimilés sur rémunérations (administration des impôts)",{"$nulls":4},{"$f":"I10+SUM(I15:I16)","v":{"v":0,"d":"0.00 €"}}]
[{"$nulls":3},6311,"Taxe sur les salaires",null,{"$f":"G11","v":{"v":0,"d":"0.00 €"}},{"$f":"IF(G10=0,0,I10/G10)","v":{"v":0,"d":"0.00%"}}]
[{"$nulls":4},"Taux normal"]
[{"$nulls":4},"1er taux majoré"]
[{"$nulls":4},"2ème taux majoré"]
[{"$nulls":4},"3ème taux majoré"]
[{"$nulls":3},6312,"Taxe d'apprentissage"]
[{"$nulls":3},6318,"Autres impôts, taxes et versements assimilés sur rémunérations"]
[]
[null,null,633," Impôts, taxes et versements assimilés sur rémunérations (autres organismes)",{"$nulls":4},{"$f":"SUM(I19:I22)","v":{"v":0,"d":"0.00 €"}}]
[{"$nulls":3},6331,"Versement transport"]
[{"$nulls":3},6332,"Allocation logement"]
[{"$nulls":3},6333,"Participation des employeurs à la formation professionnelle continue"]
[{"$nulls":3},6338,"Autres impôts, taxes et versements assimilés sur rémunérations"]
[]
[]
[null,645,"Charges de sécurité sociale et de prévoyance",{"$nulls":5},{"$f":"I26+I36-I46","v":{"v":0,"d":"0.00 €"}}]
[null,null,6451,"Personnel non médical",null,null,{"$f":"G28","v":{"v":0,"d":"0.00 €"}},{"$f":"IF(G26=0,0,I26/G26)","v":{"v":0,"d":"0.00%"}},{"$f":"I27+SUM(I31:I35)","v":{"v":0,"d":"0.00 €"}}]
[{"$nulls":3},64511,"Cotisations à l'URSSAF",null,{"$f":"G28","v":{"v":0,"d":"0.00 €"}},{"$f":"IF(G27=0,0,I27/G27)","v":{"v":0,"d":"0.00%"}},{"$f":"SUM(I28:I30)","v":{"v":0,"d":"0.00 €"}}]
[{"$nulls":4},"Sur totalité des salaires"]
[{"$nulls":4},"Sur salaires plafonnés (tranche A)"]
[{"$nulls":4},"URSSAF prévoyance"]
[{"$nulls":3},64512,"Cotisations aux mutuelles"]
[{"$nulls":3},64513,"Cotisations aux caisses de retraite"]
[{"$nulls":3},64514,"Cotisations à l'ASSEDIC"]
[{"$nulls":3},64515,"Cotisations à la CNRACL (établissements publics)"]
[{"$nulls":3},64518,"Cotisations aux autres organismes sociaux (à préciser)"]
[null,null,6452,"Personnel médical",null,null,{"$f":"G38","v":{"v":0,"d":"0.00 €"}},{"$f":"IF(G36=0,0,I36/G36)","v":{"v":0,"d":"0.00%"}},{"$f":"I37+SUM(I41:I45)","v":{"v":0,"d":"0.00 €"}}]
[{"$nulls":3},64521,"Cotisations à l'URSSAF",null,{"$f":"G38","v":{"v":0,"d":"0.00 €"}},{"$f":"IF(G37=0,0,I37/G37)","v":{"v":0,"d":"0.00%"}},{"$f":"SUM(I38:I40)","v":{"v":0,"d":"0.00 €"}}]
[{"$nulls":4},"Sur totalité des salaires"]
[{"$nulls":4},"Sur salaires plafonnés (tranche A)"]
[{"$nulls":4},"URSSAF prévoyance"]
[{"$nulls":3},64522,"Cotisations aux mutuelles"]
[{"$nulls":3},64523,"Cotisations aux caisses de retraite"]
[{"$nulls":3},64524,"Cotisations à l'ASSEDIC"]
[{"$nulls":3},64525,"Cotisations à la CNRACL (établissements publics)"]
[{"$nulls":3},64528,"Cotisations aux autres organismes sociaux (à préciser)"]
[null,null,6459,"Remboursements sur charges de sécurité sociale et de prévoyance"]
[null,647,"Autres charges sociales",{"$nulls":5},{"$f":"SUM(I48:I53)-I59","v":{"v":0,"d":"0.00 €"}}]
[{"$nulls":3},6471,"Prestations versées pour le compte du FNAL"]
[{"$nulls":3},6472,"Fonds de solidarité"]
[{"$nulls":3},6473,"Allocations de chômage"]
[{"$nulls":3},6474,"Fonds d'insertion des personnes handicapées"]
[{"$nulls":3},6475,"Médecine du travail"]
[{"$nulls":3},6478,"Divers",{"$nulls":3},{"$f":"SUM(I54:I56)+I58","v":{"v":0,"d":"0.00 €"}}]
[{"$nulls":4},64781,"Cartes de transport"]
[{"$nulls":4},64783,"Comité d'hygiène et de sécurité"]
[{"$nulls":4},64784,"Œuvres sociales"]
[{"$nulls":5},"Dont fonctionnement"]
[{"$nulls":4},64788,"Autres (à préciser)"]
[{"$nulls":3},6479,"Remboursements sur autres charges sociales"]
[null,"  Allègements sur charges sociales et fiscales"]
[null,"(*) A compléter si nécessaire"]

{"sheet":"TPER type EHPAD_SF","index":10,"n_rows":218,"n_cols":18,"rows_kept":218,"hidden":true,"merged":[[1,1,1,2],[1,3,1,5],[2,1,2,2],[2,3,2,5],[3,1,3,2],[3,3,3,5],[5,1,5,12],[7,4,7,7],[7,9,7,12],[7,14,7,15],[97,1,98,1],[120,1,120,5],[122,1,122,12],[124,4,124,7],[124,9,124,12],[124,14,124,15],[198,1,199,1],[217,1,217,5]]}
[]
[null,"Dénomination du CRP sans Finess :"]
[null,"N° Identifiant : "]
[null,"FINESS de rattachement :"]
[]
[null,"Annexe 6A : Tableau prévisionnel des effectifs rémunérés - Répartition des charges relatives au personnel salarié dans les EHPAD, PUV et AJ (y compris personnel de remplacement)",{"$nulls":15},"Données complémentaires"]
[]
[{"$nulls":4},{"$f":"IF('Page de garde'!$D$4=\"\",\"EPRD N\",\"EPRD \"&'Page de garde'!$D$4)","v":"EPRD N"},{"$nulls":4},{"$f":"IF('Page de garde'!$D$4=\"\",\"EPRD N\",\"EPRD \"&'Page de garde'!$D$4)","v":"EPRD N"},{"$nulls":4},"EPRD N"]
[null,"PERSONNEL (une ligne par emploi, le cas échéant subdivisée en une ligne \"emploi permanent\" et une ligne \"emploi temporaire\")","Emploi permanent (P) /  temporaire (T)",{"$f":"IF('Page de garde'!$D$4=\"\",\"Nombre d'ETP inscrits à l'EPRD N-1 (*)\",\"Nombre d'ETP inscrits à l'EPRD \"&'Page de garde'!$D$4-1&\" (*)\" )","v":"Nombre d'ETP inscrits à l'EPRD N-1 (*)"},"Nombre d'ETP","Hébergement \nen ETP","Dépendance \nen ETP","Soins \nen ETP",{"$f":"IF('Page de garde'!$D$4=\"\",\"Rémunérations brutes + charges sociales et fiscales N-1 (*)\",\"Rémunérations brutes + charges sociales et fiscales \"&'Page de garde'!$D$4-1&\" (*)\" )","v":"Rémunérations brutes + charges sociales et fiscales N-1 (*)"},"Rémunérations brutes + charges sociales et fiscales","Imputation à la section \"Hébergement\"","Imputation à la section \"Dépendance\"","Imputation à la section \"Soins\"",null,"Soins et entretien de l'autonomie en ETP","Rémunérations brutes + charges sociales et fiscales \nImputation à la section \"Soins et entretien de l'autonomie\"",null,"Nombre d'ETP travaillés \nprévus "]
[null,"DIRECTION - ADMINISTRATION",{"$nulls":3},{"v":1,"d":"100%"}]
[{"$nulls":3},{"$f":"D12+D13","v":{"v":0,"d":"0.00"}},{"$f":"E12+E13","v":{"v":0,"d":"0.00"}},{"$f":"F12+F13","v":{"v":0,"d":"0.00"}},null,{"$f":"H12+H13","v":{"v":0,"d":"0.00"}},{"$f":"I12+I13","v":{"v":0,"d":"0.00 €"}},{"$f":"J12+J13","v":{"v":0,"d":"0.00 €"}},{"$f":"K12+K13","v":{"v":0,"d":"0.00 €"}},null,{"$f":"M12+M13","v":{"v":0,"d":"0.00 €"}},null,{"$f":"O12+O13","v":{"v":0,"d":"0.00"}},{"$f":"P12+P13","v":{"v":0,"d":"0.00 €"}},null,{"$f":"R12+R13","v":{"v":0,"d":"0.00"}}]
[null,null,"P",{"$f":"SUMIF($C14:$C23,\"P\",D14:D23)","v":{"v":0,"d":"0.00"}},{"$f":"SUMIF($C14:$C23,\"P\",E14:E23)","v":{"v":0,"d":"0.00"}},{"$f":"SUMIF($C14:$C23,\"P\",F14:F23)","v":{"v":0,"d":"0.00"}},null,{"$f":"SUMIF($C14:$C23,\"P\",H14:H23)","v":{"v":0,"d":"0.00"}},{"$f":"SUMIF($C14:$C23,\"P\",I14:I23)","v":{"v":0,"d":"0.00 €"}},{"$f":"SUMIF($C14:$C23,\"P\",J14:J23)","v":{"v":0,"d":"0.00 €"}},{"$f":"SUMIF($C14:$C23,\"P\",K14:K23)","v":{"v":0,"d":"0.00 €"}},null,{"$f":"SUMIF($C14:$C23,\"P\",M14:M23)","v":{"v":0,"d":"0.00 €"}},null,{"$f":"SUMIF($C14:$C23,\"P\",O14:O23)","v":{"v":0,"d":"0.00"}},{"$f":"SUMIF($C14:$C23,\"P\",P14:P23)","v":{"v":0,"d":"0.00 €"}},null,{"$f":"SUMIF($C14:$C23,\"P\",R14:R23)","v":{"v":0,"d":"0.00"}}]
[null,null,"T",{"$f":"SUMIF($C14:$C23,\"T\",D14:D23)","v":{"v":0,"d":"0.00"}},{"$f":"SUMIF($C14:$C23,\"T\",E14:E23)","v":{"v":0,"d":"0.00"}},{"$f":"SUMIF($C14:$C23,\"T\",F14:F23)","v":{"v":0,"d":"0.00"}},null,{"$f":"SUMIF($C14:$C23,\"T\",H14:H23)","v":{"v":0,"d":"0.00"}},{"$f":"SUMIF($C14:$C23,\"T\",I14:I23)","v":{"v":0,"d":"0.00 €"}},{"$f":"SUMIF($C14:$C23,\"T\",J14:J23)","v":{"v":0,"d":"0.00 €"}},{"$f":"SUMIF($C14:$C23,\"T\",K14:K23)","v":{"v":0,"d":"0.00 €"}},null,{"$f":"SUMIF($C14:$C23,\"T\",M14:M23)","v":{"v":0,"d":"0.00 €"}},null,{"$f":"SUMIF($C14:$C23,\"T\",O14:O23)","v":{"v":0,"d":"0.00"}},{"$f":"SUMIF($C14:$C23,\"T\",P14:P23)","v":{"v":0,"d":"0.00 €"}},null,{"$f":"SUMIF($C14:$C23,\"T\",R14:R23)","v":{"v":0,"d":"0.00"}}]
[null,"Directeur","P"]
[null,"Directeur","T"]
[null,"Médecin directeur","P"]
[null,"Médecin directeur","T"]
[null,"Directeur adjoint, attaché de direction, économe","P"]
[null,"Directeur adjoint, attaché de direction, économe","T"]
[null,"Agent administratif et personnel de bureau","P"]
[null,"Agent administratif et personnel de bureau","T"]
[null,"Autre personnel de direction ou d'administration","P"]
[null,"Autre personnel de direction ou d'administration","T"]
[null,"CUISINE - SERVICES GENERAUX - Diététicien",{"$nulls":3},{"v":1,"d":"100%"}]
[{"$nulls":3},{"$f":"D26+D27","v":{"v":0,"d":"0.00"}},{"$f":"E26+E27","v":{"v":0,"d":"0.00"}},{"$f":"F26+F27","v":{"v":0,"d":"0.00"}},null,{"$f":"H26+H27","v":{"v":0,"d":"0.00"}},{"$f":"I26+I27","v":{"v":0,"d":"0.00 €"}},{"$f":"J26+J27","v":{"v":0,"d":"0.00 €"}},{"$f":"K26+K27","v":{"v":0,"d":"0.00 €"}},null,{"$f":"M26+M27","v":{"v":0,"d":"0.00 €"}},null,{"$f":"O26+O27","v":{"v":0,"d":"0.00"}},{"$f":"P26+P27","v":{"v":0,"d":"0.00 €"}},null,{"$f":"R26+R27","v":{"v":0,"d":"0.00"}}]
[null,null,"P",{"$f":"SUMIF($C28:$C35,\"P\",D28:D35)","v":{"v":0,"d":"0.00"}},{"$f":"SUMIF($C28:$C35,\"P\",E28:E35)","v":{"v":0,"d":"0.00"}},{"$f":"SUMIF($C28:$C35,\"P\",F28:F35)","v":{"v":0,"d":"0.00"}},null,{"$f":"SUMIF($C28:$C35,\"P\",H28:H35)","v":{"v":0,"d":"0.00"}},{"$f":"SUMIF($C28:$C35,\"P\",I28:I35)","v":{"v":0,"d":"0.00 €"}},{"$f":"SUMIF($C28:$C35,\"P\",J28:J35)","v":{"v":0,"d":"0.00 €"}},{"$f":"SUMIF($C28:$C35,\"P\",K28:K35)","v":{"v":0,"d":"0.00 €"}},null,{"$f":"SUMIF($C28:$C35,\"P\",M28:M35)","v":{"v":0,"d":"0.00 €"}},null,{"$f":"SUMIF($C28:$C35,\"P\",O28:O35)","v":{"v":0,"d":"0.00"}},{"$f":"SUMIF($C28:$C35,\"P\",P28:P35)","v":{"v":0,"d":"0.00 €"}},null,{"$f":"SUMIF($C28:$C35,\"P\",R28:R35)","v":{"v":0,"d":"0.00"}}]
[null,null,"T",{"$f":"SUMIF($C28:$C35,\"T\",D28:D35)","v":{"v":0,"d":"0.00"}},{"$f":"SUMIF($C28:$C35,\"T\",E28:E35)","v":{"v":0,"d":"0.00"}},{"$f":"SUMIF($C28:$C35,\"T\",F28:F35)","v":{"v":0,"d":"0.00"}},null,{"$f":"SUMIF($C28:$C35,\"T\",H28:H35)","v":{"v":0,"d":"0.00"}},{"$f":"SUMIF($C28:$C35,\"T\",I28:I35)","v":{"v":0,"d":"0.00 €"}},{"$f":"SUMIF($C28:$C35,\"T\",J28:J35)","v":{"v":0,"d":"0.00 €"}},{"$f":"SUMIF($C28:$C35,\"T\",K28:K35)","v":{"v":0,"d":"0.00 €"}},null,{"$f":"SUMIF($C28:$C35,\"T\",M28:M35)","v":{"v":0,"d":"0.00 €"}},null,{"$f":"SUMIF($C28:$C35,\"T\",O28:O35)","v":{"v":0,"d":"0.00"}},{"$f":"SUMIF($C28:$C35,\"T\",P28:P35)","v":{"v":0,"d":"0.00 €"}},null,{"$f":"SUMIF($C28:$C35,\"T\",R28:R35)","v":{"v":0,"d":"0.00"}}]
[null,"Ouvrier professionnel","P"]
[null,"Ouvrier professionnel","T"]
[null,"Agent de service général","P"]
[null,"Agent de service général","T"]
[null,"Diététicien","P"]
[null,"Diététicien","T"]
[null,"Autre personnel de cuisine - services généraux","P"]
[null,"Autre personnel de cuisine - services généraux","T"]
[null,"ANIMATION - SERVICE SOCIAL",{"$nulls":3},{"v":1,"d":"100%"}]
[{"$nulls":3},{"$f":"D38+D39","v":{"v":0,"d":"0.00"}},{"$f":"E38+E39","v":{"v":0,"d":"0.00"}},{"$f":"F38+F39","v":{"v":0,"d":"0.00"}},null,{"$f":"H38+H39","v":{"v":0,"d":"0.00"}},{"$f":"I38+I39","v":{"v":0,"d":"0.00 €"}},{"$f":"J38+J39","v":{"v":0,"d":"0.00 €"}},{"$f":"K38+K39","v":{"v":0,"d":"0.00 €"}},null,{"$f":"M38+M39","v":{"v":0,"d":"0.00 €"}},null,{"$f":"O38+O39","v":{"v":0,"d":"0.00"}},{"$f":"P38+P39","v":{"v":0,"d":"0.00 €"}},null,{"$f":"R38+R39","v":{"v":0,"d":"0.00"}}]
[null,null,"P",{"$f":"SUMIF($C40:$C43,\"P\",D40:D43)","v":{"v":0,"d":"0.00"}},{"$f":"SUMIF($C40:$C43,\"P\",E40:E43)","v":{"v":0,"d":"0.00"}},{"$f":"SUMIF($C40:$C43,\"P\",F40:F43)","v":{"v":0,"d":"0.00"}},null,{"$f":"SUMIF($C40:$C43,\"P\",H40:H43)","v":{"v":0,"d":"0.00"}},{"$f":"SUMIF($C40:$C43,\"P\",I40:I43)","v":{"v":0,"d":"0.00 €"}},{"$f":"SUMIF($C40:$C43,\"P\",J40:J43)","v":{"v":0,"d":"0.00 €"}},{"$f":"SUMIF($C40:$C43,\"P\",K40:K43)","v":{"v":0,"d":"0.00 €"}},null,{"$f":"SUMIF($C40:$C43,\"P\",M40:M43)","v":{"v":0,"d":"0.00 €"}},null,{"$f":"SUMIF($C40:$C43,\"P\",O40:O43)","v":{"v":0,"d":"0.00"}},{"$f":"SUMIF($C40:$C43,\"P\",P40:P43)","v":{"v":0,"d":"0.00 €"}},null,{"$f":"SUMIF($C40:$C43,\"P\",R40:R43)","v":{"v":0,"d":"0.00"}}]
[null,null,"T",{"$f":"SUMIF($C40:$C43,\"T\",D40:D43)","v":{"v":0,"d":"0.00"}},{"$f":"SUMIF($C40:$C43,\"T\",E40:E43)","v":{"v":0,"d":"0.00"}},{"$f":"SUMIF($C40:$C43,\"T\",F40:F43)","v":{"v":0,"d":"0.00"}},null,{"$f":"SUMIF($C40:$C43,\"T\",H40:H43)","v":{"v":0,"d":"0.00"}},{"$f":"SUMIF($C40:$C43,\"T\",I40:I43)","v":{"v":0,"d":"0.00 €"}},{"$f":"SUMIF($C40:$C43,\"T\",J40:J43)","v":{"v":0,"d":"0.00 €"}},{"$f":"SUMIF($C40:$C43,\"T\",K40:K43)","v":{"v":0,"d":"0.00 €"}},null,{"$f":"SUMIF($C40:$C43,\"T\",M40:M43)","v":{"v":0,"d":"0.00 €"}},null,{"$f":"SUMIF($C40:$C43,\"T\",O40:O43)","v":{"v":0,"d":"0.00"}},{"$f":"SUMIF($C40:$C43,\"T\",P40:P43)","v":{"v":0,"d":"0.00 €"}},null,{"$f":"SUMIF($C40:$C43,\"T\",R40:R43)","v":{"v":0,"d":"0.00"}}]
[null,"Animateur social","P"]
[null,"Animateur social","T"]
[null,"Autre personnel d'animation - service social","P"]
[null,"Autre personnel d'animation - service social","T"]
[null,"ASH - agents de service affectés aux fonctions de blanchissage, nettoyage et service des repas",{"$nulls":3},{"$f":"IF(E45=0,\"\",F45/E45)","v":""},{"$f":"IF(E45=0,\"\",G45/E45)","v":""},{"$nulls":7},{"$f":"IF(E45=0,\"\",O45/E45)","v":""}]
[{"$nulls":3},{"$f":"D46+D47","v":{"v":0,"d":"0.00"}},{"v":0,"d":"0.00"},{"v":0,"d":"0.00"},{"v":0,"d":"0.00"},{"v":0,"d":"0.00"},{"v":0,"d":"0.00 €"},{"v":0,"d":"0.00 €"},{"v":0,"d":"0.00 €"},{"v":0,"d":"0.00 €"},{"v":0,"d":"0.00 €"},null,{"$f":"O46+O47","v":{"v":0,"d":"0.00"}},{"$f":"P46+P47","v":{"v":0,"d":"0.00 €"}},null,{"$f":"R46+R47","v":{"v":0,"d":"0.00"}}]
[null,null,"P",{"$f":"SUMIF($C48:$C49,\"P\",D48:D49)","v":{"v":0,"d":"0.00"}},{"$f":"SUMIF($C48:$C49,\"P\",E48:E49)","v":{"v":0,"d":"0.00"}},{"v":0,"d":"0.00"},{"v":0,"d":"0.00"},{"v":0,"d":"0.00"},{"v":0,"d":"0.00 €"},{"v":0,"d":"0.00 €"},{"v":0,"d":"0.00 €"},{"v":0,"d":"0.00 €"},{"$f":"SUMIF($C48:$C49,\"P\",M48:M49)","v":{"v":0,"d":"0.00 €"}},null,{"$f":"SUMIF($C48:$C49,\"P\",O48:O49)","v":{"v":0,"d":"0.00"}},{"$f":"SUMIF($C48:$C49,\"P\",P48:P49)","v":{"v":0,"d":"0.00 €"}},null,{"$f":"SUMIF($C48:$C49,\"P\",R48:R49)","v":{"v":0,"d":"0.00"}}]
[null,null,"T",{"$f":"SUMIF($C48:$C49,\"T\",D48:D49)","v":{"v":0,"d":"0.00"}},{"v":0,"d":"0.00"},{"v":0,"d":"0.00"},{"v":0,"d":"0.00"},{"v":0,"d":"0.00"},{"v":0,"d":"0.00 €"},{"v":0,"d":"0.00 €"},{"v":0,"d":"0.00 €"},{"v":0,"d":"0.00 €"},{"v":0,"d":"0.00 €"},null,{"$f":"SUMIF($C48:$C49,\"T\",O48:O49)","v":{"v":0,"d":"0.00"}},{"$f":"SUMIF($C48:$C49,\"T\",P48:P49)","v":{"v":0,"d":"0.00 €"}},null,{"$f":"SUMIF($C48:$C49,\"T\",R48:R49)","v":{"v":0,"d":"0.00"}}]
[null,null,"P"]
[null,null,"P"]
[null,"AIDES SOIGNANTS, AIDES MEDICO-PEDAGOGIQUES ET ACCOMPAGNANTS EDUCATIFS ET SOCIAUX",{"$nulls":4},{"$f":"IF(E51=0,\"\",G51/E51)","v":""},{"$f":"IF(E51=0,\"\",H51/E51)","v":""},{"$nulls":6},{"v":1,"d":"100%"}]
[{"$nulls":3},{"$f":"D52+D53","v":{"v":0,"d":"0.00"}},{"$f":"E52+E53","v":{"v":0,"d":"0.00"}},null,{"$f":"G52+G53","v":{"v":0,"d":"0.00"}},{"$f":"H52+H53","v":{"v":0,"d":"0.00"}},{"$f":"I52+I53","v":{"v":0,"d":"0.00 €"}},{"$f":"J52+J53","v":{"v":0,"d":"0.00 €"}},null,{"$f":"L52+L53","v":{"v":0,"d":"0.00 €"}},{"$f":"M52+M53","v":{"v":0,"d":"0.00 €"}},null,{"$f":"O52+O53","v":{"v":0,"d":"0.00"}},{"$f":"P52+P53","v":{"v":0,"d":"0.00 €"}},null,{"$f":"R52+R53","v":{"v":0,"d":"0.00"}}]
[null,null,"P",{"$f":"SUMIF($C54:$C63,\"P\",D54:D63)","v":{"v":0,"d":"0.00"}},{"$f":"SUMIF($C54:$C63,\"P\",E54:E63)","v":{"v":0,"d":"0.00"}},null,{"$f":"SUMIF($C54:$C63,\"P\",G54:G63)","v":{"v":0,"d":"0.00"}},{"$f":"SUMIF($C54:$C63,\"P\",H54:H63)","v":{"v":0,"d":"0.00"}},{"$f":"SUMIF($C54:$C63,\"P\",I54:I63)","v":{"v":0,"d":"0.00 €"}},{"$f":"SUMIF($C54:$C63,\"P\",J54:J63)","v":{"v":0,"d":"0.00 €"}},null,{"$f":"SUMIF($C54:$C63,\"P\",L54:L63)","v":{"v":0,"d":"0.00 €"}},{"$f":"SUMIF($C54:$C63,\"P\",M54:M63)","v":{"v":0,"d":"0.00 €"}},null,{"$f":"SUMIF($C54:$C63,\"P\",O54:O63)","v":{"v":0,"d":"0.00"}},{"$f":"SUMIF($C54:$C63,\"P\",P54:P63)","v":{"v":0,"d":"0.00 €"}},null,{"$f":"SUMIF($C54:$C63,\"P\",R54:R63)","v":{"v":0,"d":"0.00"}}]
[null,null,"T",{"$f":"SUMIF($C54:$C63,\"T\",D54:D63)","v":{"v":0,"d":"0.00"}},{"$f":"SUMIF($C54:$C63,\"T\",E54:E63)","v":{"v":0,"d":"0.00"}},null,{"$f":"SUMIF($C54:$C63,\"T\",G54:G63)","v":{"v":0,"d":"0.00"}},{"$f":"SUMIF($C54:$C63,\"T\",H54:H63)","v":{"v":0,"d":"0.00"}},{"$f":"SUMIF($C54:$C63,\"T\",I54:I63)","v":{"v":0,"d":"0.00 €"}},{"$f":"SUMIF($C54:$C63,\"T\",J54:J63)","v":{"v":0,"d":"0.00 €"}},null,{"$f":"SUMIF($C54:$C63,\"T\",L54:L63)","v":{"v":0,"d":"0.00 €"}},{"$f":"SUMIF($C54:$C63,\"T\",M54:M63)","v":{"v":0,"d":"0.00 €"}},null,{"$f":"SUMIF($C54:$C63,\"T\",O54:O63)","v":{"v":0,"d":"0.00"}},{"$f":"SUMIF($C54:$C63,\"T\",P54:P63)","v":{"v":0,"d":"0.00 €"}},null,{"$f":"SUMIF($C54:$C63,\"T\",R54:R63)","v":{"v":0,"d":"0.00"}}]
[null,"Aide-soignant non assistant de soins en gérontologie","P"]
[null,"Aide-soignant non assistant de soins en gérontologie","T"]
[null,"Aide-soignant assistant de soins en gérontologie","P"]
[null,"Aide-soignant assistant de soins en gérontologie","T"]
[null,"A.M.P.","P"]
[null,"A.M.P.","T"]
[null,"A.E.S.","P"]
[null,"A.E.S.","T"]
[null,"Autre personnel","P"]
[null,"Autre personnel","T"]
[null,"PSYCHOLOGUES",{"$nulls":4},{"v":1,"d":"100%"},{"$nulls":7},{"v":1,"d":"100%"}]
[{"$nulls":3},{"$f":"D66+D67","v":{"v":0,"d":"0.00"}},{"$f":"E66+E67","v":{"v":0,"d":"0.00"}},null,{"$f":"G66+G67","v":{"v":0,"d":"0.00"}},{"$f":"H66+H67","v":{"v":0,"d":"0.00"}},{"$f":"I66+I67","v":{"v":0,"d":"0.00 €"}},{"$f":"J66+J67","v":{"v":0,"d":"0.00 €"}},null,{"$f":"L66+L67","v":{"v":0,"d":"0.00 €"}},{"$f":"M66+M67","v":{"v":0,"d":"0.00 €"}},null,{"$f":"O66+O67","v":{"v":0,"d":"0.00"}},{"$f":"P66+P67","v":{"v":0,"d":"0.00 €"}},null,{"$f":"R66+R67","v":{"v":0,"d":"0.00"}}]
[null,null,"P",{"$f":"SUMIF($C68:$C69,\"P\",D68:D69)","v":{"v":0,"d":"0.00"}},{"$f":"SUMIF($C68:$C69,\"P\",E68:E69)","v":{"v":0,"d":"0.00"}},null,{"$f":"SUMIF($C68:$C69,\"P\",G68:G69)","v":{"v":0,"d":"0.00"}},{"$f":"SUMIF($C68:$C69,\"P\",H68:H69)","v":{"v":0,"d":"0.00"}},{"$f":"SUMIF($C68:$C69,\"P\",I68:I69)","v":{"v":0,"d":"0.00 €"}},{"$f":"SUMIF($C68:$C69,\"P\",J68:J69)","v":{"v":0,"d":"0.00 €"}},null,{"$f":"SUMIF($C68:$C69,\"P\",L68:L69)","v":{"v":0,"d":"0.00 €"}},{"$f":"SUMIF($C68:$C69,\"P\",M68:M69)","v":{"v":0,"d":"0.00 €"}},null,{"$f":"SUMIF($C68:$C69,\"P\",O68:O69)","v":{"v":0,"d":"0.00"}},{"$f":"SUMIF($C68:$C69,\"P\",P68:P69)","v":{"v":0,"d":"0.00 €"}},null,{"$f":"SUMIF($C68:$C69,\"P\",R68:R69)","v":{"v":0,"d":"0.00"}}]
[null,null,"T",{"$f":"SUMIF($C68:$C69,\"T\",D68:D69)","v":{"v":0,"d":"0.00"}},{"$f":"SUMIF($C68:$C69,\"T\",E68:E69)","v":{"v":0,"d":"0.00"}},null,{"$f":"SUMIF($C68:$C69,\"T\",G68:G69)","v":{"v":0,"d":"0.00"}},{"$f":"SUMIF($C68:$C69,\"T\",H68:H69)","v":{"v":0,"d":"0.00"}},{"$f":"SUMIF($C68:$C69,\"T\",I68:I69)","v":{"v":0,"d":"0.00 €"}},{"$f":"SUMIF($C68:$C69,\"T\",J68:J69)","v":{"v":0,"d":"0.00 €"}},null,{"$f":"SUMIF($C68:$C69,\"T\",L68:L69)","v":{"v":0,"d":"0.00 €"}},{"$f":"SUMIF($C68:$C69,\"T\",M68:M69)","v":{"v":0,"d":"0.00 €"}},null,{"$f":"SUMIF($C68:$C69,\"T\",O68:O69)","v":{"v":0,"d":"0.00"}},{"$f":"SUMIF($C68:$C69,\"T\",P68:P69)","v":{"v":0,"d":"0.00 €"}},null,{"$f":"SUMIF($C68:$C69,\"T\",R68:R69)","v":{"v":0,"d":"0.00"}}]
[null,null,"P"]
[null,null,"P"]
[null,"INFIRMIERS",{"$nulls":5},{"v":1,"d":"100%"},{"$nulls":6},{"v":1,"d":"100%"}]
[{"$nulls":3},{"$f":"D72+D73","v":{"v":0,"d":"0.00"}},{"$f":"E72+E73","v":{"v":0,"d":"0.00"}},null,null,{"$f":"H72+H73","v":{"v":0,"d":"0.00"}},{"$f":"I72+I73","v":{"v":0,"d":"0.00 €"}},{"$f":"J72+J73","v":{"v":0,"d":"0.00 €"}},null,null,{"$f":"M72+M73","v":{"v":0,"d":"0.00 €"}},null,{"$f":"O72+O73","v":{"v":0,"d":"0.00"}},{"$f":"P72+P73","v":{"v":0,"d":"0.00 €"}},null,{"$f":"R72+R73","v":{"v":0,"d":"0.00"}}]
[null,null,"P",{"$f":"SUMIF($C74:$C81,\"P\",D74:D81)","v":{"v":0,"d":"0.00"}},{"$f":"SUMIF($C74:$C81,\"P\",E74:E81)","v":{"v":0,"d":"0.00"}},null,null,{"$f":"SUMIF($C74:$C81,\"P\",H74:H81)","v":{"v":0,"d":"0.00"}},{"$f":"SUMIF($C74:$C81,\"P\",I74:I81)","v":{"v":0,"d":"0.00 €"}},{"$f":"SUMIF($C74:$C81,\"P\",J74:J81)","v":{"v":0,"d":"0.00 €"}},null,null,{"$f":"SUMIF($C74:$C81,\"P\",M74:M81)","v":{"v":0,"d":"0.00 €"}},null,{"$f":"SUMIF($C74:$C81,\"P\",O74:O81)","v":{"v":0,"d":"0.00"}},{"$f":"SUMIF($C74:$C81,\"P\",P74:P81)","v":{"v":0,"d":"0.00 €"}},null,{"$f":"SUMIF($C74:$C81,\"P\",R74:R81)","v":{"v":0,"d":"0.00"}}]
[null,null,"T",{"$f":"SUMIF($C74:$C81,\"T\",D74:D81)","v":{"v":0,"d":"0.00"}},{"$f":"SUMIF($C74:$C81,\"T\",E74:E81)","v":{"v":0,"d":"0.00"}},null,null,{"$f":"SUMIF($C74:$C81,\"T\",H74:H81)","v":{"v":0,"d":"0.00"}},{"$f":"SUMIF($C74:$C81,\"T\",I74:I81)","v":{"v":0,"d":"0.00 €"}},{"$f":"SUMIF($C74:$C81,\"T\",J74:J81)","v":{"v":0,"d":"0.00 €"}},null,null,{"$f":"SUMIF($C74:$C81,\"T\",M74:M81)","v":{"v":0,"d":"0.00 €"}},null,{"$f":"SUMIF($C74:$C81,\"T\",O74:O81)","v":{"v":0,"d":"0.00"}},{"$f":"SUMIF($C74:$C81,\"T\",P74:P81)","v":{"v":0,"d":"0.00 €"}},null,{"$f":"SUMIF($C74:$C81,\"T\",R74:R81)","v":{"v":0,"d":"0.00"}}]
[null,"Infirmier coordonnateur","P"]
[null,"Infirmier coordonnateur","T"]
[null,"Infirmier diplômé d'État","P"]
[null,"Infirmier diplômé d'État","T"]
[null,"Infirmier psychiatrique","P"]
[null,"Infirmier psychiatrique","T"]
[null,"Autre personnel infirmier","P"]
[null,"Autre personnel infirmier","T"]
[null,"AUTRES AUXILIAIRES MEDICAUX",{"$nulls":5},{"v":1,"d":"100%"},{"$nulls":6},{"v":1,"d":"100%"}]
[{"$nulls":3},{"$f":"D84+D85","v":{"v":0,"d":"0.00"}},{"$f":"E84+E85","v":{"v":0,"d":"0.00"}},null,null,{"$f":"H84+H85","v":{"v":0,"d":"0.00"}},{"$f":"I84+I85","v":{"v":0,"d":"0.00 €"}},{"$f":"J84+J85","v":{"v":0,"d":"0.00 €"}},null,null,{"$f":"M84+M85","v":{"v":0,"d":"0.00 €"}},null,{"$f":"O84+O85","v":{"v":0,"d":"0.00"}},{"$f":"P84+P85","v":{"v":0,"d":"0.00 €"}},null,{"$f":"R84+R85","v":{"v":0,"d":"0.00"}}]
[null,null,"P",{"$f":"SUMIF($C86:$C97,\"P\",D86:D97)","v":{"v":0,"d":"0.00"}},{"$f":"SUMIF($C86:$C97,\"P\",E86:E97)","v":{"v":0,"d":"0.00"}},null,null,{"$f":"SUMIF($C86:$C97,\"P\",H86:H97)","v":{"v":0,"d":"0.00"}},{"$f":"SUMIF($C86:$C97,\"P\",I86:I97)","v":{"v":0,"d":"0.00 €"}},{"$f":"SUMIF($C86:$C97,\"P\",J86:J97)","v":{"v":0,"d":"0.00 €"}},null,null,{"$f":"SUMIF($C86:$C97,\"P\",M86:M97)","v":{"v":0,"d":"0.00 €"}},null,{"$f":"SUMIF($C86:$C97,\"P\",O86:O97)","v":{"v":0,"d":"0.00"}},{"$f":"SUMIF($C86:$C97,\"P\",P86:P97)","v":{"v":0,"d":"0.00 €"}},null,{"$f":"SUMIF($C86:$C97,\"P\",R86:R97)","v":{"v":0,"d":"0.00"}}]
[null,null,"T",{"$f":"SUMIF($C86:$C97,\"T\",D86:D97)","v":{"v":0,"d":"0.00"}},{"$f":"SUMIF($C86:$C97,\"T\",E86:E97)","v":{"v":0,"d":"0.00"}},null,null,{"$f":"SUMIF($C86:$C97,\"T\",H86:H97)","v":{"v":0,"d":"0.00"}},{"$f":"SUMIF($C86:$C97,\"T\",I86:I97)","v":{"v":0,"d":"0.00 €"}},{"$f":"SUMIF($C86:$C97,\"T\",J86:J97)","v":{"v":0,"d":"0.00 €"}},null,null,{"$f":"SUMIF($C86:$C97,\"T\",M86:M97)","v":{"v":0,"d":"0.00 €"}},null,{"$f":"SUMIF($C86:$C97,\"T\",O86:O97)","v":{"v":0,"d":"0.00"}},{"$f":"SUMIF($C86:$C97,\"T\",P86:P97)","v":{"v":0,"d":"0.00 €"}},null,{"$f":"SUMIF($C86:$C97,\"T\",R86:R97)","v":{"v":0,"d":"0.00"}}]
[null,"Masseur-kinésithérapeute","P"]
[null,"Masseur-kinésithérapeute","T"]
[null,"Ergothérapeute","P"]
[null,"Ergothérapeute","T"]
[null,"Pédicure-Podologue","P"]
[null,"Pédicure-Podologue","T"]
[null,"Psychomotricien, rééducateur en psychomotricité","P"]
[null,"Psychomotricien, rééducateur en psychomotricité","T"]
[null,"Intervenant en activité physique adaptée","P"]
[null,"Intervenant en activité physique adaptée","T"]
[null,"Autre personnel paramédical","P"]
[null,"Autre personnel paramédical","T"]
[null,"PHARMACIENS - PREPARATEURS EN PHARMACIE",{"$nulls":5},{"v":1,"d":"100%"},{"$nulls":6},{"v":1,"d":"100%"}]
[{"$nulls":3},{"$f":"D100+D101","v":{"v":0,"d":"0.00"}},{"$f":"E100+E101","v":{"v":0,"d":"0.00"}},null,null,{"$f":"H100+H101","v":{"v":0,"d":"0.00"}},{"$f":"I100+I101","v":{"v":0,"d":"0.00 €"}},{"$f":"J100+J101","v":{"v":0,"d":"0.00 €"}},null,null,{"$f":"M100+M101","v":{"v":0,"d":"0.00 €"}},null,{"$f":"O100+O101","v":{"v":0,"d":"0.00"}},{"$f":"P100+P101","v":{"v":0,"d":"0.00 €"}},null,{"$f":"R100+R101","v":{"v":0,"d":"0.00"}}]
[null,null,"P",{"$f":"SUMIF($C102:$C105,\"P\",D102:D105)","v":{"v":0,"d":"0.00"}},{"$f":"SUMIF($C102:$C105,\"P\",E102:E105)","v":{"v":0,"d":"0.00"}},null,null,{"$f":"SUMIF($C102:$C105,\"P\",H102:H105)","v":{"v":0,"d":"0.00"}},{"$f":"SUMIF($C102:$C105,\"P\",I102:I105)","v":{"v":0,"d":"0.00 €"}},{"$f":"SUMIF($C102:$C105,\"P\",J102:J105)","v":{"v":0,"d":"0.00 €"}},null,null,{"$f":"SUMIF($C102:$C105,\"P\",M102:M105)","v":{"v":0,"d":"0.00 €"}},null,{"$f":"SUMIF($C102:$C105,\"P\",O102:O105)","v":{"v":0,"d":"0.00"}},{"$f":"SUMIF($C102:$C105,\"P\",P102:P105)","v":{"v":0,"d":"0.00 €"}},null,{"$f":"SUMIF($C102:$C105,\"P\",R102:R105)","v":{"v":0,"d":"0.00"}}]
[null,null,"T",{"$f":"SUMIF($C102:$C105,\"T\",D102:D105)","v":{"v":0,"d":"0.00"}},{"$f":"SUMIF($C102:$C105,\"T\",E102:E105)","v":{"v":0,"d":"0.00"}},null,null,{"$f":"SUMIF($C102:$C105,\"T\",H102:H105)","v":{"v":0,"d":"0.00"}},{"$f":"SUMIF($C102:$C105,\"T\",I102:I105)","v":{"v":0,"d":"0.00 €"}},{"$f":"SUMIF($C102:$C105,\"T\",J102:J105)","v":{"v":0,"d":"0.00 €"}},null,null,{"$f":"SUMIF($C102:$C105,\"T\",M102:M105)","v":{"v":0,"d":"0.00 €"}},null,{"$f":"SUMIF($C102:$C105,\"T\",O102:O105)","v":{"v":0,"d":"0.00"}},{"$f":"SUMIF($C102:$C105,\"T\",P102:P105)","v":{"v":0,"d":"0.00 €"}},null,{"$f":"SUMIF($C102:$C105,\"T\",R102:R105)","v":{"v":0,"d":"0.00"}}]
[null,"Pharmacien","P"]
[null,"Pharmacien","T"]
[null,"Préparateur en pharmacie","P"]
[null,"Préparateur en pharmacie","T"]
[null,"MEDECIN",{"$nulls":5},{"v":1,"d":"100%"},{"$nulls":6},{"v":1,"d":"100%"}]
[{"$nulls":3},{"$f":"D108+D109","v":{"v":0,"d":"0.00"}},{"$f":"E108+E109","v":{"v":0,"d":"0.00"}},null,null,{"$f":"H108+H109","v":{"v":0,"d":"0.00"}},{"$f":"I108+I109","v":{"v":0,"d":"0.00 €"}},{"$f":"J108+J109","v":{"v":0,"d":"0.00 €"}},null,null,{"$f":"M108+M109","v":{"v":0,"d":"0.00 €"}},null,{"$f":"O108+O109","v":{"v":0,"d":"0.00"}},{"$f":"P108+P109","v":{"v":0,"d":"0.00 €"}},null,{"$f":"R108+R109","v":{"v":0,"d":"0.00"}}]
[null,null,"P",{"$f":"SUMIF($C110:$C119,\"P\",D110:D119)","v":{"v":0,"d":"0.00"}},{"$f":"SUMIF($C110:$C119,\"P\",E110:E119)","v":{"v":0,"d":"0.00"}},null,null,{"$f":"SUMIF($C110:$C119,\"P\",H110:H119)","v":{"v":0,"d":"0.00"}},{"$f":"SUMIF($C110:$C119,\"P\",I110:I119)","v":{"v":0,"d":"0.00 €"}},{"$f":"SUMIF($C110:$C119,\"P\",J110:J119)","v":{"v":0,"d":"0.00 €"}},null,null,{"$f":"SUMIF($C110:$C119,\"P\",M110:M119)","v":{"v":0,"d":"0.00 €"}},null,{"$f":"SUMIF($C110:$C119,\"P\",O110:O119)","v":{"v":0,"d":"0.00"}},{"$f":"SUMIF($C110:$C119,\"P\",P110:P119)","v":{"v":0,"d":"0.00 €"}},null,{"$f":"SUMIF($C110:$C119,\"P\",R110:R119)","v":{"v":0,"d":"0.00"}}]
[null,null,"T",{"$f":"SUMIF($C110:$C119,\"T\",D110:D119)","v":{"v":0,"d":"0.00"}},{"$f":"SUMIF($C110:$C119,\"T\",E110:E119)","v":{"v":0,"d":"0.00"}},null,null,{"$f":"SUMIF($C110:$C119,\"T\",H110:H119)","v":{"v":0,"d":"0.00"}},{"$f":"SUMIF($C110:$C119,\"T\",I110:I119)","v":{"v":0,"d":"0.00 €"}},{"$f":"SUMIF($C110:$C119,\"T\",J110:J119)","v":{"v":0,"d":"0.00 €"}},null,null,{"$f":"SUMIF($C110:$C119,\"T\",M110:M119)","v":{"v":0,"d":"0.00 €"}},null,{"$f":"SUMIF($C110:$C119,\"T\",O110:O119)","v":{"v":0,"d":"0.00"}},{"$f":"SUMIF($C110:$C119,\"T\",P110:P119)","v":{"v":0,"d":"0.00 €"}},null,{"$f":"SUMIF($C110:$C119,\"T\",R110:R119)","v":{"v":0,"d":"0.00"}}]
[null,"Médecin coordonnateur","P"]
[null,"Médecin coordonnateur","T"]
[null,"Médecin généraliste","P"]
[null,"Médecin généraliste","T"]
[null,"Gériatre","P"]
[null,"Gériatre","T"]
[null,"Psychiatre","P"]
[null,"Psychiatre","T"]
[null,"Autre médecin","P"]
[null,"Autre médecin","T"]
[null,"TOTAL Personnel salarié",null,{"$f":"D107+D99+D83+D71+D65+D51+D45+D37+D25+D11","v":{"v":0,"d":"0.00"}},{"$f":"E107+E99+E83+E71+E65+E51+E45+E37+E25+E11","v":{"v":0,"d":"0.00"}},{"v":0,"d":"0.00"},{"v":0,"d":"0.00"},{"v":0,"d":"0.00"},{"v":0,"d":"0.00 €"},{"v":0,"d":"0.00 €"},{"v":0,"d":"0.00 €"},{"v":0,"d":"0.00 €"},{"v":0,"d":"0.00 €"},null,{"$f":"O107+O99+O83+O71+O65+O51+O45+O37+O25+O11","v":{"v":0,"d":"0.00"}},{"$f":"P107+P99+P83+P71+P65+P51+P45+P37+P25+P11","v":{"v":0,"d":"0.00 €"}},null,{"$f":"R11+R25+R37+R45+R51+R65+R71+R83+R99+R107","v":{"v":0,"d":"0.00"}}]
[null,"(*) Nombre d'ETP et charges inscrits au tableau prévisionnel des emplois rémunérés annexé au cadre EPRD de l'année N-1"]
[]
[null,"Répartition des charges relatives au personnel extérieur à l'établissement (hors experts juridiques et comptables et commissaire aux comptes)"]
[]
[{"$nulls":4},{"$f":"IF('Page de garde'!$D$4=\"\",\"EPRD N\",\"EPRD \"&'Page de garde'!$D$4)","v":"EPRD N"},{"$nulls":4},{"$f":"IF('Page de garde'!$D$4=\"\",\"EPRD N\",\"EPRD \"&'Page de garde'!$D$4)","v":"EPRD N"},{"$nulls":4},"EPRD N"]
[null,"PERSONNEL (une ligne par emploi)","Emploi permanent (P) /  temporaire (T)",{"$f":"IF('Page de garde'!$D$4=\"\",\"Nombre d'ETP inscrits à l'EPRD N-1 (*)\",\"Nombre d'ETP inscrits à l'EPRD \"&'Page de garde'!$D$4-1&\" (*)\" )","v":"Nombre d'ETP inscrits à l'EPRD N-1 (*)"},"Nombre d'ETP","Hébergement \nen ETP","Dépendance \nen ETP","Soins \nen ETP",{"$f":"IF('Page de garde'!$D$4=\"\",\"Charges relatives au personnel extérieur à l'établissement N-1 (*)\",\"Charges relatives au personnel extérieur à l'établissement \"&'Page de garde'!$D$4-1&\" (*)\" )","v":"Charges relatives au personnel extérieur à l'établissement N-1 (*)"},"Charges relatives au personnel extérieur à l'établissement","IMPUTATION à la section \"Hébergement\"","IMPUTATION à la section \"Dépendance\"","IMPUTATION à la section \"Soins\"",null,"Soins et entretien de l'autonomie en ETP","Charges relatives au personnel extérieur \nImputation à la section \"Soins et entretien de l'autonomie\""]
[null,"DIRECTION - ADMINISTRATION",{"$nulls":3},{"v":1,"d":"100%"}]
[{"$nulls":3},{"$f":"SUM(D129:D138)","v":{"v":0,"d":"0.00"}},{"$f":"SUM(E129:E138)","v":{"v":0,"d":"0.00"}},{"$f":"SUM(F129:F138)","v":{"v":0,"d":"0.00"}},null,{"$f":"SUM(H129:H138)","v":{"v":0,"d":"0.00"}},{"$f":"SUM(I129:I138)","v":{"v":0,"d":"0.00 €"}},{"$f":"SUM(J129:J138)","v":{"v":0,"d":"0.00 €"}},{"$f":"SUM(K129:K138)","v":{"v":0,"d":"0.00 €"}},null,{"$f":"SUM(M129:M138)","v":{"v":0,"d":"0.00 €"}},null,{"$f":"SUM(O129:O138)","v":{"v":0,"d":"0.00"}},{"$f":"SUM(P129:P138)","v":{"v":0,"d":"0.00 €"}}]
[null,"Directeur","P"]
[null,"Directeur","T"]
[null,"Médecin directeur","P"]
[null,"Médecin directeur","T"]
[null,"Directeur adjoint, attaché de direction, économe","P"]
[null,"Directeur adjoint, attaché de direction, économe","T"]
[null,"Agent administratif et personnel de bureau","P"]
[null,"Agent administratif et personnel de bureau","T"]
[null,"Autre personnel de direction ou d'administration","P"]
[null,"Autre personnel de direction ou d'administration","T"]
[null,"CUISINE - SERVICES GENERAUX - Diététicien",{"$nulls":3},{"v":1,"d":"100%"}]
[{"$nulls":3},{"$f":"SUM(D141:D148)","v":{"v":0,"d":"0.00"}},{"$f":"SUM(E141:E148)","v":{"v":0,"d":"0.00"}},{"$f":"SUM(F141:F148)","v":{"v":0,"d":"0.00"}},null,{"$f":"SUM(H141:H148)","v":{"v":0,"d":"0.00"}},{"$f":"SUM(I141:I148)","v":{"v":0,"d":"0.00 €"}},{"$f":"SUM(J141:J148)","v":{"v":0,"d":"0.00 €"}},{"$f":"SUM(K141:K148)","v":{"v":0,"d":"0.00 €"}},null,{"$f":"SUM(M141:M148)","v":{"v":0,"d":"0.00 €"}},null,{"$f":"SUM(O141:O148)","v":{"v":0,"d":"0.00"}},{"$f":"SUM(P141:P148)","v":{"v":0,"d":"0.00 €"}}]
[null,"Ouvrier professionnel","P"]
[null,"Ouvrier professionnel","T"]
[null,"Agent de service général","P"]
[null,"Agent de service général","T"]
[null,"Diététicien","P"]
[null,"Diététicien","T"]
[null,"Autre personnel de cuisine - services généraux","P"]
[null,"Autre personnel de cuisine - services généraux","T"]
[null,"ANIMATION - SERVICE SOCIAL",{"$nulls":3},{"v":1,"d":"100%"}]
[{"$nulls":3},{"$f":"SUM(D151:D154)","v":{"v":0,"d":"0.00"}},{"$f":"SUM(E151:E154)","v":{"v":0,"d":"0.00"}},{"$f":"SUM(F151:F154)","v":{"v":0,"d":"0.00"}},null,{"$f":"SUM(H151:H154)","v":{"v":0,"d":"0.00"}},{"$f":"SUM(I151:I154)","v":{"v":0,"d":"0.00 €"}},{"$f":"SUM(J151:J154)","v":{"v":0,"d":"0.00 €"}},{"$f":"SUM(K151:K154)","v":{"v":0,"d":"0.00 €"}},null,{"$f":"SUM(M151:M154)","v":{"v":0,"d":"0.00 €"}},null,{"$f":"SUM(O151:O154)","v":{"v":0,"d":"0.00"}},{"$f":"SUM(P151:P154)","v":{"v":0,"d":"0.00 €"}}]
[null,"Animateur social","P"]
[null,"Animateur social","T"]
[null,"Autre personnel d'animation - service social","P"]
[null,"Autre personnel d'animation - service social","T"]
[null,"ASH - agents de service affectés aux fonctions de blanchissage, nettoyage et service des repas",{"$nulls":3},{"$f":"IF(E156=0,\"\",F156/E156)","v":""},{"$f":"IF(E156=0,\"\",G156/E156)","v":""},{"$nulls":7},{"$f":"IF(E156=0,\"\",O156/E156)","v":""}]
[{"$nulls":3},{"$f":"SUM(D157:D158)","v":{"v":0,"d":"0.00"}},{"v":0,"d":"0.00"},{"v":0,"d":"0.00"},{"v":0,"d":"0.00"},{"v":0,"d":"0.00"},{"v":0,"d":"0.00 €"},{"v":0,"d":"0.00 €"},{"v":0,"d":"0.00 €"},{"v":0,"d":"0.00 €"},{"v":0,"d":"0.00 €"},null,{"$f":"SUM(O157:O158)","v":{"v":0,"d":"0.00"}},{"$f":"SUM(P157:P158)","v":{"v":0,"d":"0.00 €"}}]
[null,null,"P"]
[null,null,"P"]
[null,"AIDES SOIGNANTS, AIDES MEDICO-PEDAGOGIQUES ET ACCOMPAGNANTS EDUCATIFS ET SOCIAUX",{"$nulls":4},{"$f":"IF(E160=0,\"\",G160/E160)","v":""},{"$f":"IF(E160=0,\"\",H160/E160)","v":""},{"$nulls":6},{"v":1,"d":"100%"}]
[{"$nulls":3},{"$f":"SUM(D161:D170)","v":{"v":0,"d":"0.00"}},{"$f":"SUM(E161:E170)","v":{"v":0,"d":"0.00"}},null,{"$f":"SUM(G161:G170)","v":{"v":0,"d":"0.00"}},{"$f":"SUM(H161:H170)","v":{"v":0,"d":"0.00"}},{"$f":"SUM(I161:I170)","v":{"v":0,"d":"0.00 €"}},{"$f":"SUM(J161:J170)","v":{"v":0,"d":"0.00 €"}},null,{"$f":"SUM(L161:L170)","v":{"v":0,"d":"0.00 €"}},{"$f":"SUM(M161:M170)","v":{"v":0,"d":"0.00 €"}},null,{"$f":"SUM(O161:O170)","v":{"v":0,"d":"0.00"}},{"$f":"SUM(P161:P170)","v":{"v":0,"d":"0.00 €"}}]
[null,"Aide-soignant non assistant de soins en gérontologie","P"]
[null,"Aide-soignant non assistant de soins en gérontologie","T"]
[null,"Aide-soignant assistant de soins en gérontologie","P"]
[null,"Aide-soignant assistant de soins en gérontologie","T"]
[null,"A.M.P.","P"]
[null,"A.M.P.","T"]
[null,"A.E.S.","P"]
[null,"A.E.S.","T"]
[null,"Autre personnel","P"]
[null,"Autre personnel","T"]
[null,"PSYCHOLOGUES",{"$nulls":4},{"v":1,"d":"100%"},{"$nulls":7},{"v":1,"d":"100%"}]
[{"$nulls":3},{"$f":"SUM(D173:D174)","v":{"v":0,"d":"0.00"}},{"$f":"SUM(E173:E174)","v":{"v":0,"d":"0.00"}},null,{"$f":"SUM(G173:G174)","v":{"v":0,"d":"0.00"}},{"$f":"SUM(H173:H174)","v":{"v":0,"d":"0.00"}},{"$f":"SUM(I173:I174)","v":{"v":0,"d":"0.00 €"}},{"$f":"SUM(J173:J174)","v":{"v":0,"d":"0.00 €"}},null,{"$f":"SUM(L173:L174)","v":{"v":0,"d":"0.00 €"}},{"$f":"SUM(M173:M174)","v":{"v":0,"d":"0.00 €"}},null,{"$f":"SUM(O173:O174)","v":{"v":0,"d":"0.00"}},{"$f":"SUM(P173:P174)","v":{"v":0,"d":"0.00 €"}}]
[null,null,"P"]
[null,null,"P"]
[null,"INFIRMIERS",{"$nulls":5},{"v":1,"d":"100%"},{"$nulls":6},{"v":1,"d":"100%"}]
[{"$nulls":3},{"$f":"SUM(D177:D184)","v":{"v":0,"d":"0.00"}},{"$f":"SUM(E177:E184)","v":{"v":0,"d":"0.00"}},null,null,{"$f":"SUM(H177:H184)","v":{"v":0,"d":"0.00"}},{"$f":"SUM(I177:I184)","v":{"v":0,"d":"0.00 €"}},{"$f":"SUM(J177:J184)","v":{"v":0,"d":"0.00 €"}},null,null,{"$f":"SUM(M177:M184)","v":{"v":0,"d":"0.00 €"}},null,{"$f":"SUM(O177:O184)","v":{"v":0,"d":"0.00"}},{"$f":"SUM(P177:P184)","v":{"v":0,"d":"0.00 €"}}]
[null,"Infirmier coordonnateur","P"]
[null,"Infirmier coordonnateur","T"]
[null,"Infirmier diplômé d'État","P"]
[null,"Infirmier diplômé d'État","T"]
[null,"Infirmier psychiatrique","P"]
[null,"Infirmier psychiatrique","T"]
[null,"Autre personnel infirmier","P"]
[null,"Autre personnel infirmier","T"]
[null,"AUTRES AUXILIAIRES MEDICAUX",{"$nulls":5},{"v":1,"d":"100%"},{"$nulls":6},{"v":1,"d":"100%"}]
[{"$nulls":3},{"$f":"SUM(D187:D198)","v":{"v":0,"d":"0.00"}},{"$f":"SUM(E187:E198)","v":{"v":0,"d":"0.00"}},null,null,{"$f":"SUM(H187:H198)","v":{"v":0,"d":"0.00"}},{"$f":"SUM(I187:I198)","v":{"v":0,"d":"0.00 €"}},{"$f":"SUM(J187:J198)","v":{"v":0,"d":"0.00 €"}},null,null,{"$f":"SUM(M187:M198)","v":{"v":0,"d":"0.00 €"}},null,{"$f":"SUM(O187:O198)","v":{"v":0,"d":"0.00"}},{"$f":"SUM(P187:P198)","v":{"v":0,"d":"0.00 €"}}]
[null,"Masseur-kinésithérapeute","P"]
[null,"Masseur-kinésithérapeute","T"]
[null,"Ergothérapeute","P"]
[null,"Ergothérapeute","T"]
[null,"Pédicure-Podologue","P"]
[null,"Pédicure-Podologue","T"]
[null,"Psychomotricien, rééducateur en psychomotricité","P"]
[null,"Psychomotricien, rééducateur en psychomotricité","T"]
[null,"Intervenant en activité physique adaptée","P"]
[null,"Intervenant en activité physique adaptée","T"]
[null,"Autre personnel paramédical","P"]
[null,"Autre personnel paramédical","T"]
[null,"PHARMACIENS - PREPARATEURS EN PHARMACIE",{"$nulls":5},{"v":1,"d":"100%"},{"$nulls":6},{"v":1,"d":"100%"}]
[{"$nulls":3},{"$f":"SUM(D201:D204)","v":{"v":0,"d":"0.00"}},{"$f":"SUM(E201:E204)","v":{"v":0,"d":"0.00"}},null,null,{"$f":"SUM(H201:H204)","v":{"v":0,"d":"0.00"}},{"$f":"SUM(I201:I204)","v":{"v":0,"d":"0.00 €"}},{"$f":"SUM(J201:J204)","v":{"v":0,"d":"0.00 €"}},null,null,{"$f":"SUM(M201:M204)","v":{"v":0,"d":"0.00 €"}},null,{"$f":"SUM(O201:O204)","v":{"v":0,"d":"0.00"}},{"$f":"SUM(P201:P204)","v":{"v":0,"d":"0.00 €"}}]
[null,"Pharmacien","P"]
[null,"Pharmacien","T"]
[null,"Préparateur en pharmacie","P"]
[null,"Préparateur en pharmacie","T"]
[null,"MEDECIN",{"$nulls":5},{"v":1,"d":"100%"},{"$nulls":6},{"v":1,"d":"100%"}]
[{"$nulls":3},{"$f":"SUM(D207:D216)","v":{"v":0,"d":"0.00"}},{"$f":"SUM(E207:E216)","v":{"v":0,"d":"0.00"}},null,null,{"$f":"SUM(H207:H216)","v":{"v":0,"d":"0.00"}},{"$f":"SUM(I207:I216)","v":{"v":0,"d":"0.00 €"}},{"$f":"SUM(J207:J216)","v":{"v":0,"d":"0.00 €"}},null,null,{"$f":"SUM(M207:M216)","v":{"v":0,"d":"0.00 €"}},null,{"$f":"SUM(O207:O216)","v":{"v":0,"d":"0.00"}},{"$f":"SUM(P207:P216)","v":{"v":0,"d":"0.00 €"}}]
[null,"Médecin coordonnateur","P"]
[null,"Médecin coordonnateur","T"]
[null,"Médecin généraliste","P"]
[null,"Médecin généraliste","T"]
[null,"Gériatre","P"]
[null,"Gériatre","T"]
[null,"Psychiatre","P"]
[null,"Psychiatre","T"]
[null,"Autre médecin","P"]
[null,"Autre médecin","T"]
[null,"TOTAL Personnel extérieur",null,{"$f":"D206+D200+D186+D176+D172+D160+D156+D150+D140+D128","v":{"v":0,"d":"0.00"}},{"$f":"E206+E200+E186+E176+E172+E160+E156+E150+E140+E128","v":{"v":0,"d":"0.00"}},{"v":0,"d":"0.00"},{"v":0,"d":"0.00"},{"v":0,"d":"0.00"},{"v":0,"d":"0.00 €"},{"v":0,"d":"0.00 €"},{"v":0,"d":"0.00 €"},{"v":0,"d":"0.00 €"},{"v":0,"d":"0.00 €"},null,{"$f":"O206+O200+O186+O176+O172+O160+O156+O150+O140+O128","v":{"v":0,"d":"0.00"}},{"$f":"P206+P200+P186+P176+P172+P160+P156+P150+P140+P128","v":{"v":0,"d":"0.00 €"}}]
[null,"(*) Nombre d'ETP et charges inscrits au tableau prévisionnel des emplois rémunérés annexé au cadre EPRD de l'année N-1"]

{"sheet":"TPER Autre ESSMS_SF","index":11,"n_rows":207,"n_cols":13,"rows_kept":207,"hidden":true,"merged":[[1,3,1,5],[2,3,2,5],[3,3,3,5],[5,1,5,12],[7,3,7,9],[7,10,7,12],[8,1,9,1],[8,3,9,3],[8,4,8,5],[8,6,8,7],[8,8,9,8],[8,9,9,9],[111,3,111,4],[111,5,111,6],[111,7,111,8],[111,9,111,10],[113,3,113,4],[113,5,113,6],[113,7,113,8],[113,9,113,10],[114,3,114,4],[114,5,114,6],[114,7,114,8],[114,9,114,10],[115,3,115,4],[115,5,115,6],[115,7,115,8],[115,9,115,10],[116,3,116,4],[116,5,116,6],[116,7,116,8],[116,9,116,10],[117,3,117,4],[117,5,117,6],[117,7,117,8],[117,9,117,10],[118,3,118,4],[118,5,118,6],[118,7,118,8],[118,9,118,10],[119,3,119,4],[119,5,119,6],[119,7,119,8],[119,9,119,10],[120,3,120,4],[120,5,120,6],[120,7,120,8],[120,9,120,10],[121,3,121,4],[121,5,121,6],[121,7,121,8],[121,9,121,10],[122,3,122,4],[122,5,122,6],[122,7,122,8],[122,9,122,10],[123,3,123,4],[123,5,123,6],[123,7,123,8],[123,9,123,10],[124,3,124,4],[124,5,124,6],[124,7,124,8],[124,9,124,10],[125,3,125,4],[125,5,125,6],[125,7,125,8],[125,9,125,10],[126,3,126,4],[126,5,126,6],[126,7,126,8],[126,9,126,10],[127,3,127,4],[127,5,127,6],[127,7,127,8],[127,9,127,10],[128,3,128,4],[128,5,128,6],[128,7,128,8],[128,9,128,10],[129,3,129,4],[129,5,129,6],[129,7,129,8],[129,9,129,10],[130,3,130,4],[130,5,130,6],[130,7,130,8],[130,9,130,10],[131,3,131,4],[131,5,131,6],[131,7,131,8],[131,9,131,10],[132,3,132,4],[132,5,132,6],[132,7,132,8],[132,9,132,10],[133,3,133,4],[133,5,133,6],[133,7,133,8],[133,9,133,10],[134,3,134,4],[134,5,134,6],[134,7,134,8],[134,9,134,10],[135,3,135,4],[135,5,135,6],[135,7,135,8],[135,9,135,10],[136,3,136,4],[136,5,136,6],[136,7,136,8],[136,9,136,10],[137,3,137,4],[137,5,137,6],[137,7,137,8],[137,9,137,10],[138,3,138,4],[138,5,138,6],[138,7,138,8],[138,9,138,10],[139,3,139,4],[139,5,139,6],[139,7,139,8],[139,9,139,10],[140,3,140,4],[140,5,140,6],[140,7,140,8],[140,9,140,10],[141,3,141,4],[141,5,141,6],[141,7,141,8],[141,9,141,10],[142,3,142,4],[142,5,142,6],[142,7,142,8],[142,9,142,10],[143,3,143,4],[143,5,143,6],[143,7,143,8],[143,9,143,10],[144,3,144,4],[144,5,144,6],[144,7,144,8],[144,9,144,10],[145,3,145,4],[145,5,145,6],[145,7,145,8],[145,9,145,10],[146,3,146,4],[146,5,146,6],[146,7,146,8],[146,9,146,10],[147,3,147,4],[147,5,147,6],[147,7,147,8],[147,9,147,10],[148,3,148,4],[148,5,148,6],[148,7,148,8],[148,9,148,10],[149,3,149,4],[149,5,149,6],[149,7,149,8],[149,9,149,10],[150,3,150,4],[150,5,150,6],[150,7,150,8],[150,9,150,10],[151,3,151,4],[151,5,151,6],[151,7,151,8],[151,9,151,10],[152,3,152,4],[152,5,152,6],[152,7,152,8],[152,9,152,10],[153,3,153,4],[153,5,153,6],[153,7,153,8],[153,9,153,10],[154,3,154,4],[154,5,154,6],[154,7,154,8],[154,9,154,10],[155,3,155,4],[155,5,155,6],[155,7,155,8],[155,9,155,10],[156,3,156,4],[156,5,156,6],[156,7,156,8],[156,9,156,10],[157,3,157,4],[157,5,157,6],[157,7,157,8],[157,9,157,10],[158,3,158,4],[158,5,158,6],[158,7,158,8],[158,9,158,10],[159,3,159,4],[159,5,159,6],[159,7,159,8],[159,9,159,10],[160,3,160,4],[160,5,160,6],[160,7,160,8],[160,9,160,10],[161,3,161,4],[161,5,161,6],[161,7,161,8],[161,9,161,10],[162,3,162,4],[162,5,162,6],[162,7,162,8],[162,9,162,10],[163,3,163,4],[163,5,163,6],[163,7,163,8],[163,9,163,10],[164,3,164,4],[164,5,164,6],[164,7,164,8],[164,9,164,10],[165,3,165,4],[165,5,165,6],[165,7,165,8],[165,9,165,10],[166,3,166,4],[166,5,166,6],[166,7,166,8],[166,9,166,10],[167,3,167,4],[167,5,167,6],[167,7,167,8],[167,9,167,10],[168,3,168,4],[168,5,168,6],[168,7,168,8],[168,9,168,10],[169,3,169,4],[169,5,169,6],[169,7,169,8],[169,9,169,10],[170,3,170,4],[170,5,170,6],[170,7,170,8],[170,9,170,10],[171,3,171,4],[171,5,171,6],[171,7,171,8],[171,9,171,10],[172,3,172,4],[172,5,172,6],[172,7,172,8],[172,9,172,10],[173,3,173,4],[173,5,173,6],[173,7,173,8],[173,9,173,10],[174,3,174,4],[174,5,174,6],[174,7,174,8],[174,9,174,10],[175,3,175,4],[175,5,175,6],[175,7,175,8],[175,9,175,10],[176,3,176,4],[176,5,176,6],[176,7,176,8],[176,9,176,10],[177,3,177,4],[177,5,177,6],[177,7,177,8],[177,9,177,10],[178,3,178,4],[178,5,178,6],[178,7,178,8],[178,9,178,10],[179,3,179,4],[179,5,179,6],[179,7,179,8],[179,9,179,10],[180,3,180,4],[180,5,180,6],[180,7,180,8],[180,9,180,10],[181,3,181,4],[181,5,181,6],[181,7,181,8],[181,9,181,10],[182,3,182,4],[182,5,182,6],[182,7,182,8],[182,9,182,10],[183,3,183,4],[183,5,183,6],[183,7,183,8],[183,9,183,10],[184,3,184,4],[184,5,184,6],[184,7,184,8],[184,9,184,10],[185,3,185,4],[185,5,185,6],[185,7,185,8],[185,9,185,10],[186,3,186,4],[186,5,186,6],[186,7,186,8],[186,9,186,10],[187,3,187,4],[187,5,187,6],[187,7,187,8],[187,9,187,10],[188,3,188,4],[188,5,188,6],[188,7,188,8],[188,9,188,10],[189,3,189,4],[189,5,189,6],[189,7,189,8],[189,9,189,10],[190,3,190,4],[190,5,190,6],[190,7,190,8],[190,9,190,10],[191,3,191,4],[191,5,191,6],[191,7,191,8],[191,9,191,10],[192,3,192,4],[192,5,192,6],[192,7,192,8],[192,9,192,10],[193,3,193,4],[193,5,193,6],[193,7,193,8],[193,9,193,10],[194,3,194,4],[194,5,194,6],[194,7,194,8],[194,9,194,10],[195,3,195,4],[195,5,195,6],[195,7,195,8],[195,9,195,10],[196,3,196,4],[196,5,196,6],[196,7,196,8],[196,9,196,10],[197,3,197,4],[197,5,197,6],[197,7,197,8],[197,9,197,10],[198,3,198,4],[198,5,198,6],[198,7,198,8],[198,9,198,10],[199,3,199,4],[199,5,199,6],[199,7,199,8],[199,9,199,10],[200,3,200,4],[200,5,200,6],[200,7,200,8],[200,9,200,10],[201,3,201,4],[201,5,201,6],[201,7,201,8],[201,9,201,10],[202,3,202,4],[202,5,202,6],[202,7,202,8],[202,9,202,10],[203,3,203,4],[203,5,203,6],[203,7,203,8],[203,9,203,10],[204,3,204,4],[204,5,204,6],[204,7,204,8],[204,9,204,10],[205,3,205,4],[205,5,205,6],[205,7,205,8],[205,9,205,10],[206,3,206,4],[206,5,206,6],[206,7,206,8],[206,9,206,10]]}
[]
[null,"Dénomination du CRP sans Finess :"]
[null,"N° Identifiant : "]
[null,"FINESS de rattachement :"]
[]
[null,"Annexe 6C : Tableau prévisionnel des effectifs rémunérés (y compris personnel de remplacement)"]
[]
[null,"Tableau des effectifs",null,"Tableau des effectifs",{"$nulls":6},"Rémunérations brutes + charges sociales et fiscales"]
[null,"Catégorie / emplois",null,"Nombre d'agents à temps plein\n(1)","Temps partiel",null,"Total",null,{"$f":" IF('Page de garde'!$D$4=\"\",\"Nombre d'ETP N-1 (*) (6)\",\"Nombre d'ETP \"&CREFEFIDEN___ANNEEREF___ANN0\\_________-1&\" (*) (6)\")","v":"Nombre d'ETP N-1 (*) (6)"},"Ecart\n(7) = (5)-(6)",{"$f":"IF(CREFEFIDEN___ANNEEREF___ANN0\\_________=\"\",\"N-1\",CREFEFIDEN___ANNEEREF___ANN0\\_________-1)","v":"N-1"},{"$f":"IF(CREFEFIDEN___ANNEEREF___ANN0\\_________=\"\",\"N\",CREFEFIDEN___ANNEEREF___ANN0\\_________)","v":"N"},"Ecart"]
[{"$nulls":4},"Nombre d'agents \n(2)","Nombre d'ETP\n(3)","Nombre d'agents \n(4) = (1)+(2)","Nombre d'ETP\n(5) = (1)+(3)",null,null,"(8)","(9)","(10)=(9)-(8)"]
[]
[null,"DIRECTION / ENCADREMENT",null,{"$f":"SUM(D14:D26)","v":0},{"$f":"SUM(E14:E26)","v":0},{"$f":"SUM(F14:F26)","v":{"v":0,"d":"0.00"}},{"$f":"D12+E12","v":0},{"$f":"D12+F12","v":{"v":0,"d":"0.00"}},{"$f":"SUM(I14:I26)","v":{"v":0,"d":"0.00"}},{"$f":"H12-I12","v":{"v":0,"d":"0.00"}},{"$f":"SUM(K14:K26)","v":{"v":0,"d":"0.00 €"}},{"$f":"SUM(L14:L26)","v":{"v":0,"d":"0.00 €"}},{"$f":"L12-K12","v":{"v":0,"d":"0.00 €"}}]
[null,"Dont emplois temporaires",{"$nulls":4},0,{"$f":"F13+D13","v":{"v":0,"d":"0.00"}},null,{"v":0,"d":"0.00"},null,null,{"v":0,"d":"0.00 €"}]
[null,"Directeur",{"$nulls":4},0,{"v":0,"d":"0.00"},null,{"v":0,"d":"0.00"},null,null,{"v":0,"d":"0.00 €"}]
[null,"Médecin directeur",{"$nulls":4},0,{"v":0,"d":"0.00"},null,{"v":0,"d":"0.00"},null,null,{"v":0,"d":"0.00 €"}]
[null,"Directeur-adjoint",{"$nulls":4},0,{"v":0,"d":"0.00"},null,{"v":0,"d":"0.00"},null,null,{"v":0,"d":"0.00 €"}]
[null,"Chef de service éducatif, pédagogique et social, paramédical",{"$nulls":4},0,{"v":0,"d":"0.00"},null,{"v":0,"d":"0.00"},null,null,{"v":0,"d":"0.00 €"}]
[null,"Chef de service autre (administratif, etc.)",{"$nulls":4},0,{"v":0,"d":"0.00"},null,{"v":0,"d":"0.00"},null,null,{"v":0,"d":"0.00 €"}]
[null,"Chef d'atelier",{"$nulls":4},0,{"v":0,"d":"0.00"},null,{"v":0,"d":"0.00"},null,null,{"v":0,"d":"0.00 €"}]
[null,"Attaché de direction, économe",{"$nulls":4},0,{"v":0,"d":"0.00"},null,{"v":0,"d":"0.00"},null,null,{"v":0,"d":"0.00 €"}]
[null,"Cadre de santé de la filière infirmière",{"$nulls":4},0,{"v":0,"d":"0.00"},null,{"v":0,"d":"0.00"},null,null,{"v":0,"d":"0.00 €"}]
[null,"Cadre de service paramédical, cadre de la filière de rééducation, autre cadre de santé",{"$nulls":4},0,{"v":0,"d":"0.00"},null,{"v":0,"d":"0.00"},null,null,{"v":0,"d":"0.00 €"}]
[null,"Cadre de service éducatif et social",{"$nulls":4},0,{"v":0,"d":"0.00"},null,{"v":0,"d":"0.00"},null,null,{"v":0,"d":"0.00 €"}]
[null,"Responsable et coordonnateur de secteur",{"$nulls":4},0,{"v":0,"d":"0.00"},null,{"v":0,"d":"0.00"},null,null,{"v":0,"d":"0.00 €"}]
[null,"Autres cadres (direction)",{"$nulls":4},0,{"v":0,"d":"0.00"},null,{"v":0,"d":"0.00"},null,null,{"v":0,"d":"0.00 €"}]
[null,"Autres cadres (encadrement de proximité)",{"$nulls":4},0,{"v":0,"d":"0.00"},null,{"v":0,"d":"0.00"},null,null,{"v":0,"d":"0.00 €"}]
[null,"ADMINISTRATION / GESTION",null,{"$f":"SUM(D29:D31)","v":0},{"$f":"SUM(E29:E31)","v":0},{"$f":"SUM(F29:F31)","v":{"v":0,"d":"0.00"}},0,{"v":0,"d":"0.00"},{"$f":"SUM(I29:I31)","v":{"v":0,"d":"0.00"}},{"v":0,"d":"0.00"},{"$f":"SUM(K29:K31)","v":{"v":0,"d":"0.00 €"}},{"$f":"SUM(L29:L31)","v":{"v":0,"d":"0.00 €"}},{"v":0,"d":"0.00 €"}]
[null,"Dont emplois temporaires",{"$nulls":4},0,{"v":0,"d":"0.00"},null,{"v":0,"d":"0.00"},null,null,{"v":0,"d":"0.00 €"}]
[null,"Agent administratif",{"$nulls":4},0,{"v":0,"d":"0.00"},null,{"v":0,"d":"0.00"},null,null,{"v":0,"d":"0.00 €"}]
[null,"Comptable",{"$nulls":4},0,{"v":0,"d":"0.00"},null,{"v":0,"d":"0.00"},null,null,{"v":0,"d":"0.00 €"}]
[null,"Autre personnel administratif et de gestion",{"$nulls":4},0,{"v":0,"d":"0.00"},null,{"v":0,"d":"0.00"},null,null,{"v":0,"d":"0.00 €"}]
[null,"SERVICES GENERAUX",null,{"$f":"SUM(D34:D38)","v":0},{"$f":"SUM(E34:E38)","v":0},{"$f":"SUM(F34:F38)","v":{"v":0,"d":"0.00"}},0,{"v":0,"d":"0.00"},{"$f":"SUM(I34:I38)","v":{"v":0,"d":"0.00"}},{"v":0,"d":"0.00"},{"$f":"SUM(K34:K38)","v":{"v":0,"d":"0.00 €"}},{"$f":"SUM(L34:L38)","v":{"v":0,"d":"0.00 €"}},{"v":0,"d":"0.00 €"}]
[null,"Dont emplois temporaires",{"$nulls":4},0,{"v":0,"d":"0.00"},null,{"v":0,"d":"0.00"},null,null,{"v":0,"d":"0.00 €"}]
[null,"Agent de service général",{"$nulls":4},0,{"v":0,"d":"0.00"},null,{"v":0,"d":"0.00"},null,null,{"v":0,"d":"0.00 €"}]
[null,"Maitre de maison (hors encadrant éducatif de nuit)",{"$nulls":4},0,{"v":0,"d":"0.00"},null,{"v":0,"d":"0.00"},null,null,{"v":0,"d":"0.00 €"}]
[null,"Ouvrier qualifié",{"$nulls":4},0,{"v":0,"d":"0.00"},null,{"v":0,"d":"0.00"},null,null,{"v":0,"d":"0.00 €"}]
[null,"Veilleur de nuit occupant à titre principal des fonctions d'accompagnement socio-éducatif (hors encadrant éducatif de nuit)",{"$nulls":4},0,{"v":0,"d":"0.00"},null,{"v":0,"d":"0.00"},null,null,{"v":0,"d":"0.00 €"}]
[null,"Autre personnel services généraux",{"$nulls":4},0,{"v":0,"d":"0.00"},null,{"v":0,"d":"0.00"},null,null,{"v":0,"d":"0.00 €"}]
[null,"RESTAURATION",null,{"$f":"SUM(D41:D43)","v":0},{"$f":"SUM(E41:E43)","v":0},{"$f":"SUM(F41:F43)","v":{"v":0,"d":"0.00"}},0,{"v":0,"d":"0.00"},{"$f":"SUM(I41:I43)","v":{"v":0,"d":"0.00"}},{"v":0,"d":"0.00"},{"$f":"SUM(K41:K43)","v":{"v":0,"d":"0.00 €"}},{"$f":"SUM(L41:L43)","v":{"v":0,"d":"0.00 €"}},{"v":0,"d":"0.00 €"}]
[null,"Dont emplois temporaires",{"$nulls":4},0,{"v":0,"d":"0.00"},null,{"v":0,"d":"0.00"},null,null,{"v":0,"d":"0.00 €"}]
[null,"Chef cuisinier",{"$nulls":4},0,{"v":0,"d":"0.00"},null,{"v":0,"d":"0.00"},null,null,{"v":0,"d":"0.00 €"}]
[null,"Cuisinier",{"$nulls":4},0,{"v":0,"d":"0.00"},null,{"v":0,"d":"0.00"},null,null,{"v":0,"d":"0.00 €"}]
[null,"Autre personnel de restauration",{"$nulls":4},0,{"v":0,"d":"0.00"},null,{"v":0,"d":"0.00"},null,null,{"v":0,"d":"0.00 €"}]
[null,"ENSEIGNEMENT ET SOCIO-EDUCATIF",null,{"$f":"SUM(D46:D51)+D53+SUM(D55:D75)","v":0},{"$f":"SUM(E46:E51)+E53+SUM(E55:E75)","v":0},{"$f":"SUM(F46:F51)+F53+SUM(F55:F75)","v":{"v":0,"d":"0.00"}},{"$f":"D44+E44","v":0},{"v":0,"d":"0.00"},{"$f":"SUM(I46:I51)+I53+SUM(I55:I75)","v":{"v":0,"d":"0.00"}},{"$f":"H44-I44","v":{"v":0,"d":"0.00"}},{"$f":"SUM(K46:K51)+K53+SUM(K55:K75)","v":{"v":0,"d":"0.00 €"}},{"$f":"SUM(L46:L51)+L53+SUM(L55:L75)","v":{"v":0,"d":"0.00 €"}},{"$f":"L44-K44","v":{"v":0,"d":"0.00 €"}}]
[null,"Dont emplois temporaires",{"$nulls":4},0,{"$f":"F45+D45","v":{"v":0,"d":"0.00"}},null,{"v":0,"d":"0.00"},null,null,{"v":0,"d":"0.00 €"}]
[null,"Enseignant (enseignement primaire)",{"$nulls":4},0,{"v":0,"d":"0.00"},null,{"v":0,"d":"0.00"},null,null,{"v":0,"d":"0.00 €"}]
[null,"Enseignant (enseignement secondaire)",{"$nulls":4},0,{"v":0,"d":"0.00"},null,{"v":0,"d":"0.00"},null,null,{"v":0,"d":"0.00 €"}]
[null,"Enseignant (enseignement supérieur)",{"$nulls":4},0,{"v":0,"d":"0.00"},null,{"v":0,"d":"0.00"},null,null,{"v":0,"d":"0.00 €"}]
[null,"Professeur EPS",{"$nulls":4},0,{"v":0,"d":"0.00"},null,{"v":0,"d":"0.00"},null,null,{"v":0,"d":"0.00 €"}]
[null,"Moniteur EPS",{"$nulls":4},0,{"v":0,"d":"0.00"},null,{"v":0,"d":"0.00"},null,null,{"v":0,"d":"0.00 €"}]
[null,"Accompagnant éducatif et social",{"$nulls":4},0,{"v":0,"d":"0.00"},null,{"v":0,"d":"0.00"},null,null,{"v":0,"d":"0.00 €"}]
[null,"Dont contrats aidés, contrats d'apprentissage et de professionnalisation",{"$nulls":4},0,{"v":0,"d":"0.00"},null,{"v":0,"d":"0.00"},null,null,{"v":0,"d":"0.00 €"}]
[null,"Aide médico-psychologique",{"$nulls":4},0,{"v":0,"d":"0.00"},null,{"v":0,"d":"0.00"},null,null,{"v":0,"d":"0.00 €"}]
[null,"Dont contrats aidés, contrats d'apprentissage et de professionnalisation",{"$nulls":4},0,{"v":0,"d":"0.00"},null,{"v":0,"d":"0.00"},null,null,{"v":0,"d":"0.00 €"}]
[null,"Animateur social",{"$nulls":4},0,{"v":0,"d":"0.00"},null,{"v":0,"d":"0.00"},null,null,{"v":0,"d":"0.00 €"}]
[null,"Assistant de service social/assistant social spécialisé",{"$nulls":4},0,{"v":0,"d":"0.00"},null,{"v":0,"d":"0.00"},null,null,{"v":0,"d":"0.00 €"}]
[null,"Assistant maternel",{"$nulls":4},0,{"v":0,"d":"0.00"},null,{"v":0,"d":"0.00"},null,null,{"v":0,"d":"0.00 €"}]
[null,"Auxiliaire de vie sociale",{"$nulls":4},0,{"v":0,"d":"0.00"},null,{"v":0,"d":"0.00"},null,null,{"v":0,"d":"0.00 €"}]
[null,"Conseiller en économie sociale et familiale",{"$nulls":4},0,{"v":0,"d":"0.00"},null,{"v":0,"d":"0.00"},null,null,{"v":0,"d":"0.00 €"}]
[null,"Educateur jeunes enfants",{"$nulls":4},0,{"v":0,"d":"0.00"},null,{"v":0,"d":"0.00"},null,null,{"v":0,"d":"0.00 €"}]
[null,"Educateur technique ou spécialisé",{"$nulls":4},0,{"v":0,"d":"0.00"},null,{"v":0,"d":"0.00"},null,null,{"v":0,"d":"0.00 €"}]
[null,"Encadrant éducatif de nuit",{"$nulls":4},0,{"v":0,"d":"0.00"},null,{"v":0,"d":"0.00"},null,null,{"v":0,"d":"0.00 €"}]
[null,"Mandataire judiciaire ou délégué aux prestations sociales",{"$nulls":4},0,{"v":0,"d":"0.00"},null,{"v":0,"d":"0.00"},null,null,{"v":0,"d":"0.00 €"}]
[null,"Moniteur d'atelier",{"$nulls":4},0,{"v":0,"d":"0.00"},null,{"v":0,"d":"0.00"},null,null,{"v":0,"d":"0.00 €"}]
[null,"Moniteur éducateur",{"$nulls":4},0,{"v":0,"d":"0.00"},null,{"v":0,"d":"0.00"},null,null,{"v":0,"d":"0.00 €"}]
[null,"Moniteur enseignement ménager",{"$nulls":4},0,{"v":0,"d":"0.00"},null,{"v":0,"d":"0.00"},null,null,{"v":0,"d":"0.00 €"}]
[null,"Moniteur jardin d'enfants",{"$nulls":4},0,{"v":0,"d":"0.00"},null,{"v":0,"d":"0.00"},null,null,{"v":0,"d":"0.00 €"}]
[null,"Personnel d'aide à domicile",{"$nulls":4},0,{"v":0,"d":"0.00"},null,{"v":0,"d":"0.00"},null,null,{"v":0,"d":"0.00 €"}]
[null,"Psychologue/neuropsychologue",{"$nulls":4},0,{"v":0,"d":"0.00"},null,{"v":0,"d":"0.00"},null,null,{"v":0,"d":"0.00 €"}]
[null,"Responsable ou encadrant technique d'atelier",{"$nulls":4},0,{"v":0,"d":"0.00"},null,{"v":0,"d":"0.00"},null,null,{"v":0,"d":"0.00 €"}]
[null,"Technicien de l'intervention sociale et familiale",{"$nulls":4},0,{"v":0,"d":"0.00"},null,{"v":0,"d":"0.00"},null,null,{"v":0,"d":"0.00 €"}]
[null,"Technicien en compensation sensorielle",{"$nulls":4},0,{"v":0,"d":"0.00"},null,{"v":0,"d":"0.00"},null,null,{"v":0,"d":"0.00 €"}]
[null,"Travailleur familial",{"$nulls":4},0,{"v":0,"d":"0.00"},null,{"v":0,"d":"0.00"},null,null,{"v":0,"d":"0.00 €"}]
[null,"Autre personnel socio-éducatif",{"$nulls":4},0,{"v":0,"d":"0.00"},null,{"v":0,"d":"0.00"},null,null,{"v":0,"d":"0.00 €"}]
[null,"Personnel socio-éducatif en cours de formation",{"$nulls":4},0,{"v":0,"d":"0.00"},null,{"v":0,"d":"0.00"},null,null,{"v":0,"d":"0.00 €"}]
[null,"PARAMEDICAL",null,{"$f":"SUM(D79:D94)","v":0},{"$f":"SUM(E79:E94)","v":0},{"$f":"SUM(F79:F94)","v":{"v":0,"d":"0.00"}},{"$f":"D76+E76","v":0},{"v":0,"d":"0.00"},{"$f":"SUM(I79:I94)","v":{"v":0,"d":"0.00"}},{"$f":"H76-I76","v":{"v":0,"d":"0.00"}},{"$f":"SUM(K79:K94)","v":{"v":0,"d":"0.00 €"}},{"$f":"SUM(L79:L94)","v":{"v":0,"d":"0.00 €"}},{"$f":"L76-K76","v":{"v":0,"d":"0.00 €"}}]
[null,"Dont emplois temporaires",{"$nulls":4},0,{"$f":"F77+D77","v":{"v":0,"d":"0.00"}},null,{"v":0,"d":"0.00"},null,null,{"v":0,"d":"0.00 €"}]
[null,"Dont contrats aidés, contrats d'apprentissage et de professionnalisation",{"$nulls":4},0,{"v":0,"d":"0.00"},null,{"v":0,"d":"0.00"},null,null,{"v":0,"d":"0.00 €"}]
[null,"Aide soignant",{"$nulls":4},0,{"v":0,"d":"0.00"},null,{"v":0,"d":"0.00"},null,null,{"v":0,"d":"0.00 €"}]
[null,"Audioprothésiste",{"$nulls":4},0,{"v":0,"d":"0.00"},null,{"v":0,"d":"0.00"},null,null,{"v":0,"d":"0.00 €"}]
[null,"Diététicien",{"$nulls":4},0,{"v":0,"d":"0.00"},null,{"v":0,"d":"0.00"},null,null,{"v":0,"d":"0.00 €"}]
[null,"Ergothérapeute",{"$nulls":4},0,{"v":0,"d":"0.00"},null,{"v":0,"d":"0.00"},null,null,{"v":0,"d":"0.00 €"}]
[null,"Infirmier D.E.",{"$nulls":4},0,{"v":0,"d":"0.00"},null,{"v":0,"d":"0.00"},null,null,{"v":0,"d":"0.00 €"}]
[null,"Infirmier psychiatrique",{"$nulls":4},0,{"v":0,"d":"0.00"},null,{"v":0,"d":"0.00"},null,null,{"v":0,"d":"0.00 €"}]
[null,"Masseur-kinésithérapeute",{"$nulls":4},0,{"v":0,"d":"0.00"},null,{"v":0,"d":"0.00"},null,null,{"v":0,"d":"0.00 €"}]
[null,"Orthophoniste",{"$nulls":4},0,{"v":0,"d":"0.00"},null,{"v":0,"d":"0.00"},null,null,{"v":0,"d":"0.00 €"}]
[null,"Orthoptiste",{"$nulls":4},0,{"v":0,"d":"0.00"},null,{"v":0,"d":"0.00"},null,null,{"v":0,"d":"0.00 €"}]
[null,"Pédicure-podologue",{"$nulls":4},0,{"v":0,"d":"0.00"},null,{"v":0,"d":"0.00"},null,null,{"v":0,"d":"0.00 €"}]
[null,"Personnel médicotechnique de la rééducation",{"$nulls":4},0,{"v":0,"d":"0.00"},null,{"v":0,"d":"0.00"},null,null,{"v":0,"d":"0.00 €"}]
[null,"Psychomotricien",{"$nulls":4},0,{"v":0,"d":"0.00"},null,{"v":0,"d":"0.00"},null,null,{"v":0,"d":"0.00 €"}]
[null,"Puériculteur",{"$nulls":4},0,{"v":0,"d":"0.00"},null,{"v":0,"d":"0.00"},null,null,{"v":0,"d":"0.00 €"}]
[null,"Sage-femme",{"$nulls":4},0,{"v":0,"d":"0.00"},null,{"v":0,"d":"0.00"},null,null,{"v":0,"d":"0.00 €"}]
[null,"Autre personnel paramédical",{"$nulls":4},0,{"v":0,"d":"0.00"},null,{"v":0,"d":"0.00"},null,null,{"v":0,"d":"0.00 €"}]
[null,"Personnel paramédical en formation",{"$nulls":4},0,{"v":0,"d":"0.00"},null,{"v":0,"d":"0.00"},null,null,{"v":0,"d":"0.00 €"}]
[null,"MEDICAL",null,{"$f":"SUM(D97:D103)","v":0},{"$f":"SUM(E97:E103)","v":0},{"$f":"SUM(F97:F103)","v":{"v":0,"d":"0.00"}},0,{"v":0,"d":"0.00"},{"$f":"SUM(I97:I103)","v":{"v":0,"d":"0.00"}},{"v":0,"d":"0.00"},{"$f":"SUM(K97:K103)","v":{"v":0,"d":"0.00 €"}},{"$f":"SUM(L97:L103)","v":{"v":0,"d":"0.00 €"}},{"v":0,"d":"0.00 €"}]
[null,"Dont emplois temporaires",{"$nulls":4},0,{"v":0,"d":"0.00"},null,{"v":0,"d":"0.00"},null,null,{"v":0,"d":"0.00 €"}]
[null,"Médecin pédiatre",{"$nulls":4},0,{"v":0,"d":"0.00"},null,{"v":0,"d":"0.00"},null,null,{"v":0,"d":"0.00 €"}]
[null,"Médecin psychiatre",{"$nulls":4},0,{"v":0,"d":"0.00"},null,{"v":0,"d":"0.00"},null,null,{"v":0,"d":"0.00 €"}]
[null,"Médecin rééducation fonctionnelle",{"$nulls":4},0,{"v":0,"d":"0.00"},null,{"v":0,"d":"0.00"},null,null,{"v":0,"d":"0.00 €"}]
[null,"Médecin autre spécialité",{"$nulls":4},0,{"v":0,"d":"0.00"},null,{"v":0,"d":"0.00"},null,null,{"v":0,"d":"0.00 €"}]
[null,"Médecin généraliste",{"$nulls":4},0,{"v":0,"d":"0.00"},null,{"v":0,"d":"0.00"},null,null,{"v":0,"d":"0.00 €"}]
[null,"Pharmacien",{"$nulls":4},0,{"v":0,"d":"0.00"},null,{"v":0,"d":"0.00"},null,null,{"v":0,"d":"0.00 €"}]
[null,"Autre",{"$nulls":4},0,{"v":0,"d":"0.00"},null,{"v":0,"d":"0.00"},null,null,{"v":0,"d":"0.00 €"}]
[null,"AUTRES FONCTIONS",null,{"$f":"SUM(D106:D107)","v":0},{"$f":"SUM(E106:E107)","v":0},{"$f":"SUM(F106:F107)","v":{"v":0,"d":"0.00"}},0,{"v":0,"d":"0.00"},{"$f":"SUM(I106:I107)","v":{"v":0,"d":"0.00"}},{"v":0,"d":"0.00"},{"$f":"SUM(K106:K107)","v":{"v":0,"d":"0.00 €"}},{"$f":"SUM(L106:L107)","v":{"v":0,"d":"0.00 €"}},{"v":0,"d":"0.00 €"}]
[null,"Dont emplois temporaires",{"$nulls":4},0,{"v":0,"d":"0.00"},null,{"v":0,"d":"0.00"},null,null,{"v":0,"d":"0.00 €"}]
[{"$nulls":6},0,{"v":0,"d":"0.00"},null,{"v":0,"d":"0.00"},null,null,{"v":0,"d":"0.00 €"}]
[{"$nulls":6},0,{"v":0,"d":"0.00"},null,{"v":0,"d":"0.00"},null,null,{"v":0,"d":"0.00 €"}]
[null,"TOTAL Personnel salarié",null,{"$f":"D12+D27+D32+D39+D44+D76+D95+D104","v":0},{"$f":"E12+E27+E32+E39+E44+E76+E95+E104","v":0},{"$f":"F12+F27+F32+F39+F44+F76+F95+F104","v":{"v":0,"d":"0.00"}},0,{"v":0,"d":"0.00"},{"$f":"I12+I27+I32+I39+I44+I76+I95+I104","v":{"v":0,"d":"0.00"}},{"$f":"H108-I108","v":{"v":0,"d":"0.00"}},{"$f":"K12+K27+K32+K39+K44+K76+K95+K104","v":{"v":0,"d":"0.00 €"}},{"$f":"L12+L27+L32+L39+L44+L76+L95+L104","v":{"v":0,"d":"0.00 €"}},{"$f":"L108-K108","v":{"v":0,"d":"0.00 €"}}]
[null,"(*): Nombre d'ETP inscrits au précédent tableau des effectifs rémunérés (budget exécutoire)"]
[]
[null,"Services extérieurs (hors audits, experts juridiques, comptables et commissaires aux comptes)"]
[null,"Catégorie / emplois",null,{"$f":"IF('Page de garde'!$D$4=\"\",\"Equivalents temps plein Année N\",\"Equivalents temps plein Année \"&'Page de garde'!$D$4)","v":"Equivalents temps plein Année N"},null,{"$f":"IF('Page de garde'!$D$4=\"\",\"Equivalents temps plein Année N-1\",\"Equivalents temps plein Année \"&'Page de garde'!$D$4-1)","v":"Equivalents temps plein Année N-1"},null,"N° de compte d'imputation de la prestation - Libellé du compte",null,"Montant de la prestation"]
[]
[null,"DIRECTION / ENCADREMENT",null,{"$f":"SUM(D116:D128)","v":{"v":0,"d":"0.00"}},{"$f":"SUM(#REF!)","v":{"$error":"#REF!"}},{"$f":"SUM(F116:F128)","v":{"v":0,"d":"0.00"}},{"$f":"SUM(#REF!)","v":{"$error":"#REF!"}},null,null,{"$f":"SUM(J116:J128)","v":{"v":0,"d":"0.00 €"}},{"$f":"SUM(#REF!)","v":{"$error":"#REF!"}}]
[null,"Dont emplois temporaires"]
[null,"Directeur"]
[null,"Médecin directeur"]
[null,"Directeur-adjoint"]
[null,"Chef de service éducatif, pédagogique et social, paramédical"]
[null,"Chef de service autre (administratif, etc.)"]
[null,"Chef d'atelier"]
[null,"Attaché de direction, économe"]
[null,"Cadre de santé de la filière infirmière"]
[null,"Cadre de service paramédical, cadre de la filière de rééducation, autre cadre de santé"]
[null,"Cadre de service éducatif et social"]
[null,"Responsable et coordonnateur de secteur"]
[null,"Autres cadres (direction)"]
[null,"Autres cadres (encadrement de proximité)"]
[null,"ADMINISTRATION / GESTION",null,{"$f":"SUM(D131:D133)","v":{"v":0,"d":"0.00"}},{"$f":"SUM(#REF!)","v":{"$error":"#REF!"}},{"$f":"SUM(F131:F133)","v":{"v":0,"d":"0.00"}},{"$f":"SUM(#REF!)","v":{"$error":"#REF!"}},null,null,{"$f":"SUM(J131:J133)","v":{"v":0,"d":"0.00 €"}},{"$f":"SUM(#REF!)","v":{"$error":"#REF!"}}]
[null,"Dont emplois temporaires"]
[null,"Agent administratif"]
[null,"Comptable"]
[null,"Autre personnel administratif et de gestion"]
[null,"SERVICES GENERAUX",null,{"$f":"SUM(D136:D140)","v":{"v":0,"d":"0.00"}},{"$f":"SUM(#REF!)","v":{"$error":"#REF!"}},{"$f":"SUM(F136:F140)","v":{"v":0,"d":"0.00"}},{"$f":"SUM(#REF!)","v":{"$error":"#REF!"}},null,null,{"$f":"SUM(J136:J140)","v":{"v":0,"d":"0.00 €"}},{"$f":"SUM(#REF!)","v":{"$error":"#REF!"}}]
[null,"Dont emplois temporaires"]
[null,"Agent de service général"]
[null,"Maître de maison (hors encadrant éducatif de nuit)"]
[null,"Ouvrier qualifié"]
[null,"Veilleur de nuit occupant à titre principal des fonctions d'accompagnement socio-éducatif (hors encadrant éducatif de nuit)"]
[null,"Autre personnel services généraux"]
[null,"RESTAURATION",null,{"$f":"SUM(D143:D145)","v":{"v":0,"d":"0.00"}},{"$f":"SUM(#REF!)","v":{"$error":"#REF!"}},{"$f":"SUM(F143:F145)","v":{"v":0,"d":"0.00"}},{"$f":"SUM(#REF!)","v":{"$error":"#REF!"}},null,null,{"$f":"SUM(J143:J145)","v":{"v":0,"d":"0.00 €"}},{"$f":"SUM(#REF!)","v":{"$error":"#REF!"}}]
[null,"Dont emplois temporaires"]
[null,"Chef cuisinier"]
[null,"Cuisinier"]
[null,"Autre personnel de restauration"]
[null,"ENSEIGNEMENT ET SOCIO-EDUCATIF",null,{"$f":"SUM(D148:D175)","v":{"v":0,"d":"0.00"}},{"$f":"SUM(#REF!)","v":{"$error":"#REF!"}},{"$f":"SUM(F148:F175)","v":{"v":0,"d":"0.00"}},{"$f":"SUM(#REF!)","v":{"$error":"#REF!"}},null,null,{"$f":"SUM(J148:J175)","v":{"v":0,"d":"0.00 €"}},{"$f":"SUM(#REF!)","v":{"$error":"#REF!"}}]
[null,"Dont emplois temporaires"]
[null,"Enseignant (enseignement primaire)"]
[null,"Enseignant (enseignement secondaire)"]
[null,"Enseignant (enseignement supérieur)"]
[null,"Professeur EPS"]
[null,"Moniteur EPS"]
[null,"Accompagnant éducatif et social"]
[null,"Aide médico-psychologique"]
[null,"Animateur social"]
[null,"Assistant de service social/assistant social spécialisé"]
[null,"Assistant maternel"]
[null,"Auxiliaire de vie sociale"]
[null,"Conseiller en économie sociale et familiale"]
[null,"Educateur jeunes enfants"]
[null,"Educateur technique ou spécialisé"]
[null,"Encadrant éducatif de nuit"]
[null,"Mandataire judiciaire ou délégué aux prestations sociales"]
[null,"Moniteur d'atelier"]
[null,"Moniteur éducateur"]
[null,"Moniteur enseignement ménager"]
[null,"Moniteur jardin d'enfants"]
[null,"Personnel d'aide à domicile"]
[null,"Psychologue/neuropsychologue"]
[null,"Responsable ou encadrant technique d'atelier"]
[null,"Technicien de l'intervention sociale et familiale"]
[null,"Technicien en compensation sensorielle"]
[null,"Travailleur familial"]
[null,"Autre personnel socio-éducatif"]
[null,"Personnel socio-éducatif en cours de formation"]
[null,"PARAMEDICAL",null,{"$f":"SUM(D178:D193)","v":{"v":0,"d":"0.00"}},{"$f":"SUM(#REF!)","v":{"$error":"#REF!"}},{"$f":"SUM(F178:F193)","v":{"v":0,"d":"0.00"}},{"$f":"SUM(#REF!)","v":{"$error":"#REF!"}},null,null,{"$f":"SUM(J178:J193)","v":{"v":0,"d":"0.00 €"}},{"$f":"SUM(#REF!)","v":{"$error":"#REF!"}}]
[null,"Dont emplois temporaires"]
[null,"Aide soignant"]
[null,"Audioprothésiste"]
[null,"Diététicien"]
[null,"Ergothérapeute"]
[null,"Infirmier D.E."]
[null,"Infirmier psychiatrique"]
[null,"Masseur-kinésithérapeute"]
[null,"Orthophoniste"]
[null,"Orthoptiste"]
[null,"Pédicure-podologue"]
[null,"Personnel médicotechnique de la rééducation"]
[null,"Psychomotricien"]
[null,"Puériculteur"]
[null,"Sage-femme"]
[null,"Autre personnel paramédical"]
[null,"Personnel paramédical en formation"]
[null,"MEDICAL",null,{"$f":"SUM(D196:D202)","v":{"v":0,"d":"0.00"}},{"$f":"SUM(#REF!)","v":{"$error":"#REF!"}},{"$f":"SUM(F196:F202)","v":{"v":0,"d":"0.00"}},{"$f":"SUM(#REF!)","v":{"$error":"#REF!"}},null,null,{"$f":"SUM(J196:J202)","v":{"v":0,"d":"0.00 €"}},{"$f":"SUM(#REF!)","v":{"$error":"#REF!"}}]
[null,"Dont emplois temporaires"]
[null,"Médecin pédiatre"]
[null,"Médecin psychiatre"]
[null,"Médecin rééducation fonctionnelle"]
[null,"Médecin autre spécialité"]
[null,"Médecin généraliste"]
[null,"Pharmacien"]
[null,"Autre"]
[null,"AUTRES FONCTIONS",null,{"$f":"SUM(D205:D206)","v":{"v":0,"d":"0.00"}},{"$f":"SUM(#REF!)","v":{"$error":"#REF!"}},{"$f":"SUM(F205:F206)","v":{"v":0,"d":"0.00"}},{"$f":"SUM(#REF!)","v":{"$error":"#REF!"}},null,null,{"$f":"SUM(J205:J206)","v":{"v":0,"d":"0.00 €"}},{"$f":"SUM(#REF!)","v":{"$error":"#REF!"}}]
[null,"Dont emplois temporaires"]
[]
[]
[null,"TOTAL Personnel extérieur",null,{"$f":"D114+D129+D134+D141+D146+D176+D194+D203","v":{"v":0,"d":"0.00"}},{"$f":"SUM(#REF!)","v":{"$error":"#REF!"}},{"$f":"F114+F129+F134+F141+F146+F176+F194+F203","v":{"v":0,"d":"0.00"}},{"$f":"SUM(#REF!)","v":{"$error":"#REF!"}},null,null,{"$f":"J114+J129+J134+J141+J146+J176+J194+J203","v":{"v":0,"d":"0.00 €"}},{"$f":"SUM(#REF!)","v":{"$error":"#REF!"}}]

{"sheet":"TPER ESSMS PH Cofin","index":12,"n_rows":207,"n_cols":15,"rows_kept":207,"hidden":true,"merged":[[1,3,1,5],[2,3,2,5],[5,1,5,12],[8,1,9,1],[8,3,8,6],[8,7,8,9],[8,10,8,12],[108,3,109,3],[108,5,109,5],[108,10,109,10],[108,11,109,11],[111,5,111,7],[111,8,111,9],[113,5,113,7],[113,8,113,9],[114,5,114,7],[114,8,114,9],[115,5,115,7],[115,8,115,9],[116,5,116,7],[116,8,116,9],[117,5,117,7],[117,8,117,9],[118,5,118,7],[118,8,118,9],[119,5,119,7],[119,8,119,9],[120,5,120,7],[120,8,120,9],[121,5,121,7],[121,8,121,9],[122,5,122,7],[122,8,122,9],[123,5,123,7],[123,8,123,9],[124,5,124,7],[124,8,124,9],[125,5,125,7],[125,8,125,9],[126,5,126,7],[126,8,126,9],[127,5,127,7],[127,8,127,9],[128,5,128,7],[128,8,128,9],[129,5,129,7],[129,8,129,9],[130,5,130,7],[130,8,130,9],[131,5,131,7],[131,8,131,9],[132,5,132,7],[132,8,132,9],[133,5,133,7],[133,8,133,9],[134,5,134,7],[134,8,134,9],[135,5,135,7],[135,8,135,9],[136,5,136,7],[136,8,136,9],[137,5,137,7],[137,8,137,9],[138,5,138,7],[138,8,138,9],[139,5,139,7],[139,8,139,9],[140,5,140,7],[140,8,140,9],[141,5,141,7],[141,8,141,9],[142,5,142,7],[142,8,142,9],[143,5,143,7],[143,8,143,9],[144,5,144,7],[144,8,144,9],[145,5,145,7],[145,8,145,9],[146,5,146,7],[146,8,146,9],[147,5,147,7],[147,8,147,9],[148,5,148,7],[148,8,148,9],[149,5,149,7],[149,8,149,9],[150,5,150,7],[150,8,150,9],[151,5,151,7],[151,8,151,9],[152,5,152,7],[152,8,152,9],[153,5,153,7],[153,8,153,9],[154,5,154,7],[154,8,154,9],[155,5,155,7],[155,8,155,9],[156,5,156,7],[156,8,156,9],[157,5,157,7],[157,8,157,9],[158,5,158,7],[158,8,158,9],[159,5,159,7],[159,8,159,9],[160,5,160,7],[160,8,160,9],[161,5,161,7],[161,8,161,9],[162,5,162,7],[162,8,162,9],[163,5,163,7],[163,8,163,9],[164,5,164,7],[164,8,164,9],[165,5,165,7],[165,8,165,9],[166,5,166,7],[166,8,166,9],[167,5,167,7],[167,8,167,9],[168,5,168,7],[168,8,168,9],[169,5,169,7],[169,8,169,9],[170,5,170,7],[170,8,170,9],[171,5,171,7],[171,8,171,9],[172,5,172,7],[172,8,172,9],[173,5,173,7],[173,8,173,9],[174,5,174,7],[174,8,174,9],[175,5,175,7],[175,8,175,9],[176,5,176,7],[176,8,176,9],[177,5,177,7],[177,8,177,9],[178,5,178,7],[178,8,178,9],[179,5,179,7],[179,8,179,9],[180,5,180,7],[180,8,180,9],[181,5,181,7],[181,8,181,9],[182,5,182,7],[182,8,182,9],[183,5,183,7],[183,8,183,9],[184,5,184,7],[184,8,184,9],[185,5,185,7],[185,8,185,9],[186,5,186,7],[186,8,186,9],[187,5,187,7],[187,8,187,9],[188,5,188,7],[188,8,188,9],[189,5,189,7],[189,8,189,9],[190,5,190,7],[190,8,190,9],[191,5,191,7],[191,8,191,9],[192,5,192,7],[192,8,192,9],[193,5,193,7],[193,8,193,9],[194,5,194,7],[194,8,194,9],[195,5,195,7],[195,8,195,9],[196,5,196,7],[196,8,196,9],[197,5,197,7],[197,8,197,9],[198,5,198,7],[198,8,198,9],[199,5,199,7],[199,8,199,9],[200,5,200,7],[200,8,200,9],[201,5,201,7],[201,8,201,9],[202,5,202,7],[202,8,202,9],[203,5,203,7],[203,8,203,9],[204,5,204,7],[204,8,204,9],[205,5,205,7],[205,8,205,9],[206,5,206,7],[206,8,206,9]]}
[]
[null,"Raison sociale :"]
[null,"FINESS ET :"]
[]
[]
[null,"Annexe 6B : Tableau prévisionnel des effectifs rémunérés (y compris personnel de remplacement) applicable aux établissements et services cofinancés (FAM, SAMSAH, etc.)"]
[]
[]
[null,"Catégorie / emplois",null,"Tableau des effectifs global",{"$nulls":3},"Dont effectifs émargeant sur le forfait soins",null,null,"Rémunérations brutes + charges sociales et fiscales"]
[{"$nulls":3},{"$f":"IF('Page de garde'!$D$4=\"\",\"ETP (année N) (1)\",\"ETP (année \"&'Page de garde'!$D$4&\") (1)\")","v":"ETP (année N) (1)"},{"$f":"IF('Page de garde'!$D$4=\"\",\"Nbre d'agents (prévu N)\",\"Nbre d'agents (prévu \"&'Page de garde'!$D$4&\")\")","v":"Nbre d'agents (prévu N)"},{"$f":"IF('Page de garde'!$D$4=\"\",\"ETP \n(année N-1) (*) (2)\",\"ETP (année \"&'Page de garde'!$D$4-1&\") (*) (2)\")","v":"ETP \n(année N-1) (*) (2)"},"Ecart: (1)-(2)",{"$f":"IF('Page de garde'!$D$4=\"\",\"ETP (année N) (1)\",\"ETP (année \"&'Page de garde'!$D$4&\") (1)\")","v":"ETP (année N) (1)"},{"$f":"IF('Page de garde'!$D$4=\"\",\"ETP \n(année N-1) (*) (2)\",\"ETP (année \"&'Page de garde'!$D$4-1&\") (*) (2)\")","v":"ETP \n(année N-1) (*) (2)"},"Ecart: (1)-(2)",{"$f":"IF('Page de garde'!$D$4=\"\",\"Année N \n(3)\",\"Année \"&'Page de garde'!$D$4&\" (3)\")","v":"Année N \n(3)"},{"$f":"IF('Page de garde'!$D$4=\"\",\"Année N-1 \n(4)\",\"Année \"&'Page de garde'!$D$4-1&\" (4)\")","v":"Année N-1 \n(4)"},"Ecart: (3)-(4)"]
[]
[null,"DIRECTION / ENCADREMENT",null,{"$f":"SUM(D14:D26)","v":{"v":0,"d":"0.00"}},{"$f":"SUM(E14:E26)","v":0},{"$f":"SUM(F14:F26)","v":{"v":0,"d":"0.00"}},{"$f":"D12-F12","v":{"v":0,"d":"0.00"}},{"$f":"SUM(H14:H26)","v":{"v":0,"d":"0.00"}},{"$f":"SUM(I14:I26)","v":{"v":0,"d":"0.00"}},{"$f":"H12-I12","v":{"v":0,"d":"0.00"}},{"$f":"SUM(K14:K26)","v":{"v":0,"d":"0.00 €"}},{"$f":"SUM(L14:L26)","v":{"v":0,"d":"0.00 €"}},{"$f":"K12-L12","v":{"v":0,"d":"0.00 €"}}]
[null,"Dont emplois temporaires",{"$nulls":4},{"v":0,"d":"0.00"},null,null,{"v":0,"d":"0.00"},null,null,{"v":0,"d":"0.00 €"},null,{"$f":"IF(AND(D13<>0,OR(K13=0,K13=\"\")),\"Saisie incohérente : ETP sans rémunération correspondante\",IF(AND(K13<>0,OR(D13=0,D13=\"\")),\"Saisie incohérente : rémunération sans ETP correspondant\",\"\"))","v":""}]
[null,"Directeur",{"$nulls":4},{"v":0,"d":"0.00"},null,null,{"v":0,"d":"0.00"},null,null,{"v":0,"d":"0.00 €"},null,{"$f":"IF(AND(D14<>0,OR(K14=0,K14=\"\")),\"Saisie incohérente : ETP sans rémunération correspondante\",IF(AND(K14<>0,OR(D14=0,D14=\"\")),\"Saisie incohérente : rémunération sans ETP correspondant\",\"\"))","v":""}]
[null,"Médecin directeur",{"$nulls":4},{"v":0,"d":"0.00"},null,null,{"v":0,"d":"0.00"},null,null,{"v":0,"d":"0.00 €"},null,""]
[null,"Directeur-adjoint",{"$nulls":4},{"v":0,"d":"0.00"},null,null,{"v":0,"d":"0.00"},null,null,{"v":0,"d":"0.00 €"},null,""]
[null,"Chef de service éducatif, pédagogique et social, paramédical",{"$nulls":4},{"v":0,"d":"0.00"},null,null,{"v":0,"d":"0.00"},null,null,{"v":0,"d":"0.00 €"},null,""]
[null,"Chef de service autre (administratif, etc.)",{"$nulls":4},{"v":0,"d":"0.00"},null,null,{"v":0,"d":"0.00"},null,null,{"v":0,"d":"0.00 €"},null,""]
[null,"Chef d'atelier",{"$nulls":4},{"v":0,"d":"0.00"},null,null,{"v":0,"d":"0.00"},null,null,{"v":0,"d":"0.00 €"},null,""]
[null,"Attaché de direction, économe",{"$nulls":4},{"v":0,"d":"0.00"},null,null,{"v":0,"d":"0.00"},null,null,{"v":0,"d":"0.00 €"},null,""]
[null,"Cadre de santé de la filière infirmière",{"$nulls":4},{"v":0,"d":"0.00"},null,null,{"v":0,"d":"0.00"},null,null,{"v":0,"d":"0.00 €"},null,""]
[null,"Cadre de service paramédical, cadre de la filière de rééducation, autre cadre de santé",{"$nulls":4},{"v":0,"d":"0.00"},null,null,{"v":0,"d":"0.00"},null,null,{"v":0,"d":"0.00 €"},null,""]
[null,"Cadre de service éducatif et social",{"$nulls":4},{"v":0,"d":"0.00"},null,null,{"v":0,"d":"0.00"},null,null,{"v":0,"d":"0.00 €"},null,""]
[null,"Responsable et coordonnateur de secteur",{"$nulls":4},{"v":0,"d":"0.00"},null,null,{"v":0,"d":"0.00"},null,null,{"v":0,"d":"0.00 €"},null,""]
[null,"Autres cadres (direction)",{"$nulls":4},{"v":0,"d":"0.00"},null,null,{"v":0,"d":"0.00"},null,null,{"v":0,"d":"0.00 €"},null,""]
[null,"Autres cadres (encadrement de proximité)",{"$nulls":4},{"v":0,"d":"0.00"},null,null,{"v":0,"d":"0.00"},null,null,{"v":0,"d":"0.00 €"},null,""]
[null,"ADMINISTRATION / GESTION",null,{"$f":"SUM(D29:D31)","v":{"v":0,"d":"0.00"}},{"$f":"SUM(E29:E31)","v":0},{"$f":"SUM(F29:F31)","v":{"v":0,"d":"0.00"}},{"v":0,"d":"0.00"},{"$f":"SUM(H29:H31)","v":{"v":0,"d":"0.00"}},{"$f":"SUM(I29:I31)","v":{"v":0,"d":"0.00"}},{"v":0,"d":"0.00"},{"$f":"SUM(K29:K31)","v":{"v":0,"d":"0.00 €"}},{"$f":"SUM(L29:L31)","v":{"v":0,"d":"0.00 €"}},{"v":0,"d":"0.00 €"}]
[null,"Dont emplois temporaires",{"$nulls":4},{"v":0,"d":"0.00"},null,null,{"v":0,"d":"0.00"},null,null,{"v":0,"d":"0.00 €"},null,{"$f":"IF(AND(D28<>0,OR(K28=0,K28=\"\")),\"Saisie incohérente : ETP sans rémunération correspondante\",IF(AND(K28<>0,OR(D28=0,D28=\"\")),\"Saisie incohérente : rémunération sans ETP correspondant\",\"\"))","v":""}]
[null,"Agent administratif",{"$nulls":4},{"v":0,"d":"0.00"},null,null,{"v":0,"d":"0.00"},null,null,{"v":0,"d":"0.00 €"},null,""]
[null,"Comptable",{"$nulls":4},{"v":0,"d":"0.00"},null,null,{"v":0,"d":"0.00"},null,null,{"v":0,"d":"0.00 €"},null,""]
[null,"Autre personnel administratif et de gestion",{"$nulls":4},{"v":0,"d":"0.00"},null,null,{"v":0,"d":"0.00"},null,null,{"v":0,"d":"0.00 €"},null,""]
[null,"SERVICES GENERAUX",null,{"$f":"SUM(D34:D38)","v":{"v":0,"d":"0.00"}},{"$f":"SUM(E34:E38)","v":0},{"$f":"SUM(F34:F38)","v":{"v":0,"d":"0.00"}},{"v":0,"d":"0.00"},{"$f":"SUM(H34:H38)","v":{"v":0,"d":"0.00"}},{"$f":"SUM(I34:I38)","v":{"v":0,"d":"0.00"}},{"v":0,"d":"0.00"},{"$f":"SUM(K34:K38)","v":{"v":0,"d":"0.00 €"}},{"$f":"SUM(L34:L38)","v":{"v":0,"d":"0.00 €"}},{"v":0,"d":"0.00 €"}]
[null,"Dont emplois temporaires",{"$nulls":4},{"v":0,"d":"0.00"},null,null,{"v":0,"d":"0.00"},null,null,{"v":0,"d":"0.00 €"},null,""]
[null,"Agent de service général",{"$nulls":4},{"v":0,"d":"0.00"},null,null,{"v":0,"d":"0.00"},null,null,{"v":0,"d":"0.00 €"},null,""]
[null,"Maitre de maison (hors encadrant éducatif de nuit)",{"$nulls":4},{"v":0,"d":"0.00"},null,null,{"v":0,"d":"0.00"},null,null,{"v":0,"d":"0.00 €"},null,""]
[null,"Ouvrier qualifié",{"$nulls":4},{"v":0,"d":"0.00"},null,null,{"v":0,"d":"0.00"},null,null,{"v":0,"d":"0.00 €"},null,""]
[null,"Veilleur de nuit occupant à titre principal des fonctions d'accompagnement socio-éducatif (hors encadrant éducatif de nuit)",{"$nulls":4},{"v":0,"d":"0.00"},null,null,{"v":0,"d":"0.00"},null,null,{"v":0,"d":"0.00 €"},null,""]
[null,"Autre personnel services généraux",{"$nulls":4},{"v":0,"d":"0.00"},null,null,{"v":0,"d":"0.00"},null,null,{"v":0,"d":"0.00 €"},null,""]
[null,"RESTAURATION",null,{"$f":"SUM(D41:D43)","v":{"v":0,"d":"0.00"}},{"$f":"SUM(E41:E43)","v":0},{"$f":"SUM(F41:F43)","v":{"v":0,"d":"0.00"}},{"v":0,"d":"0.00"},{"$f":"SUM(H41:H43)","v":{"v":0,"d":"0.00"}},{"$f":"SUM(I41:I43)","v":{"v":0,"d":"0.00"}},{"v":0,"d":"0.00"},{"$f":"SUM(K41:K43)","v":{"v":0,"d":"0.00 €"}},{"$f":"SUM(L41:L43)","v":{"v":0,"d":"0.00 €"}},{"v":0,"d":"0.00 €"}]
[null,"Dont emplois temporaires",{"$nulls":4},{"v":0,"d":"0.00"},null,null,{"v":0,"d":"0.00"},null,null,{"v":0,"d":"0.00 €"},null,""]
[null,"Chef cuisinier",{"$nulls":4},{"v":0,"d":"0.00"},null,null,{"v":0,"d":"0.00"},null,null,{"v":0,"d":"0.00 €"},null,""]
[null,"Cuisinier",{"$nulls":4},{"v":0,"d":"0.00"},null,null,{"v":0,"d":"0.00"},null,null,{"v":0,"d":"0.00 €"},null,""]
[null,"Autre personnel de restauration",{"$nulls":4},{"v":0,"d":"0.00"},null,null,{"v":0,"d":"0.00"},null,null,{"v":0,"d":"0.00 €"},null,""]
[null,"ENSEIGNEMENT ET SOCIO-EDUCATIF",null,{"$f":"SUM(D46:D51)+D53+SUM(D55:D75)","v":{"v":0,"d":"0.00"}},{"$f":"SUM(E46:E51)+E53+SUM(E55:E75)","v":0},{"$f":"SUM(F46:F51)+F53+SUM(F55:F75)","v":{"v":0,"d":"0.00"}},{"$f":"D44-F44","v":{"v":0,"d":"0.00"}},{"$f":"SUM(H46:H51)+H53+SUM(H55:H75)","v":{"v":0,"d":"0.00"}},{"$f":"SUM(I46:I51)+I53+SUM(I55:I75)","v":{"v":0,"d":"0.00"}},{"$f":"H44-I44","v":{"v":0,"d":"0.00"}},{"$f":"SUM(K46:K51)+K53+SUM(K55:K75)","v":{"v":0,"d":"0.00 €"}},{"$f":"SUM(L46:L51)+L53+SUM(L55:L75)","v":{"v":0,"d":"0.00 €"}},{"$f":"K44-L44","v":{"v":0,"d":"0.00 €"}}]
[null,"Dont emplois temporaires",{"$nulls":4},{"v":0,"d":"0.00"},null,null,{"v":0,"d":"0.00"},null,null,{"v":0,"d":"0.00 €"},null,""]
[null,"Enseignant (enseignement primaire)",{"$nulls":4},{"v":0,"d":"0.00"},null,null,{"v":0,"d":"0.00"},null,null,{"v":0,"d":"0.00 €"},null,""]
[null,"Enseignant (enseignement secondaire)",{"$nulls":4},{"v":0,"d":"0.00"},null,null,{"v":0,"d":"0.00"},null,null,{"v":0,"d":"0.00 €"},null,""]
[null,"Enseignant (enseignement supérieur)",{"$nulls":4},{"v":0,"d":"0.00"},null,null,{"v":0,"d":"0.00"},null,null,{"v":0,"d":"0.00 €"},null,""]
[null,"Professeur EPS",{"$nulls":4},{"v":0,"d":"0.00"},null,null,{"v":0,"d":"0.00"},null,null,{"v":0,"d":"0.00 €"},null,""]
[null,"Moniteur EPS",{"$nulls":4},{"v":0,"d":"0.00"},null,null,{"v":0,"d":"0.00"},null,null,{"v":0,"d":"0.00 €"},null,""]
[null,"Accompagnant éducatif et social",{"$nulls":4},{"v":0,"d":"0.00"},null,null,{"v":0,"d":"0.00"},null,null,{"v":0,"d":"0.00 €"},null,""]
[null,"Dont contrats aidés, contrats d'apprentissage et de professionnalisation",{"$nulls":4},{"v":0,"d":"0.00"},null,null,{"v":0,"d":"0.00"},null,null,{"v":0,"d":"0.00 €"},null,""]
[null,"Aide médico-psychologique",{"$nulls":4},{"v":0,"d":"0.00"},null,null,{"v":0,"d":"0.00"},null,null,{"v":0,"d":"0.00 €"},null,""]
[null,"Dont contrats aidés, contrats d'apprentissage et de professionnalisation",{"$nulls":4},{"v":0,"d":"0.00"},null,null,{"v":0,"d":"0.00"},null,null,{"v":0,"d":"0.00 €"},null,""]
[null,"Animateur social",{"$nulls":4},{"v":0,"d":"0.00"},null,null,{"v":0,"d":"0.00"},null,null,{"v":0,"d":"0.00 €"},null,""]
[null,"Assistant de service social/assistant social spécialisé",{"$nulls":4},{"v":0,"d":"0.00"},null,null,{"v":0,"d":"0.00"},null,null,{"v":0,"d":"0.00 €"},null,""]
[null,"Assistant maternel",{"$nulls":4},{"v":0,"d":"0.00"},null,null,{"v":0,"d":"0.00"},null,null,{"v":0,"d":"0.00 €"},null,""]
[null,"Auxiliaire de vie sociale",{"$nulls":4},{"v":0,"d":"0.00"},null,null,{"v":0,"d":"0.00"},null,null,{"v":0,"d":"0.00 €"},null,""]
[null,"Conseiller en économie sociale et familiale",{"$nulls":4},{"v":0,"d":"0.00"},null,null,{"v":0,"d":"0.00"},null,null,{"v":0,"d":"0.00 €"},null,""]
[null,"Educateur jeunes enfants",{"$nulls":4},{"v":0,"d":"0.00"},null,null,{"v":0,"d":"0.00"},null,null,{"v":0,"d":"0.00 €"},null,""]
[null,"Educateur technique ou spécialisé",{"$nulls":4},{"v":0,"d":"0.00"},null,null,{"v":0,"d":"0.00"},null,null,{"v":0,"d":"0.00 €"},null,""]
[null,"Encadrant éducatif de nuit",{"$nulls":4},{"v":0,"d":"0.00"},null,null,{"v":0,"d":"0.00"},null,null,{"v":0,"d":"0.00 €"},null,""]
[null,"Mandataire judiciaire ou délégué aux prestations sociales",{"$nulls":4},{"v":0,"d":"0.00"},null,null,{"v":0,"d":"0.00"},null,null,{"v":0,"d":"0.00 €"},null,""]
[null,"Moniteur d'atelier",{"$nulls":4},{"v":0,"d":"0.00"},null,null,{"v":0,"d":"0.00"},null,null,{"v":0,"d":"0.00 €"},null,""]
[null,"Moniteur éducateur",{"$nulls":4},{"v":0,"d":"0.00"},null,null,{"v":0,"d":"0.00"},null,null,{"v":0,"d":"0.00 €"},null,""]
[null,"Moniteur enseignement ménager",{"$nulls":4},{"v":0,"d":"0.00"},null,null,{"v":0,"d":"0.00"},null,null,{"v":0,"d":"0.00 €"},null,""]
[null,"Moniteur jardin d'enfants",{"$nulls":4},{"v":0,"d":"0.00"},null,null,{"v":0,"d":"0.00"},null,null,{"v":0,"d":"0.00 €"},null,""]
[null,"Personnel d'aide à domicile",{"$nulls":4},{"v":0,"d":"0.00"},null,null,{"v":0,"d":"0.00"},null,null,{"v":0,"d":"0.00 €"},null,""]
[null,"Psychologue/neuropsychologue",{"$nulls":4},{"v":0,"d":"0.00"},null,null,{"v":0,"d":"0.00"},null,null,{"v":0,"d":"0.00 €"},null,""]
[null,"Responsable ou encadrant technique d'atelier",{"$nulls":4},{"v":0,"d":"0.00"},null,null,{"v":0,"d":"0.00"},null,null,{"v":0,"d":"0.00 €"},null,""]
[null,"Technicien de l'intervention sociale et familiale",{"$nulls":4},{"v":0,"d":"0.00"},null,null,{"v":0,"d":"0.00"},null,null,{"v":0,"d":"0.00 €"},null,""]
[null,"Technicien en compensation sensorielle",{"$nulls":4},{"v":0,"d":"0.00"},null,null,{"v":0,"d":"0.00"},null,null,{"v":0,"d":"0.00 €"},null,""]
[null,"Travailleur familial",{"$nulls":4},{"v":0,"d":"0.00"},null,null,{"v":0,"d":"0.00"},null,null,{"v":0,"d":"0.00 €"},null,""]
[null,"Autre personnel socio-éducatif",{"$nulls":4},{"v":0,"d":"0.00"},null,null,{"v":0,"d":"0.00"},null,null,{"v":0,"d":"0.00 €"},null,""]
[null,"Personnel socio-éducatif en cours de formation",{"$nulls":4},{"v":0,"d":"0.00"},null,null,{"v":0,"d":"0.00"},null,null,{"v":0,"d":"0.00 €"},null,""]
[null,"PARAMEDICAL",null,{"$f":"SUM(D79:D94)","v":{"v":0,"d":"0.00"}},{"$f":"SUM(E79:E94)","v":0},{"$f":"SUM(F79:F94)","v":{"v":0,"d":"0.00"}},{"$f":"D76-F76","v":{"v":0,"d":"0.00"}},{"$f":"SUM(H79:H94)","v":{"v":0,"d":"0.00"}},{"$f":"SUM(I79:I94)","v":{"v":0,"d":"0.00"}},{"$f":"H76-I76","v":{"v":0,"d":"0.00"}},{"$f":"SUM(K79:K94)","v":{"v":0,"d":"0.00 €"}},{"$f":"SUM(L79:L94)","v":{"v":0,"d":"0.00 €"}},{"$f":"K76-L76","v":{"v":0,"d":"0.00 €"}}]
[null,"Dont emplois temporaires",{"$nulls":4},{"v":0,"d":"0.00"},null,null,{"v":0,"d":"0.00"},null,null,{"v":0,"d":"0.00 €"},null,""]
[null,"Dont contrats aidés, contrats d'apprentissage et de professionnalisation",{"$nulls":4},{"v":0,"d":"0.00"},null,null,{"v":0,"d":"0.00"},null,null,{"v":0,"d":"0.00 €"},null,""]
[null,"Aide soignant",{"$nulls":4},{"v":0,"d":"0.00"},null,null,{"v":0,"d":"0.00"},null,null,{"v":0,"d":"0.00 €"},null,""]
[null,"Audioprothésiste",{"$nulls":4},{"v":0,"d":"0.00"},null,null,{"v":0,"d":"0.00"},null,null,{"v":0,"d":"0.00 €"},null,""]
[null,"Diététicien",{"$nulls":4},{"v":0,"d":"0.00"},null,null,{"v":0,"d":"0.00"},null,null,{"v":0,"d":"0.00 €"},null,""]
[null,"Ergothérapeute",{"$nulls":4},{"v":0,"d":"0.00"},null,null,{"v":0,"d":"0.00"},null,null,{"v":0,"d":"0.00 €"},null,""]
[null,"Infirmier D.E.",{"$nulls":4},{"v":0,"d":"0.00"},null,null,{"v":0,"d":"0.00"},null,null,{"v":0,"d":"0.00 €"},null,""]
[null,"Infirmier psychiatrique",{"$nulls":4},{"v":0,"d":"0.00"},null,null,{"v":0,"d":"0.00"},null,null,{"v":0,"d":"0.00 €"},null,""]
[null,"Masseur-kinésithérapeute",{"$nulls":4},{"v":0,"d":"0.00"},null,null,{"v":0,"d":"0.00"},null,null,{"v":0,"d":"0.00 €"},null,""]
[null,"Orthophoniste",{"$nulls":4},{"v":0,"d":"0.00"},null,null,{"v":0,"d":"0.00"},null,null,{"v":0,"d":"0.00 €"},null,""]
[null,"Orthoptiste",{"$nulls":4},{"v":0,"d":"0.00"},null,null,{"v":0,"d":"0.00"},null,null,{"v":0,"d":"0.00 €"},null,""]
[null,"Pédicure-podologue",{"$nulls":4},{"v":0,"d":"0.00"},null,null,{"v":0,"d":"0.00"},null,null,{"v":0,"d":"0.00 €"},null,""]
[null,"Personnel médicotechnique de la rééducation",{"$nulls":4},{"v":0,"d":"0.00"},null,null,{"v":0,"d":"0.00"},null,null,{"v":0,"d":"0.00 €"},null,""]
[null,"Psychomotricien",{"$nulls":4},{"v":0,"d":"0.00"},null,null,{"v":0,"d":"0.00"},null,null,{"v":0,"d":"0.00 €"},null,""]
[null,"Puériculteur",{"$nulls":4},{"v":0,"d":"0.00"},null,null,{"v":0,"d":"0.00"},null,null,{"v":0,"d":"0.00 €"},null,""]
[null,"Sage-femme",{"$nulls":4},{"v":0,"d":"0.00"},null,null,{"v":0,"d":"0.00"},null,null,{"v":0,"d":"0.00 €"},null,{"$f":"IF(AND(D92<>0,OR(K92=0,K92=\"\")),\"Saisie incohérente : ETP sans rémunération correspondante\",IF(AND(K92<>0,OR(D92=0,D92=\"\")),\"Saisie incohérente : rémunération sans ETP correspondant\",\"\"))","v":""}]
[null,"Autre personnel paramédical",{"$nulls":4},{"v":0,"d":"0.00"},null,null,{"v":0,"d":"0.00"},null,null,{"v":0,"d":"0.00 €"},null,""]
[null,"Personnel paramédical en formation",{"$nulls":4},{"v":0,"d":"0.00"},null,null,{"v":0,"d":"0.00"},null,null,{"v":0,"d":"0.00 €"},null,""]
[null,"MEDICAL",null,{"$f":"SUM(D97:D103)","v":{"v":0,"d":"0.00"}},{"$f":"SUM(E97:E103)","v":0},{"$f":"SUM(F97:F103)","v":{"v":0,"d":"0.00"}},{"v":0,"d":"0.00"},{"$f":"SUM(H97:H103)","v":{"v":0,"d":"0.00"}},{"$f":"SUM(I97:I103)","v":{"v":0,"d":"0.00"}},{"v":0,"d":"0.00"},{"$f":"SUM(K97:K103)","v":{"v":0,"d":"0.00 €"}},{"$f":"SUM(L97:L103)","v":{"v":0,"d":"0.00 €"}},{"v":0,"d":"0.00 €"}]
[null,"Dont emplois temporaires",{"$nulls":4},{"v":0,"d":"0.00"},null,null,{"v":0,"d":"0.00"},null,null,{"v":0,"d":"0.00 €"},null,""]
[null,"Médecin pédiatre",{"$nulls":4},{"v":0,"d":"0.00"},null,null,{"v":0,"d":"0.00"},null,null,{"v":0,"d":"0.00 €"},null,""]
[null,"Médecin psychiatre",{"$nulls":4},{"v":0,"d":"0.00"},null,null,{"v":0,"d":"0.00"},null,null,{"v":0,"d":"0.00 €"},null,""]
[null,"Médecin rééducation fonctionnelle",{"$nulls":4},{"v":0,"d":"0.00"},null,null,{"v":0,"d":"0.00"},null,null,{"v":0,"d":"0.00 €"},null,""]
[null,"Médecin autre spécialité",{"$nulls":4},{"v":0,"d":"0.00"},null,null,{"v":0,"d":"0.00"},null,null,{"v":0,"d":"0.00 €"},null,""]
[null,"Médecin généraliste",{"$nulls":4},{"v":0,"d":"0.00"},null,null,{"v":0,"d":"0.00"},null,null,{"v":0,"d":"0.00 €"},null,""]
[null,"Pharmacien",{"$nulls":4},{"v":0,"d":"0.00"},null,null,{"v":0,"d":"0.00"},null,null,{"v":0,"d":"0.00 €"},null,""]
[null,"Autre",{"$nulls":4},{"v":0,"d":"0.00"},null,null,{"v":0,"d":"0.00"},null,null,{"v":0,"d":"0.00 €"},null,""]
[null,"AUTRES FONCTIONS",null,{"$f":"SUM(D106:D107)","v":{"v":0,"d":"0.00"}},{"$f":"SUM(E106:E107)","v":0},{"$f":"SUM(F106:F107)","v":{"v":0,"d":"0.00"}},{"v":0,"d":"0.00"},{"$f":"SUM(H106:H107)","v":{"v":0,"d":"0.00"}},{"$f":"SUM(I106:I107)","v":{"v":0,"d":"0.00"}},{"v":0,"d":"0.00"},{"$f":"SUM(K106:K107)","v":{"v":0,"d":"0.00 €"}},{"$f":"SUM(L106:L107)","v":{"v":0,"d":"0.00 €"}},{"v":0,"d":"0.00 €"}]
[null,"Dont emplois temporaires",{"$nulls":4},{"v":0,"d":"0.00"},null,null,{"v":0,"d":"0.00"},null,null,{"v":0,"d":"0.00 €"},null,""]
[{"$nulls":6},{"v":0,"d":"0.00"},null,null,{"v":0,"d":"0.00"},null,null,{"v":0,"d":"0.00 €"},null,""]
[{"$nulls":6},{"v":0,"d":"0.00"},null,null,{"v":0,"d":"0.00"},null,null,{"v":0,"d":"0.00 €"},null,""]
[null,"TOTAL Personnel salarié",null,{"$f":"D12+D27+D32+D39+D44+D76+D95+D104","v":{"v":0,"d":"0.00"}},{"$f":"E12+E27+E32+E39+E44+E76+E95+E104","v":0},{"v":0,"d":"0.00"},{"v":0,"d":"0.00"},{"v":0,"d":"0.00"},{"v":0,"d":"0.00"},{"v":0,"d":"0.00"},{"$f":"K12+K27+K32+K39+K44+K76+K95+K104","v":{"v":0,"d":"0.00 €"}},{"v":0,"d":"0.00 €"},{"v":0,"d":"0.00 €"}]
[null,"(*): Nombre d'ETP inscrits au précédent tableau des effectifs rémunérés (budget exécutoire)",null,{"$f":"IF(OR(D108=\"\",D108=0),\"Effectifs N non saisis\",\"\")","v":"Effectifs N non saisis"},null,{"$f":"IF(OR(F108=\"\",F108=0),\"Effectifs N-1 non saisis\",\"\")","v":"Effectifs N-1 non saisis"},{"$nulls":4},{"$f":"IF(OR(K108=\"\",K108=0),\"Rémunérations N non saisies\",\"\")","v":"Rémunérations N non saisies"},{"$f":"IF(OR(L108=\"\",L108=0),\"Rémunérations N-1 non saisies\",\"\")","v":"Rémunérations N-1 non saisies"}]
[]
[null,"Services extérieurs (hors audits, experts juridiques, comptables et commissaires aux comptes)"]
[null,"Catégorie / emplois",null,{"$f":"IF('Page de garde'!$D$4=\"\",\"Equivalents temps plein Année N\",\"Equivalents temps plein Année \"&'Page de garde'!$D$4)","v":"Equivalents temps plein Année N"},{"$f":"IF('Page de garde'!$D$4=\"\",\"Equivalents temps plein Année N-1\",\"Equivalents temps plein Année \"&'Page de garde'!$D$4-1)","v":"Equivalents temps plein Année N-1"},"N° de compte d'imputation de la prestation - Libellé du compte",null,null,"Montant de la prestation"]
[]
[null,"DIRECTION / ENCADREMENT",null,{"$f":"SUM(D116:D128)","v":{"v":0,"d":"0.00"}},{"$f":"SUM(E116:E128)","v":{"v":0,"d":"0.00"}},{"$nulls":3},{"$f":"SUM(I116:J128)","v":{"v":0,"d":"0.00 €"}}]
[null,"Dont emplois temporaires"]
[null,"Directeur"]
[null,"Médecin directeur"]
[null,"Directeur-adjoint"]
[null,"Chef de service éducatif, pédagogique et social, paramédical"]
[null,"Chef de service autre (administratif, etc.)"]
[null,"Chef d'atelier"]
[null,"Attaché de direction, économe"]
[null,"Cadre de santé de la filière infirmière"]
[null,"Cadre de service paramédical, cadre de la filière de rééducation, autre cadre de santé"]
[null,"Cadre de service éducatif et social"]
[null,"Responsable et coordonnateur de secteur"]
[null,"Autres cadres (direction)"]
[null,"Autres cadres (encadrement de proximité)"]
[null,"ADMINISTRATION / GESTION",null,{"$f":"SUM(D131:D133)","v":{"v":0,"d":"0.00"}},{"$f":"SUM(E131:E133)","v":{"v":0,"d":"0.00"}},{"$nulls":3},{"$f":"SUM(I131:I133)","v":{"v":0,"d":"0.00 €"}},{"$f":"SUM(J131:J133)","v":{"v":0,"d":"0.00 €"}}]
[null,"Dont emplois temporaires"]
[null,"Agent administratif"]
[null,"Comptable"]
[null,"Autre personnel administratif et de gestion"]
[null,"SERVICES GENERAUX",null,{"$f":"SUM(D136:D140)","v":{"v":0,"d":"0.00"}},{"$f":"SUM(E136:E140)","v":{"v":0,"d":"0.00"}},{"$nulls":3},{"$f":"SUM(I136:I140)","v":{"v":0,"d":"0.00 €"}},{"$f":"SUM(J136:J140)","v":{"v":0,"d":"0.00 €"}}]
[null,"Dont emplois temporaires"]
[null,"Agent de service général"]
[null,"Maître de maison (hors encadrant éducatif de nuit)"]
[null,"Ouvrier qualifié"]
[null,"Veilleur de nuit occupant à titre principal des fonctions d'accompagnement socio-éducatif (hors encadrant éducatif de nuit)"]
[null,"Autre personnel services généraux"]
[null,"RESTAURATION",null,{"$f":"SUM(D143:D145)","v":{"v":0,"d":"0.00"}},{"$f":"SUM(E143:E145)","v":{"v":0,"d":"0.00"}},{"$nulls":3},{"$f":"SUM(I143:I145)","v":{"v":0,"d":"0.00 €"}},{"$f":"SUM(J143:J145)","v":{"v":0,"d":"0.00 €"}}]
[null,"Dont emplois temporaires"]
[null,"Chef cuisinier"]
[null,"Cuisinier"]
[null,"Autre personnel de restauration"]
[null,"ENSEIGNEMENT ET SOCIO-EDUCATIF",null,{"$f":"SUM(D148:D175)","v":{"v":0,"d":"0.00"}},{"$f":"SUM(E148:E175)","v":{"v":0,"d":"0.00"}},{"$nulls":3},{"$f":"SUM(I148:I175)","v":{"v":0,"d":"0.00 €"}},{"$f":"SUM(J148:J175)","v":{"v":0,"d":"0.00 €"}}]
[null,"Dont emplois temporaires"]
[null,"Enseignant (enseignement primaire)"]
[null,"Enseignant (enseignement secondaire)"]
[null,"Enseignant (enseignement supérieur)"]
[null,"Professeur EPS"]
[null,"Moniteur EPS"]
[null,"Accompagnant éducatif et social"]
[null,"Aide médico-psychologique"]
[null,"Animateur social"]
[null,"Assistant de service social/assistant social spécialisé"]
[null,"Assistant maternel"]
[null,"Auxiliaire de vie sociale"]
[null,"Conseiller en économie sociale et familiale"]
[null,"Educateur jeunes enfants"]
[null,"Educateur technique ou spécialisé"]
[null,"Encadrant éducatif de nuit"]
[null,"Mandataire judiciaire ou délégué aux prestations sociales"]
[null,"Moniteur d'atelier"]
[null,"Moniteur éducateur"]
[null,"Moniteur enseignement ménager"]
[null,"Moniteur jardin d'enfants"]
[null,"Personnel d'aide à domicile"]
[null,"Psychologue/neuropsychologue"]
[null,"Responsable ou encadrant technique d'atelier"]
[null,"Technicien de l'intervention sociale et familiale"]
[null,"Technicien en compensation sensorielle"]
[null,"Travailleur familial"]
[null,"Autre personnel socio-éducatif"]
[null,"Personnel socio-éducatif en cours de formation"]
[null,"PARAMEDICAL",null,{"$f":"SUM(D178:D193)","v":{"v":0,"d":"0.00"}},{"$f":"SUM(E178:E193)","v":{"v":0,"d":"0.00"}},{"$nulls":3},{"$f":"SUM(I178:I193)","v":{"v":0,"d":"0.00 €"}},{"$f":"SUM(J178:J193)","v":{"v":0,"d":"0.00 €"}}]
[null,"Dont emplois temporaires"]
[null,"Aide soignant"]
[null,"Audioprothésiste"]
[null,"Diététicien"]
[null,"Ergothérapeute"]
[null,"Infirmier D.E."]
[null,"Infirmier psychiatrique"]
[null,"Masseur-kinésithérapeute"]
[null,"Orthophoniste"]
[null,"Orthoptiste"]
[null,"Pédicure-podologue"]
[null,"Personnel médicotechnique de la rééducation"]
[null,"Psychomotricien"]
[null,"Puériculteur"]
[null,"Sage-femme"]
[null,"Autre personnel paramédical"]
[null,"Personnel paramédical en formation"]
[null,"MEDICAL",null,{"$f":"SUM(D196:D202)","v":{"v":0,"d":"0.00"}},{"$f":"SUM(E196:E202)","v":{"v":0,"d":"0.00"}},{"$nulls":3},{"$f":"SUM(I196:I202)","v":{"v":0,"d":"0.00 €"}},{"$f":"SUM(J196:J202)","v":{"v":0,"d":"0.00 €"}}]
[null,"Dont emplois temporaires"]
[null,"Médecin pédiatre"]
[null,"Médecin psychiatre"]
[null,"Médecin rééducation fonctionnelle"]
[null,"Médecin autre spécialité"]
[null,"Médecin généraliste"]
[null,"Pharmacien"]
[null,"Autre"]
[null,"AUTRES FONCTIONS",null,{"$f":"SUM(D205:D206)","v":{"v":0,"d":"0.00"}},{"$f":"SUM(E205:E206)","v":{"v":0,"d":"0.00"}},{"$nulls":3},{"$f":"SUM(I205:I206)","v":{"v":0,"d":"0.00 €"}},{"$f":"SUM(J205:J206)","v":{"v":0,"d":"0.00 €"}}]
[null,"Dont emplois temporaires"]
[]
[]
[null,"TOTAL Personnel extérieur",null,{"$f":"D114+D129+D134+D141+D146+D176+D194+D203","v":{"v":0,"d":"0.00"}},{"$f":"E114+E129+E134+E141+E146+E176+E194+E203","v":{"v":0,"d":"0.00"}},{"$nulls":3},{"$f":"I114+I129+I134+I141+I146+I176+I194+I203","v":{"v":0,"d":"0.00 €"}},{"$f":"J114+J129+J134+J141+J146+J176+J194+J203","v":{"v":0,"d":"0.00 €"}}]

{"sheet":"TPER FAM-SAMSAH_SF","index":13,"n_rows":207,"n_cols":13,"rows_kept":207,"hidden":true,"merged":[[1,3,1,5],[2,3,2,5],[3,3,3,5],[5,1,5,12],[8,1,9,1],[8,3,8,6],[8,7,8,9],[8,10,8,12],[111,5,111,7],[111,8,111,9],[113,5,113,7],[113,8,113,9],[114,5,114,7],[114,8,114,9],[115,5,115,7],[115,8,115,9],[116,5,116,7],[116,8,116,9],[117,5,117,7],[117,8,117,9],[118,5,118,7],[118,8,118,9],[119,5,119,7],[119,8,119,9],[120,5,120,7],[120,8,120,9],[121,5,121,7],[121,8,121,9],[122,5,122,7],[122,8,122,9],[123,5,123,7],[123,8,123,9],[124,5,124,7],[124,8,124,9],[125,5,125,7],[125,8,125,9],[126,5,126,7],[126,8,126,9],[127,5,127,7],[127,8,127,9],[128,5,128,7],[128,8,128,9],[129,5,129,7],[129,8,129,9],[130,5,130,7],[130,8,130,9],[131,5,131,7],[131,8,131,9],[132,5,132,7],[132,8,132,9],[133,5,133,7],[133,8,133,9],[134,5,134,7],[134,8,134,9],[135,5,135,7],[135,8,135,9],[136,5,136,7],[136,8,136,9],[137,5,137,7],[137,8,137,9],[138,5,138,7],[138,8,138,9],[139,5,139,7],[139,8,139,9],[140,5,140,7],[140,8,140,9],[141,5,141,7],[141,8,141,9],[142,5,142,7],[142,8,142,9],[143,5,143,7],[143,8,143,9],[144,5,144,7],[144,8,144,9],[145,5,145,7],[145,8,145,9],[146,5,146,7],[146,8,146,9],[147,5,147,7],[147,8,147,9],[148,5,148,7],[148,8,148,9],[149,5,149,7],[149,8,149,9],[150,5,150,7],[150,8,150,9],[151,5,151,7],[151,8,151,9],[152,5,152,7],[152,8,152,9],[153,5,153,7],[153,8,153,9],[154,5,154,7],[154,8,154,9],[155,5,155,7],[155,8,155,9],[156,5,156,7],[156,8,156,9],[157,5,157,7],[157,8,157,9],[158,5,158,7],[158,8,158,9],[159,5,159,7],[159,8,159,9],[160,5,160,7],[160,8,160,9],[161,5,161,7],[161,8,161,9],[162,5,162,7],[162,8,162,9],[163,5,163,7],[163,8,163,9],[164,5,164,7],[164,8,164,9],[165,5,165,7],[165,8,165,9],[166,5,166,7],[166,8,166,9],[167,5,167,7],[167,8,167,9],[168,5,168,7],[168,8,168,9],[169,5,169,7],[169,8,169,9],[170,5,170,7],[170,8,170,9],[171,5,171,7],[171,8,171,9],[172,5,172,7],[172,8,172,9],[173,5,173,7],[173,8,173,9],[174,5,174,7],[174,8,174,9],[175,5,175,7],[175,8,175,9],[176,5,176,7],[176,8,176,9],[177,5,177,7],[177,8,177,9],[178,5,178,7],[178,8,178,9],[179,5,179,7],[179,8,179,9],[180,5,180,7],[180,8,180,9],[181,5,181,7],[181,8,181,9],[182,5,182,7],[182,8,182,9],[183,5,183,7],[183,8,183,9],[184,5,184,7],[184,8,184,9],[185,5,185,7],[185,8,185,9],[186,5,186,7],[186,8,186,9],[187,5,187,7],[187,8,187,9],[188,5,188,7],[188,8,188,9],[189,5,189,7],[189,8,189,9],[190,5,190,7],[190,8,190,9],[191,5,191,7],[191,8,191,9],[192,5,192,7],[192,8,192,9],[193,5,193,7],[193,8,193,9],[194,5,194,7],[194,8,194,9],[195,5,195,7],[195,8,195,9],[196,5,196,7],[196,8,196,9],[197,5,197,7],[197,8,197,9],[198,5,198,7],[198,8,198,9],[199,5,199,7],[199,8,199,9],[200,5,200,7],[200,8,200,9],[201,5,201,7],[201,8,201,9],[202,5,202,7],[202,8,202,9],[203,5,203,7],[203,8,203,9],[204,5,204,7],[204,8,204,9],[205,5,205,7],[205,8,205,9],[206,5,206,7],[206,8,206,9]]}
[]
[null,"Dénomination du CRP sans Finess :"]
[null,"N° Identifiant : "]
[null,"FINESS de rattachement :"]
[]
[null,"Annexe 6B : Tableau prévisionnel des effectifs rémunérés (y compris personnel de remplacement) applicable aux établissements et services cofinancés (FAM, SAMSAH, etc.)"]
[]
[]
[null,"Catégorie / emplois",null,"Tableau des effectifs global",{"$nulls":3},"Dont effectifs émargeant sur le forfait soins",null,null,"Rémunérations brutes + charges sociales et fiscales"]
[{"$nulls":3},{"$f":"IF('Page de garde'!$D$4=\"\",\"ETP (année N) (1)\",\"ETP (année \"&'Page de garde'!$D$4&\") (1)\")","v":"ETP (année N) (1)"},{"$f":"IF('Page de garde'!$D$4=\"\",\"Nbre d'agents (prévu N)\",\"Nbre d'agents (prévu \"&'Page de garde'!$D$4&\")\")","v":"Nbre d'agents (prévu N)"},{"$f":"IF('Page de garde'!$D$4=\"\",\"ETP \n(année N-1) (*) (2)\",\"ETP (année \"&'Page de garde'!$D$4-1&\") (*) (2)\")","v":"ETP \n(année N-1) (*) (2)"},"Ecart: (1)-(2)",{"$f":"IF('Page de garde'!$D$4=\"\",\"ETP (année N) (1)\",\"ETP (année \"&'Page de garde'!$D$4&\") (1)\")","v":"ETP (année N) (1)"},{"$f":"IF('Page de garde'!$D$4=\"\",\"ETP \n(année N-1) (*) (2)\",\"ETP (année \"&'Page de garde'!$D$4-1&\") (*) (2)\")","v":"ETP \n(année N-1) (*) (2)"},"Ecart: (1)-(2)",{"$f":"IF('Page de garde'!$D$4=\"\",\"Année N \n(3)\",\"Année \"&'Page de garde'!$D$4&\" (3)\")","v":"Année N \n(3)"},{"$f":"IF('Page de garde'!$D$4=\"\",\"Année N-1 \n(4)\",\"Année \"&'Page de garde'!$D$4-1&\" (4)\")","v":"Année N-1 \n(4)"},"Ecart: (3)-(4)"]
[]
[null,"DIRECTION / ENCADREMENT",null,{"$f":"SUM(D14:D26)","v":{"v":0,"d":"0.00"}},{"$f":"SUM(E14:E26)","v":0},{"$f":"SUM(F14:F26)","v":{"v":0,"d":"0.00"}},{"$f":"D12-F12","v":{"v":0,"d":"0.00"}},{"$f":"SUM(H14:H26)","v":{"v":0,"d":"0.00"}},{"$f":"SUM(I14:I26)","v":{"v":0,"d":"0.00"}},{"$f":"H12-I12","v":{"v":0,"d":"0.00"}},{"$f":"SUM(K14:K26)","v":{"v":0,"d":"0.00 €"}},{"$f":"SUM(L14:L26)","v":{"v":0,"d":"0.00 €"}},{"$f":"K12-L12","v":{"v":0,"d":"0.00 €"}}]
[null,"Dont emplois temporaires",{"$nulls":4},{"v":0,"d":"0.00"},null,null,{"v":0,"d":"0.00"},null,null,{"v":0,"d":"0.00 €"}]
[null,"Directeur",{"$nulls":4},{"v":0,"d":"0.00"},null,null,{"v":0,"d":"0.00"},null,null,{"v":0,"d":"0.00 €"}]
[null,"Médecin directeur",{"$nulls":4},{"v":0,"d":"0.00"},null,null,{"v":0,"d":"0.00"},null,null,{"v":0,"d":"0.00 €"}]
[null,"Directeur-adjoint",{"$nulls":4},{"v":0,"d":"0.00"},null,null,{"v":0,"d":"0.00"},null,null,{"v":0,"d":"0.00 €"}]
[null,"Chef de service éducatif, pédagogique et social, paramédical",{"$nulls":4},{"v":0,"d":"0.00"},null,null,{"v":0,"d":"0.00"},null,null,{"v":0,"d":"0.00 €"}]
[null,"Chef de service autre (administratif, etc.)",{"$nulls":4},{"v":0,"d":"0.00"},null,null,{"v":0,"d":"0.00"},null,null,{"v":0,"d":"0.00 €"}]
[null,"Chef d'atelier",{"$nulls":4},{"v":0,"d":"0.00"},null,null,{"v":0,"d":"0.00"},null,null,{"v":0,"d":"0.00 €"}]
[null,"Attaché de direction, économe",{"$nulls":4},{"v":0,"d":"0.00"},null,null,{"v":0,"d":"0.00"},null,null,{"v":0,"d":"0.00 €"}]
[null,"Cadre de santé de la filière infirmière",{"$nulls":4},{"v":0,"d":"0.00"},null,null,{"v":0,"d":"0.00"},null,null,{"v":0,"d":"0.00 €"}]
[null,"Cadre de service paramédical, cadre de la filière de rééducation, autre cadre de santé",{"$nulls":4},{"v":0,"d":"0.00"},null,null,{"v":0,"d":"0.00"},null,null,{"v":0,"d":"0.00 €"}]
[null,"Cadre de service éducatif et social",{"$nulls":4},{"v":0,"d":"0.00"},null,null,{"v":0,"d":"0.00"},null,null,{"v":0,"d":"0.00 €"}]
[null,"Responsable et coordonnateur de secteur",{"$nulls":4},{"v":0,"d":"0.00"},null,null,{"v":0,"d":"0.00"},null,null,{"v":0,"d":"0.00 €"}]
[null,"Autres cadres (direction)",{"$nulls":4},{"v":0,"d":"0.00"},null,null,{"v":0,"d":"0.00"},null,null,{"v":0,"d":"0.00 €"}]
[null,"Autres cadres (encadrement de proximité)",{"$nulls":4},{"v":0,"d":"0.00"},null,null,{"v":0,"d":"0.00"},null,null,{"v":0,"d":"0.00 €"}]
[null,"ADMINISTRATION / GESTION",null,{"$f":"SUM(D29:D31)","v":{"v":0,"d":"0.00"}},{"$f":"SUM(E29:E31)","v":0},{"$f":"SUM(F29:F31)","v":{"v":0,"d":"0.00"}},{"v":0,"d":"0.00"},{"$f":"SUM(H29:H31)","v":{"v":0,"d":"0.00"}},{"$f":"SUM(I29:I31)","v":{"v":0,"d":"0.00"}},{"v":0,"d":"0.00"},{"$f":"SUM(K29:K31)","v":{"v":0,"d":"0.00 €"}},{"$f":"SUM(L29:L31)","v":{"v":0,"d":"0.00 €"}},{"v":0,"d":"0.00 €"}]
[null,"Dont emplois temporaires",{"$nulls":4},{"v":0,"d":"0.00"},null,null,{"v":0,"d":"0.00"},null,null,{"v":0,"d":"0.00 €"}]
[null,"Agent administratif",{"$nulls":4},{"v":0,"d":"0.00"},null,null,{"v":0,"d":"0.00"},null,null,{"v":0,"d":"0.00 €"}]
[null,"Comptable",{"$nulls":4},{"v":0,"d":"0.00"},null,null,{"v":0,"d":"0.00"},null,null,{"v":0,"d":"0.00 €"}]
[null,"Autre personnel administratif et de gestion",{"$nulls":4},{"v":0,"d":"0.00"},null,null,{"v":0,"d":"0.00"},null,null,{"v":0,"d":"0.00 €"}]
[null,"SERVICES GENERAUX",null,{"$f":"SUM(D34:D38)","v":{"v":0,"d":"0.00"}},{"$f":"SUM(E34:E38)","v":0},{"$f":"SUM(F34:F38)","v":{"v":0,"d":"0.00"}},{"v":0,"d":"0.00"},{"$f":"SUM(H34:H38)","v":{"v":0,"d":"0.00"}},{"$f":"SUM(I34:I38)","v":{"v":0,"d":"0.00"}},{"v":0,"d":"0.00"},{"$f":"SUM(K34:K38)","v":{"v":0,"d":"0.00 €"}},{"$f":"SUM(L34:L38)","v":{"v":0,"d":"0.00 €"}},{"v":0,"d":"0.00 €"}]
[null,"Dont emplois temporaires",{"$nulls":4},{"v":0,"d":"0.00"},null,null,{"v":0,"d":"0.00"},null,null,{"v":0,"d":"0.00 €"}]
[null,"Agent de service général",{"$nulls":4},{"v":0,"d":"0.00"},null,null,{"v":0,"d":"0.00"},null,null,{"v":0,"d":"0.00 €"}]
[null,"Maitre de maison (hors encadrant éducatif de nuit)",{"$nulls":4},{"v":0,"d":"0.00"},null,null,{"v":0,"d":"0.00"},null,null,{"v":0,"d":"0.00 €"}]
[null,"Ouvrier qualifié",{"$nulls":4},{"v":0,"d":"0.00"},null,null,{"v":0,"d":"0.00"},null,null,{"v":0,"d":"0.00 €"}]
[null,"Veilleur de nuit occupant à titre principal des fonctions d'accompagnement socio-éducatif (hors encadrant éducatif de nuit)",{"$nulls":4},{"v":0,"d":"0.00"},null,null,{"v":0,"d":"0.00"},null,null,{"v":0,"d":"0.00 €"}]
[null,"Autre personnel services généraux",{"$nulls":4},{"v":0,"d":"0.00"},null,null,{"v":0,"d":"0.00"},null,null,{"v":0,"d":"0.00 €"}]
[null,"RESTAURATION",null,{"$f":"SUM(D41:D43)","v":{"v":0,"d":"0.00"}},{"$f":"SUM(E41:E43)","v":0},{"$f":"SUM(F41:F43)","v":{"v":0,"d":"0.00"}},{"v":0,"d":"0.00"},{"$f":"SUM(H41:H43)","v":{"v":0,"d":"0.00"}},{"$f":"SUM(I41:I43)","v":{"v":0,"d":"0.00"}},{"v":0,"d":"0.00"},{"$f":"SUM(K41:K43)","v":{"v":0,"d":"0.00 €"}},{"$f":"SUM(L41:L43)","v":{"v":0,"d":"0.00 €"}},{"v":0,"d":"0.00 €"}]
[null,"Dont emplois temporaires",{"$nulls":4},{"v":0,"d":"0.00"},null,null,{"v":0,"d":"0.00"},null,null,{"v":0,"d":"0.00 €"}]
[null,"Chef cuisinier",{"$nulls":4},{"v":0,"d":"0.00"},null,null,{"v":0,"d":"0.00"},null,null,{"v":0,"d":"0.00 €"}]
[null,"Cuisinier",{"$nulls":4},{"v":0,"d":"0.00"},null,null,{"v":0,"d":"0.00"},null,null,{"v":0,"d":"0.00 €"}]
[null,"Autre personnel de restauration",{"$nulls":4},{"v":0,"d":"0.00"},null,null,{"v":0,"d":"0.00"},null,null,{"v":0,"d":"0.00 €"}]
[null,"ENSEIGNEMENT ET SOCIO-EDUCATIF",null,{"$f":"SUM(D46:D51)+D53+SUM(D55:D75)","v":{"v":0,"d":"0.00"}},{"$f":"SUM(E46:E51)+E53+SUM(E55:E75)","v":0},{"$f":"SUM(F46:F51)+F53+SUM(F55:F75)","v":{"v":0,"d":"0.00"}},{"$f":"D44-F44","v":{"v":0,"d":"0.00"}},{"$f":"SUM(H46:H51)+H53+SUM(H55:H75)","v":{"v":0,"d":"0.00"}},{"$f":"SUM(I46:I51)+I53+SUM(I55:I75)","v":{"v":0,"d":"0.00"}},{"$f":"H44-I44","v":{"v":0,"d":"0.00"}},{"$f":"SUM(K46:K51)+K53+SUM(K55:K75)","v":{"v":0,"d":"0.00 €"}},{"$f":"SUM(L46:L51)+L53+SUM(L55:L75)","v":{"v":0,"d":"0.00 €"}},{"$f":"K44-L44","v":{"v":0,"d":"0.00 €"}}]
[null,"Dont emplois temporaires",{"$nulls":4},{"v":0,"d":"0.00"},null,null,{"v":0,"d":"0.00"},null,null,{"v":0,"d":"0.00 €"}]
[null,"Enseignant (enseignement primaire)",{"$nulls":4},{"v":0,"d":"0.00"},null,null,{"v":0,"d":"0.00"},null,null,{"v":0,"d":"0.00 €"}]
[null,"Enseignant (enseignement secondaire)",{"$nulls":4},{"v":0,"d":"0.00"},null,null,{"v":0,"d":"0.00"},null,null,{"v":0,"d":"0.00 €"}]
[null,"Enseignant (enseignement supérieur)",{"$nulls":4},{"v":0,"d":"0.00"},null,null,{"v":0,"d":"0.00"},null,null,{"v":0,"d":"0.00 €"}]
[null,"Professeur EPS",{"$nulls":4},{"v":0,"d":"0.00"},null,null,{"v":0,"d":"0.00"},null,null,{"v":0,"d":"0.00 €"}]
[null,"Moniteur EPS",{"$nulls":4},{"v":0,"d":"0.00"},null,null,{"v":0,"d":"0.00"},null,null,{"v":0,"d":"0.00 €"}]
[null,"Accompagnant éducatif et social",{"$nulls":4},{"v":0,"d":"0.00"},null,null,{"v":0,"d":"0.00"},null,null,{"v":0,"d":"0.00 €"}]
[null,"Dont contrats aidés, contrats d'apprentissage et de professionnalisation",{"$nulls":4},{"v":0,"d":"0.00"},null,null,{"v":0,"d":"0.00"},null,null,{"v":0,"d":"0.00 €"}]
[null,"Aide médico-psychologique",{"$nulls":4},{"v":0,"d":"0.00"},null,null,{"v":0,"d":"0.00"},null,null,{"v":0,"d":"0.00 €"}]
[null,"Dont contrats aidés, contrats d'apprentissage et de professionnalisation",{"$nulls":4},{"v":0,"d":"0.00"},null,null,{"v":0,"d":"0.00"},null,null,{"v":0,"d":"0.00 €"}]
[null,"Animateur social",{"$nulls":4},{"v":0,"d":"0.00"},null,null,{"v":0,"d":"0.00"},null,null,{"v":0,"d":"0.00 €"}]
[null,"Assistant de service social/assistant social spécialisé",{"$nulls":4},{"v":0,"d":"0.00"},null,null,{"v":0,"d":"0.00"},null,null,{"v":0,"d":"0.00 €"}]
[null,"Assistant maternel",{"$nulls":4},{"v":0,"d":"0.00"},null,null,{"v":0,"d":"0.00"},null,null,{"v":0,"d":"0.00 €"}]
[null,"Auxiliaire de vie sociale",{"$nulls":4},{"v":0,"d":"0.00"},null,null,{"v":0,"d":"0.00"},null,null,{"v":0,"d":"0.00 €"}]
[null,"Conseiller en économie sociale et familiale",{"$nulls":4},{"v":0,"d":"0.00"},null,null,{"v":0,"d":"0.00"},null,null,{"v":0,"d":"0.00 €"}]
[null,"Educateur jeunes enfants",{"$nulls":4},{"v":0,"d":"0.00"},null,null,{"v":0,"d":"0.00"},null,null,{"v":0,"d":"0.00 €"}]
[null,"Educateur technique ou spécialisé",{"$nulls":4},{"v":0,"d":"0.00"},null,null,{"v":0,"d":"0.00"},null,null,{"v":0,"d":"0.00 €"}]
[null,"Encadrant éducatif de nuit",{"$nulls":4},{"v":0,"d":"0.00"},null,null,{"v":0,"d":"0.00"},null,null,{"v":0,"d":"0.00 €"}]
[null,"Mandataire judiciaire ou délégué aux prestations sociales",{"$nulls":4},{"v":0,"d":"0.00"},null,null,{"v":0,"d":"0.00"},null,null,{"v":0,"d":"0.00 €"}]
[null,"Moniteur d'atelier",{"$nulls":4},{"v":0,"d":"0.00"},null,null,{"v":0,"d":"0.00"},null,null,{"v":0,"d":"0.00 €"}]
[null,"Moniteur éducateur",{"$nulls":4},{"v":0,"d":"0.00"},null,null,{"v":0,"d":"0.00"},null,null,{"v":0,"d":"0.00 €"}]
[null,"Moniteur enseignement ménager",{"$nulls":4},{"v":0,"d":"0.00"},null,null,{"v":0,"d":"0.00"},null,null,{"v":0,"d":"0.00 €"}]
[null,"Moniteur jardin d'enfants",{"$nulls":4},{"v":0,"d":"0.00"},null,null,{"v":0,"d":"0.00"},null,null,{"v":0,"d":"0.00 €"}]
[null,"Personnel d'aide à domicile",{"$nulls":4},{"v":0,"d":"0.00"},null,null,{"v":0,"d":"0.00"},null,null,{"v":0,"d":"0.00 €"}]
[null,"Psychologue/neuropsychologue",{"$nulls":4},{"v":0,"d":"0.00"},null,null,{"v":0,"d":"0.00"},null,null,{"v":0,"d":"0.00 €"}]
[null,"Responsable ou encadrant technique d'atelier",{"$nulls":4},{"v":0,"d":"0.00"},null,null,{"v":0,"d":"0.00"},null,null,{"v":0,"d":"0.00 €"}]
[null,"Technicien de l'intervention sociale et familiale",{"$nulls":4},{"v":0,"d":"0.00"},null,null,{"v":0,"d":"0.00"},null,null,{"v":0,"d":"0.00 €"}]
[null,"Technicien en compensation sensorielle",{"$nulls":4},{"v":0,"d":"0.00"},null,null,{"v":0,"d":"0.00"},null,null,{"v":0,"d":"0.00 €"}]
[null,"Travailleur familial",{"$nulls":4},{"v":0,"d":"0.00"},null,null,{"v":0,"d":"0.00"},null,null,{"v":0,"d":"0.00 €"}]
[null,"Autre personnel socio-éducatif",{"$nulls":4},{"v":0,"d":"0.00"},null,null,{"v":0,"d":"0.00"},null,null,{"v":0,"d":"0.00 €"}]
[null,"Personnel socio-éducatif en cours de formation",{"$nulls":4},{"v":0,"d":"0.00"},null,null,{"v":0,"d":"0.00"},null,null,{"v":0,"d":"0.00 €"}]
[null,"PARAMEDICAL",null,{"$f":"SUM(D79:D94)","v":{"v":0,"d":"0.00"}},{"$f":"SUM(E79:E94)","v":0},{"$f":"SUM(F79:F94)","v":{"v":0,"d":"0.00"}},{"$f":"D76-F76","v":{"v":0,"d":"0.00"}},{"$f":"SUM(H79:H94)","v":{"v":0,"d":"0.00"}},{"$f":"SUM(I79:I94)","v":{"v":0,"d":"0.00"}},{"$f":"H76-I76","v":{"v":0,"d":"0.00"}},{"$f":"SUM(K79:K94)","v":{"v":0,"d":"0.00 €"}},{"$f":"SUM(L79:L94)","v":{"v":0,"d":"0.00 €"}},{"$f":"K76-L76","v":{"v":0,"d":"0.00 €"}}]
[null,"Dont emplois temporaires",{"$nulls":4},{"v":0,"d":"0.00"},null,null,{"v":0,"d":"0.00"},null,null,{"v":0,"d":"0.00 €"}]
[null,"Dont contrats aidés, contrats d'apprentissage et de professionnalisation",{"$nulls":4},{"v":0,"d":"0.00"},null,null,{"v":0,"d":"0.00"},null,null,{"v":0,"d":"0.00 €"}]
[null,"Aide soignant",{"$nulls":4},{"v":0,"d":"0.00"},null,null,{"v":0,"d":"0.00"},null,null,{"v":0,"d":"0.00 €"}]
[null,"Audioprothésiste",{"$nulls":4},{"v":0,"d":"0.00"},null,null,{"v":0,"d":"0.00"},null,null,{"v":0,"d":"0.00 €"}]
[null,"Diététicien",{"$nulls":4},{"v":0,"d":"0.00"},null,null,{"v":0,"d":"0.00"},null,null,{"v":0,"d":"0.00 €"}]
[null,"Ergothérapeute",{"$nulls":4},{"v":0,"d":"0.00"},null,null,{"v":0,"d":"0.00"},null,null,{"v":0,"d":"0.00 €"}]
[null,"Infirmier D.E.",{"$nulls":4},{"v":0,"d":"0.00"},null,null,{"v":0,"d":"0.00"},null,null,{"v":0,"d":"0.00 €"}]
[null,"Infirmier psychiatrique",{"$nulls":4},{"v":0,"d":"0.00"},null,null,{"v":0,"d":"0.00"},null,null,{"v":0,"d":"0.00 €"}]
[null,"Masseur-kinésithérapeute",{"$nulls":4},{"v":0,"d":"0.00"},null,null,{"v":0,"d":"0.00"},null,null,{"v":0,"d":"0.00 €"}]
[null,"Orthophoniste",{"$nulls":4},{"v":0,"d":"0.00"},null,null,{"v":0,"d":"0.00"},null,null,{"v":0,"d":"0.00 €"}]
[null,"Orthoptiste",{"$nulls":4},{"v":0,"d":"0.00"},null,null,{"v":0,"d":"0.00"},null,null,{"v":0,"d":"0.00 €"}]
[null,"Pédicure-podologue",{"$nulls":4},{"v":0,"d":"0.00"},null,null,{"v":0,"d":"0.00"},null,null,{"v":0,"d":"0.00 €"}]
[null,"Personnel médicotechnique de la rééducation",{"$nulls":4},{"v":0,"d":"0.00"},null,null,{"v":0,"d":"0.00"},null,null,{"v":0,"d":"0.00 €"}]
[null,"Psychomotricien",{"$nulls":4},{"v":0,"d":"0.00"},null,null,{"v":0,"d":"0.00"},null,null,{"v":0,"d":"0.00 €"}]
[null,"Puériculteur",{"$nulls":4},{"v":0,"d":"0.00"},null,null,{"v":0,"d":"0.00"},null,null,{"v":0,"d":"0.00 €"}]
[null,"Sage-femme",{"$nulls":4},{"v":0,"d":"0.00"},null,null,{"v":0,"d":"0.00"},null,null,{"v":0,"d":"0.00 €"}]
[null,"Autre personnel paramédical",{"$nulls":4},{"v":0,"d":"0.00"},null,null,{"v":0,"d":"0.00"},null,null,{"v":0,"d":"0.00 €"}]
[null,"Personnel paramédical en formation",{"$nulls":4},{"v":0,"d":"0.00"},null,null,{"v":0,"d":"0.00"},null,null,{"v":0,"d":"0.00 €"}]
[null,"MEDICAL",null,{"$f":"SUM(D97:D103)","v":{"v":0,"d":"0.00"}},{"$f":"SUM(E97:E103)","v":0},{"$f":"SUM(F97:F103)","v":{"v":0,"d":"0.00"}},{"v":0,"d":"0.00"},{"$f":"SUM(H97:H103)","v":{"v":0,"d":"0.00"}},{"$f":"SUM(I97:I103)","v":{"v":0,"d":"0.00"}},{"v":0,"d":"0.00"},{"$f":"SUM(K97:K103)","v":{"v":0,"d":"0.00 €"}},{"$f":"SUM(L97:L103)","v":{"v":0,"d":"0.00 €"}},{"v":0,"d":"0.00 €"}]
[null,"Dont emplois temporaires",{"$nulls":4},{"v":0,"d":"0.00"},null,null,{"v":0,"d":"0.00"},null,null,{"v":0,"d":"0.00 €"}]
[null,"Médecin pédiatre",{"$nulls":4},{"v":0,"d":"0.00"},null,null,{"v":0,"d":"0.00"},null,null,{"v":0,"d":"0.00 €"}]
[null,"Médecin psychiatre",{"$nulls":4},{"v":0,"d":"0.00"},null,null,{"v":0,"d":"0.00"},null,null,{"v":0,"d":"0.00 €"}]
[null,"Médecin rééducation fonctionnelle",{"$nulls":4},{"v":0,"d":"0.00"},null,null,{"v":0,"d":"0.00"},null,null,{"v":0,"d":"0.00 €"}]
[null,"Médecin autre spécialité",{"$nulls":4},{"v":0,"d":"0.00"},null,null,{"v":0,"d":"0.00"},null,null,{"v":0,"d":"0.00 €"}]
[null,"Médecin généraliste",{"$nulls":4},{"v":0,"d":"0.00"},null,null,{"v":0,"d":"0.00"},null,null,{"v":0,"d":"0.00 €"}]
[null,"Pharmacien",{"$nulls":4},{"v":0,"d":"0.00"},null,null,{"v":0,"d":"0.00"},null,null,{"v":0,"d":"0.00 €"}]
[null,"Autre",{"$nulls":4},{"v":0,"d":"0.00"},null,null,{"v":0,"d":"0.00"},null,null,{"v":0,"d":"0.00 €"}]
[null,"AUTRES FONCTIONS",null,{"$f":"SUM(D106:D107)","v":{"v":0,"d":"0.00"}},{"$f":"SUM(E106:E107)","v":0},{"$f":"SUM(F106:F107)","v":{"v":0,"d":"0.00"}},{"v":0,"d":"0.00"},{"$f":"SUM(H106:H107)","v":{"v":0,"d":"0.00"}},{"$f":"SUM(I106:I107)","v":{"v":0,"d":"0.00"}},{"v":0,"d":"0.00"},{"$f":"SUM(K106:K107)","v":{"v":0,"d":"0.00 €"}},{"$f":"SUM(L106:L107)","v":{"v":0,"d":"0.00 €"}},{"v":0,"d":"0.00 €"}]
[null,"Dont emplois temporaires",{"$nulls":4},{"v":0,"d":"0.00"},null,null,{"v":0,"d":"0.00"},null,null,{"v":0,"d":"0.00 €"}]
[{"$nulls":6},{"v":0,"d":"0.00"},null,null,{"v":0,"d":"0.00"},null,null,{"v":0,"d":"0.00 €"}]
[{"$nulls":6},{"v":0,"d":"0.00"},null,null,{"v":0,"d":"0.00"},null,null,{"v":0,"d":"0.00 €"}]
[null,"TOTAL Personnel salarié",null,{"$f":"D12+D27+D32+D39+D44+D76+D95+D104","v":{"v":0,"d":"0.00"}},{"$f":"E12+E27+E32+E39+E44+E76+E95+E104","v":0},{"$f":"F12+F27+F32+F39+F44+F76+F95+F104","v":{"v":0,"d":"0.00"}},{"$f":"D108-F108","v":{"v":0,"d":"0.00"}},{"$f":"H12+H27+H32+H39+H44+H76+H95+H104","v":{"v":0,"d":"0.00"}},{"$f":"I12+I27+I32+I39+I44+I76+I95+I104","v":{"v":0,"d":"0.00"}},{"$f":"H108-I108","v":{"v":0,"d":"0.00"}},{"$f":"K12+K27+K32+K39+K44+K76+K95+K104","v":{"v":0,"d":"0.00 €"}},{"$f":"L12+L27+L32+L39+L44+L76+L95+L104","v":{"v":0,"d":"0.00 €"}},{"$f":"K108-L108","v":{"v":0,"d":"0.00 €"}}]
[null,"(*): Nombre d'ETP inscrits au précédent tableau des effectifs rémunérés (budget exécutoire)"]
[]
[null,"Services extérieurs (hors audits, experts juridiques, comptables et commissaires aux comptes)"]
[null,"Catégorie / emplois",null,{"$f":"IF('Page de garde'!$D$4=\"\",\"Equivalents temps plein Année N\",\"Equivalents temps plein Année \"&'Page de garde'!$D$4)","v":"Equivalents temps plein Année N"},{"$f":"IF('Page de garde'!$D$4=\"\",\"Equivalents temps plein Année N-1\",\"Equivalents temps plein Année \"&'Page de garde'!$D$4-1)","v":"Equivalents temps plein Année N-1"},"N° de compte d'imputation de la prestation - Libellé du compte",null,null,"Montant de la prestation"]
[]
[null,"DIRECTION / ENCADREMENT",null,{"$f":"SUM(D116:D128)","v":{"v":0,"d":"0.00"}},{"$f":"SUM(E116:E128)","v":{"v":0,"d":"0.00"}},{"$nulls":3},{"$f":"SUM(I116:I128)","v":{"v":0,"d":"0.00 €"}},{"$f":"SUM(J116:J128)","v":{"v":0,"d":"0.00 €"}}]
[null,"Dont emplois temporaires"]
[null,"Directeur"]
[null,"Médecin directeur"]
[null,"Directeur-adjoint"]
[null,"Chef de service éducatif, pédagogique et social, paramédical"]
[null,"Chef de service autre (administratif, etc.)"]
[null,"Chef d'atelier"]
[null,"Attaché de direction, économe"]
[null,"Cadre de santé de la filière infirmière"]
[null,"Cadre de service paramédical, cadre de la filière de rééducation, autre cadre de santé"]
[null,"Cadre de service éducatif et social"]
[null,"Responsable et coordonnateur de secteur"]
[null,"Autres cadres (direction)"]
[null,"Autres cadres (encadrement de proximité)"]
[null,"ADMINISTRATION / GESTION",null,{"$f":"SUM(D131:D133)","v":{"v":0,"d":"0.00"}},{"$f":"SUM(E131:E133)","v":{"v":0,"d":"0.00"}},{"$nulls":3},{"$f":"SUM(I131:I133)","v":{"v":0,"d":"0.00 €"}},{"$f":"SUM(J131:J133)","v":{"v":0,"d":"0.00 €"}}]
[null,"Dont emplois temporaires"]
[null,"Agent administratif"]
[null,"Comptable"]
[null,"Autre personnel administratif et de gestion"]
[null,"SERVICES GENERAUX",null,{"$f":"SUM(D136:D140)","v":{"v":0,"d":"0.00"}},{"$f":"SUM(E136:E140)","v":{"v":0,"d":"0.00"}},{"$nulls":3},{"$f":"SUM(I136:I140)","v":{"v":0,"d":"0.00 €"}},{"$f":"SUM(J136:J140)","v":{"v":0,"d":"0.00 €"}}]
[null,"Dont emplois temporaires"]
[null,"Agent de service général"]
[null,"Maître de maison (hors encadrant éducatif de nuit)"]
[null,"Ouvrier qualifié"]
[null,"Veilleur de nuit occupant à titre principal des fonctions d'accompagnement socio-éducatif (hors encadrant éducatif de nuit)"]
[null,"Autre personnel services généraux"]
[null,"RESTAURATION",null,{"$f":"SUM(D143:D145)","v":{"v":0,"d":"0.00"}},{"$f":"SUM(E143:E145)","v":{"v":0,"d":"0.00"}},{"$nulls":3},{"$f":"SUM(I143:I145)","v":{"v":0,"d":"0.00 €"}},{"$f":"SUM(J143:J145)","v":{"v":0,"d":"0.00 €"}}]
[null,"Dont emplois temporaires"]
[null,"Chef cuisinier"]
[null,"Cuisinier"]
[null,"Autre personnel de restauration"]
[null,"ENSEIGNEMENT ET SOCIO-EDUCATIF",null,{"$f":"SUM(D148:D175)","v":{"v":0,"d":"0.00"}},{"$f":"SUM(E148:E175)","v":{"v":0,"d":"0.00"}},{"$nulls":3},{"$f":"SUM(I148:I175)","v":{"v":0,"d":"0.00 €"}},{"$f":"SUM(J148:J175)","v":{"v":0,"d":"0.00 €"}}]
[null,"Dont emplois temporaires"]
[null,"Enseignant (enseignement primaire)"]
[null,"Enseignant (enseignement secondaire)"]
[null,"Enseignant (enseignement supérieur)"]
[null,"Professeur EPS"]
[null,"Moniteur EPS"]
[null,"Accompagnant éducatif et social"]
[null,"Aide médico-psychologique"]
[null,"Animateur social"]
[null,"Assistant de service social/assistant social spécialisé"]
[null,"Assistant maternel"]
[null,"Auxiliaire de vie sociale"]
[null,"Conseiller en économie sociale et familiale"]
[null,"Educateur jeunes enfants"]
[null,"Educateur technique ou spécialisé"]
[null,"Encadrant éducatif de nuit"]
[null,"Mandataire judiciaire ou délégué aux prestations sociales"]
[null,"Moniteur d'atelier"]
[null,"Moniteur éducateur"]
[null,"Moniteur enseignement ménager"]
[null,"Moniteur jardin d'enfants"]
[null,"Personnel d'aide à domicile"]
[null,"Psychologue/neuropsychologue"]
[null,"Responsable ou encadrant technique d'atelier"]
[null,"Technicien de l'intervention sociale et familiale"]
[null,"Technicien en compensation sensorielle"]
[null,"Travailleur familial"]
[null,"Autre personnel socio-éducatif"]
[null,"Personnel socio-éducatif en cours de formation"]
[null,"PARAMEDICAL",null,{"$f":"SUM(D178:D193)","v":{"v":0,"d":"0.00"}},{"$f":"SUM(E178:E193)","v":{"v":0,"d":"0.00"}},{"$nulls":3},{"$f":"SUM(I178:I193)","v":{"v":0,"d":"0.00 €"}},{"$f":"SUM(J178:J193)","v":{"v":0,"d":"0.00 €"}}]
[null,"Dont emplois temporaires"]
[null,"Aide soignant"]
[null,"Audioprothésiste"]
[null,"Diététicien"]
[null,"Ergothérapeute"]
[null,"Infirmier D.E."]
[null,"Infirmier psychiatrique"]
[null,"Masseur-kinésithérapeute"]
[null,"Orthophoniste"]
[null,"Orthoptiste"]
[null,"Pédicure-podologue"]
[null,"Personnel médicotechnique de la rééducation"]
[null,"Psychomotricien"]
[null,"Puériculteur"]
[null,"Sage-femme"]
[null,"Autre personnel paramédical"]
[null,"Personnel paramédical en formation"]
[null,"MEDICAL",null,{"$f":"SUM(D196:D202)","v":{"v":0,"d":"0.00"}},{"$f":"SUM(E196:E202)","v":{"v":0,"d":"0.00"}},{"$nulls":3},{"$f":"SUM(I196:I202)","v":{"v":0,"d":"0.00 €"}},{"$f":"SUM(J196:J202)","v":{"v":0,"d":"0.00 €"}}]
[null,"Dont emplois temporaires"]
[null,"Médecin pédiatre"]
[null,"Médecin psychiatre"]
[null,"Médecin rééducation fonctionnelle"]
[null,"Médecin autre spécialité"]
[null,"Médecin généraliste"]
[null,"Pharmacien"]
[null,"Autre"]
[null,"AUTRES FONCTIONS",null,{"$f":"SUM(D205:D206)","v":{"v":0,"d":"0.00"}},{"$f":"SUM(E205:E206)","v":{"v":0,"d":"0.00"}},{"$nulls":3},{"$f":"SUM(I205:I206)","v":{"v":0,"d":"0.00 €"}},{"$f":"SUM(J205:J206)","v":{"v":0,"d":"0.00 €"}}]
[null,"Dont emplois temporaires"]
[]
[]
[null,"TOTAL Personnel extérieur",null,{"$f":"D114+D129+D134+D141+D146+D176+D194+D203","v":{"v":0,"d":"0.00"}},{"$f":"E114+E129+E134+E141+E146+E176+E194+E203","v":{"v":0,"d":"0.00"}},{"$nulls":3},{"$f":"I114+I129+I134+I141+I146+I176+I194+I203","v":{"v":0,"d":"0.00 €"}},{"$f":"J114+J129+J134+J141+J146+J176+J194+J203","v":{"v":0,"d":"0.00 €"}}]